[artix-build-failures] [galaxy] Failure: python-jsonrpc-server

jenkins at artixlinux.org jenkins at artixlinux.org
Tue Sep 15 19:22:30 CEST 2020


   Failure

   Build: x86_64/community

   Packages:

   python-jsonrpc-server-0.4.0-1-any.pkg.tar.zst

   author: alium

   email: alium at artixlinux.org

   [1]https://orion.artixlinux.org/job/packagesPython/job/python-jsonrpc-s
   erver/job/master/4/

References

   1. https://orion.artixlinux.org/job/packagesPython/job/python-jsonrpc-server/job/master/4/
-------------- next part --------------
Push event to branch master
Querying the current revision of branch master...
Current revision of branch master is f848c44c8e3a414cc33525460746d02cbd1dfa00
Obtained Jenkinsfile from f848c44c8e3a414cc33525460746d02cbd1dfa00
Running in Durability level: PERFORMANCE_OPTIMIZED
Loading library artix-ci at master
Attempting to resolve master from remote references...
 > git --version # timeout=10
 > git --version # 'git version 2.27.0'
 > git ls-remote -- https://gitea.artixlinux.org/artix/pipeline-libs.git # timeout=10
Found match: refs/heads/master revision 63982f52a13081d21ce5a9e2e2b5a16634730d63
The recommended git tool is: NONE
Warning: CredentialId "jenkins-gotea-token" could not be found.
Cloning the remote Git repository
Cloning with configured refspecs honoured and without tags
Cloning repository https://gitea.artixlinux.org/artix/pipeline-libs.git
 > git init /var/lib/jenkins/workspace/hon_python-jsonrpc-server_master at libs/artix-ci # timeout=10
Fetching upstream changes from https://gitea.artixlinux.org/artix/pipeline-libs.git
 > git --version # timeout=10
 > git --version # 'git version 2.27.0'
 > git fetch --no-tags --force --progress -- https://gitea.artixlinux.org/artix/pipeline-libs.git +refs/heads/master:refs/remotes/origin/master # timeout=10
 > git config remote.origin.url https://gitea.artixlinux.org/artix/pipeline-libs.git # timeout=10
 > git config --add remote.origin.fetch +refs/heads/master:refs/remotes/origin/master # timeout=10
Avoid second fetch
Checking out Revision 63982f52a13081d21ce5a9e2e2b5a16634730d63 (master)
 > git config core.sparsecheckout # timeout=10
 > git checkout -f 63982f52a13081d21ce5a9e2e2b5a16634730d63 # timeout=10
Commit message: "rm obsolete layout bool"
[Gitea] Notifying branch build status: PENDING Build started...
[Gitea] Notified
[Pipeline] Start of Pipeline
[Pipeline] node
Running on Jenkins in /var/lib/jenkins/workspace/hon_python-jsonrpc-server_master
[Pipeline] {
[Pipeline] timestamps
[Pipeline] {
[Pipeline] stage
[Pipeline] { (Prepare)
[Pipeline] catchError
[Pipeline] {
[Pipeline] checkout
[2020-09-15T17:22:09.910Z] The recommended git tool is: NONE
[2020-09-15T17:22:09.910Z] Warning: CredentialId "jenkins-gotea-token" could not be found.
[2020-09-15T17:22:09.910Z] Cloning the remote Git repository
[2020-09-15T17:22:09.910Z] Cloning with configured refspecs honoured and without tags
[2020-09-15T17:22:09.910Z] Cloning repository https://237b7412742b4068af4173944de150f12959f4d3@gitea.artixlinux.org/packagesPython/python-jsonrpc-server.git
[2020-09-15T17:22:09.911Z]  > git init /var/lib/jenkins/workspace/hon_python-jsonrpc-server_master # timeout=10
[2020-09-15T17:22:09.918Z] Fetching upstream changes from https://237b7412742b4068af4173944de150f12959f4d3@gitea.artixlinux.org/packagesPython/python-jsonrpc-server.git
[2020-09-15T17:22:09.918Z]  > git --version # timeout=10
[2020-09-15T17:22:09.921Z]  > git --version # 'git version 2.27.0'
[2020-09-15T17:22:09.921Z]  > git fetch --no-tags --force --progress -- https://237b7412742b4068af4173944de150f12959f4d3@gitea.artixlinux.org/packagesPython/python-jsonrpc-server.git +refs/heads/master:refs/remotes/origin/master # timeout=10
[2020-09-15T17:22:10.051Z]  > git config remote.origin.url https://237b7412742b4068af4173944de150f12959f4d3@gitea.artixlinux.org/packagesPython/python-jsonrpc-server.git # timeout=10
[2020-09-15T17:22:10.056Z]  > git config --add remote.origin.fetch +refs/heads/master:refs/remotes/origin/master # timeout=10
[2020-09-15T17:22:10.061Z] Avoid second fetch
[2020-09-15T17:22:10.061Z] Checking out Revision f848c44c8e3a414cc33525460746d02cbd1dfa00 (master)
[2020-09-15T17:22:10.061Z]  > git config core.sparsecheckout # timeout=10
[2020-09-15T17:22:10.066Z]  > git checkout -f f848c44c8e3a414cc33525460746d02cbd1dfa00 # timeout=10
[2020-09-15T17:22:10.075Z] Commit message: "[trunk] -> [community] 'python-jsonrpc-server-0.4.0-1' add"
[2020-09-15T17:22:10.076Z]  > git rev-list --no-walk 79c2849ac587dbf3e79a9354a12a90dcc1bfe970 # timeout=10
[2020-09-15T17:22:10.088Z] Cleaning workspace
[2020-09-15T17:22:10.088Z]  > git rev-parse --verify HEAD # timeout=10
[2020-09-15T17:22:10.093Z] Resetting working tree
[2020-09-15T17:22:10.093Z]  > git reset --hard # timeout=10
[2020-09-15T17:22:10.099Z]  > git clean -fdx # timeout=10
[2020-09-15T17:22:10.105Z] [Gitea] Notifying branch build status: PENDING Build started...
[2020-09-15T17:22:10.279Z] [Gitea] Notified
[Pipeline] libraryResource
[Pipeline] readYaml
[Pipeline] sh
[2020-09-15T17:22:10.551Z] + git show -s --format=%an f848c44c8e3a414cc33525460746d02cbd1dfa00
[Pipeline] sh
[2020-09-15T17:22:10.808Z] + git show -s --format=%ae f848c44c8e3a414cc33525460746d02cbd1dfa00
[Pipeline] sh
[2020-09-15T17:22:11.065Z] + git show --pretty=format: --name-status f848c44c8e3a414cc33525460746d02cbd1dfa00
[Pipeline] fileExists
[Pipeline] sh
[2020-09-15T17:22:11.336Z] + pkg2yaml -d x86_64/community
[Pipeline] readYaml
[Pipeline] }
[Pipeline] // catchError
[Pipeline] }
[Pipeline] // stage
[Pipeline] stage
[Pipeline] { (Build)
[Pipeline] withCredentials
[2020-09-15T17:22:11.542Z] Masking supported pattern matches of $BUILDBOT_GPGP
[Pipeline] {
[Pipeline] echo
[2020-09-15T17:22:11.577Z] isLibBump: false
[Pipeline] dir
[2020-09-15T17:22:11.586Z] Running in /var/lib/jenkins/workspace/hon_python-jsonrpc-server_master/x86_64/community
[Pipeline] {
[Pipeline] catchError
[Pipeline] {
[Pipeline] sh
[2020-09-15T17:22:11.854Z] + buildpkg -C -d galaxy
[2020-09-15T17:22:15.082Z] :: Synchronizing package databases...
[2020-09-15T17:22:15.082Z]  system is up to date
[2020-09-15T17:22:15.082Z]  world is up to date
[2020-09-15T17:22:15.082Z] downloading galaxy.db...
[2020-09-15T17:22:15.082Z]  extra is up to date
[2020-09-15T17:22:15.082Z]  community is up to date
[2020-09-15T17:22:15.082Z] :: Starting full system upgrade...
[2020-09-15T17:22:15.082Z]  there is nothing to do
[2020-09-15T17:22:15.993Z] ==> Building in chroot for [default] (x86_64)...
[2020-09-15T17:22:16.798Z] ==> Synchronizing chroot copy [/build/buildpkg/default-x86_64/root] -> [jenkins]...done
[2020-09-15T17:22:17.709Z] ==> Making package: python-jsonrpc-server 0.4.0-1 (Tue Sep 15 19:22:17 2020)
[2020-09-15T17:22:17.709Z] ==> Retrieving sources...
[2020-09-15T17:22:17.709Z]   -> Downloading python-jsonrpc-server-0.4.0.tar.gz...
[2020-09-15T17:22:17.709Z]   % Total    % Received % Xferd  Average Speed   Time    Time     Time  Current
[2020-09-15T17:22:17.709Z]                                  Dload  Upload   Total   Spent    Left  Speed
[2020-09-15T17:22:17.960Z] 
  0     0    0     0    0     0      0      0 --:--:-- --:--:-- --:--:--     0
  0     0    0     0    0     0      0      0 --:--:-- --:--:-- --:--:--     0
[2020-09-15T17:22:17.960Z] 
100 26491  100 26491    0     0   300k      0 --:--:-- --:--:-- --:--:--  300k
[2020-09-15T17:22:17.960Z]   -> Found fix-test.patch
[2020-09-15T17:22:17.960Z] ==> Validating source files with sha256sums...
[2020-09-15T17:22:17.960Z]     python-jsonrpc-server-0.4.0.tar.gz ... Passed
[2020-09-15T17:22:17.960Z]     fix-test.patch ... Passed
[2020-09-15T17:22:23.154Z] ==> Making package: python-jsonrpc-server 0.4.0-1 (Tue 15 Sep 2020 05:22:22 PM UTC)
[2020-09-15T17:22:23.154Z] ==> Checking runtime dependencies...
[2020-09-15T17:22:23.154Z] ==> Installing missing dependencies...
[2020-09-15T17:22:23.154Z] resolving dependencies...
[2020-09-15T17:22:23.154Z] looking for conflicting packages...
[2020-09-15T17:22:23.154Z] 
[2020-09-15T17:22:23.154Z] Package (4)           New Version  Net Change  Download Size
[2020-09-15T17:22:23.154Z] 
[2020-09-15T17:22:23.154Z] system/libnsl         1.3.0-1        0.19 MiB               
[2020-09-15T17:22:23.154Z] world/python          3.8.5-2       77.65 MiB               
[2020-09-15T17:22:23.154Z] galaxy/python-future  0.18.2-3       3.69 MiB               
[2020-09-15T17:22:23.154Z] galaxy/python-ujson   3.2.0-1        0.11 MiB       0.04 MiB
[2020-09-15T17:22:23.154Z] 
[2020-09-15T17:22:23.154Z] Total Download Size:    0.04 MiB
[2020-09-15T17:22:23.154Z] Total Installed Size:  81.64 MiB
[2020-09-15T17:22:23.154Z] 
[2020-09-15T17:22:23.154Z] :: Proceed with installation? [Y/n] 
[2020-09-15T17:22:23.154Z] :: Retrieving packages...
[2020-09-15T17:22:23.154Z] downloading python-ujson-3.2.0-1-x86_64.pkg.tar.zst...
[2020-09-15T17:22:23.154Z] checking keyring...
[2020-09-15T17:22:23.154Z] checking package integrity...
[2020-09-15T17:22:23.404Z] loading package files...
[2020-09-15T17:22:23.404Z] checking for file conflicts...
[2020-09-15T17:22:23.404Z] checking available disk space...
[2020-09-15T17:22:23.404Z] :: Processing package changes...
[2020-09-15T17:22:23.404Z] installing libnsl...
[2020-09-15T17:22:23.404Z] installing python...
[2020-09-15T17:22:23.654Z] Optional dependencies for python
[2020-09-15T17:22:23.654Z]     python-setuptools
[2020-09-15T17:22:23.654Z]     python-pip
[2020-09-15T17:22:23.654Z]     sqlite [installed]
[2020-09-15T17:22:23.654Z]     mpdecimal: for decimal
[2020-09-15T17:22:23.654Z]     xz: for lzma [installed]
[2020-09-15T17:22:23.654Z]     tk: for tkinter
[2020-09-15T17:22:23.654Z] installing python-future...
[2020-09-15T17:22:23.654Z] Optional dependencies for python-future
[2020-09-15T17:22:23.654Z]     python-setuptools: futurize and pasteurize scripts
[2020-09-15T17:22:23.654Z] installing python-ujson...
[2020-09-15T17:22:23.905Z] ==> Checking buildtime dependencies...
[2020-09-15T17:22:23.905Z] ==> Installing missing dependencies...
[2020-09-15T17:22:24.155Z] resolving dependencies...
[2020-09-15T17:22:24.155Z] looking for conflicting packages...
[2020-09-15T17:22:24.155Z] 
[2020-09-15T17:22:24.155Z] Package (22)                      New Version  Net Change
[2020-09-15T17:22:24.155Z] 
[2020-09-15T17:22:24.155Z] galaxy/python-apipkg              1.5-3          0.02 MiB
[2020-09-15T17:22:24.155Z] world/python-appdirs              1.4.4-1        0.07 MiB
[2020-09-15T17:22:24.155Z] world/python-attrs                20.2.0-1       0.36 MiB
[2020-09-15T17:22:24.155Z] galaxy/python-coverage            5.2.1-1        1.28 MiB
[2020-09-15T17:22:24.155Z] galaxy/python-importlib-metadata  1.6.1-1        0.19 MiB
[2020-09-15T17:22:24.155Z] galaxy/python-iniconfig           1.0.1-1        0.02 MiB
[2020-09-15T17:22:24.155Z] galaxy/python-more-itertools      8.5.0-1        0.27 MiB
[2020-09-15T17:22:24.155Z] world/python-ordered-set          4.0.2-1        0.06 MiB
[2020-09-15T17:22:24.155Z] world/python-packaging            20.4-1         0.17 MiB
[2020-09-15T17:22:24.155Z] galaxy/python-pbr                 5.5.0-1        0.65 MiB
[2020-09-15T17:22:24.155Z] galaxy/python-pluggy              0.13.1-1       0.12 MiB
[2020-09-15T17:22:24.155Z] galaxy/python-py                  1.9.0-1        0.72 MiB
[2020-09-15T17:22:24.155Z] world/python-pyparsing            2.4.7-1        0.73 MiB
[2020-09-15T17:22:24.155Z] world/python-six                  1.15.0-1       0.09 MiB
[2020-09-15T17:22:24.155Z] galaxy/python-toml                0.10.1-2       0.13 MiB
[2020-09-15T17:22:24.155Z] galaxy/python-zipp                3.1.0-1        0.03 MiB
[2020-09-15T17:22:24.155Z] galaxy/python-mock                3.0.5-3        0.21 MiB
[2020-09-15T17:22:24.155Z] galaxy/python-pyflakes            2.2.0-1        0.87 MiB
[2020-09-15T17:22:24.155Z] galaxy/python-pytest              6.0.2-1        3.00 MiB
[2020-09-15T17:22:24.155Z] galaxy/python-pytest-cov          2.10.1-1       0.11 MiB
[2020-09-15T17:22:24.155Z] galaxy/python-pytest-runner       5.2-1          0.03 MiB
[2020-09-15T17:22:24.155Z] world/python-setuptools           1:50.3.0-1     2.98 MiB
[2020-09-15T17:22:24.155Z] 
[2020-09-15T17:22:24.155Z] Total Installed Size:  12.10 MiB
[2020-09-15T17:22:24.155Z] 
[2020-09-15T17:22:24.155Z] :: Proceed with installation? [Y/n] 
[2020-09-15T17:22:24.155Z] checking keyring...
[2020-09-15T17:22:24.155Z] checking package integrity...
[2020-09-15T17:22:25.066Z] loading package files...
[2020-09-15T17:22:25.317Z] checking for file conflicts...
[2020-09-15T17:22:25.317Z] checking available disk space...
[2020-09-15T17:22:25.317Z] :: Processing package changes...
[2020-09-15T17:22:25.317Z] installing python-appdirs...
[2020-09-15T17:22:25.317Z] installing python-pyparsing...
[2020-09-15T17:22:25.317Z] installing python-six...
[2020-09-15T17:22:25.317Z] installing python-packaging...
[2020-09-15T17:22:25.317Z] installing python-ordered-set...
[2020-09-15T17:22:25.317Z] installing python-setuptools...
[2020-09-15T17:22:25.317Z] installing python-attrs...
[2020-09-15T17:22:25.317Z] installing python-iniconfig...
[2020-09-15T17:22:25.317Z] installing python-more-itertools...
[2020-09-15T17:22:25.317Z] installing python-zipp...
[2020-09-15T17:22:25.317Z] installing python-importlib-metadata...
[2020-09-15T17:22:25.317Z] installing python-pluggy...
[2020-09-15T17:22:25.317Z] installing python-apipkg...
[2020-09-15T17:22:25.317Z] installing python-py...
[2020-09-15T17:22:25.317Z] installing python-toml...
[2020-09-15T17:22:25.317Z] installing python-pytest...
[2020-09-15T17:22:25.317Z] installing python-pytest-runner...
[2020-09-15T17:22:25.317Z] installing python-coverage...
[2020-09-15T17:22:25.317Z] Optional dependencies for python-coverage
[2020-09-15T17:22:25.317Z]     python-toml: for pyproject.toml support [installed]
[2020-09-15T17:22:25.317Z] installing python-pytest-cov...
[2020-09-15T17:22:25.317Z] installing python-pyflakes...
[2020-09-15T17:22:25.317Z] installing python-pbr...
[2020-09-15T17:22:25.317Z] installing python-mock...
[2020-09-15T17:22:25.317Z] ==> Retrieving sources...
[2020-09-15T17:22:25.317Z]   -> Found python-jsonrpc-server-0.4.0.tar.gz
[2020-09-15T17:22:25.317Z]   -> Found fix-test.patch
[2020-09-15T17:22:25.317Z] ==> WARNING: Skipping all source file integrity checks.
[2020-09-15T17:22:25.317Z] ==> Extracting sources...
[2020-09-15T17:22:25.567Z]   -> Extracting python-jsonrpc-server-0.4.0.tar.gz with bsdtar
[2020-09-15T17:22:25.567Z] ==> Starting prepare()...
[2020-09-15T17:22:25.567Z] patching file test/test_streams.py
[2020-09-15T17:22:25.567Z] ==> Starting build()...
[2020-09-15T17:22:25.818Z] running build
[2020-09-15T17:22:25.818Z] running build_py
[2020-09-15T17:22:25.818Z] creating build
[2020-09-15T17:22:25.818Z] creating build/lib
[2020-09-15T17:22:25.818Z] creating build/lib/pyls_jsonrpc
[2020-09-15T17:22:25.818Z] copying pyls_jsonrpc/__init__.py -> build/lib/pyls_jsonrpc
[2020-09-15T17:22:25.818Z] copying pyls_jsonrpc/streams.py -> build/lib/pyls_jsonrpc
[2020-09-15T17:22:25.818Z] copying pyls_jsonrpc/endpoint.py -> build/lib/pyls_jsonrpc
[2020-09-15T17:22:25.818Z] copying pyls_jsonrpc/dispatchers.py -> build/lib/pyls_jsonrpc
[2020-09-15T17:22:25.818Z] copying pyls_jsonrpc/exceptions.py -> build/lib/pyls_jsonrpc
[2020-09-15T17:22:25.818Z] copying pyls_jsonrpc/_version.py -> build/lib/pyls_jsonrpc
[2020-09-15T17:22:25.818Z] UPDATING build/lib/pyls_jsonrpc/_version.py
[2020-09-15T17:22:25.818Z] set build/lib/pyls_jsonrpc/_version.py to '0.4.0'
[2020-09-15T17:22:25.818Z] ==> Starting check()...
[2020-09-15T17:22:26.068Z] ============================= test session starts ==============================
[2020-09-15T17:22:26.068Z] platform linux -- Python 3.8.5, pytest-6.0.2, py-1.9.0, pluggy-0.13.1
[2020-09-15T17:22:26.068Z] rootdir: /build/python-jsonrpc-server/src/python-jsonrpc-server-0.4.0, configfile: setup.cfg, testpaths: test
[2020-09-15T17:22:26.068Z] plugins: cov-2.10.1
[2020-09-15T17:22:26.068Z] collected 27 items
[2020-09-15T17:22:26.068Z] 
[2020-09-15T17:22:26.319Z] test/test_endpoint.py ......................                             [ 81%]
[2020-09-15T17:22:26.319Z] test/test_streams.py ....F                                               [100%]
[2020-09-15T17:22:26.319Z] 
[2020-09-15T17:22:26.319Z] =================================== FAILURES ===================================
[2020-09-15T17:22:26.319Z] ___________________________ test_writer_bad_message ____________________________
[2020-09-15T17:22:26.319Z] 
[2020-09-15T17:22:26.319Z] wfile = <_io.BytesIO object at 0x7fade5d339a0>
[2020-09-15T17:22:26.319Z] writer = <pyls_jsonrpc.streams.JsonRpcStreamWriter object at 0x7fade4aa9370>
[2020-09-15T17:22:26.319Z] 
[2020-09-15T17:22:26.319Z]     def test_writer_bad_message(wfile, writer):
[2020-09-15T17:22:26.319Z]         # A datetime isn't serializable(or poorly serializable),
[2020-09-15T17:22:26.319Z]         # ensure the write method doesn't throw, but the result could be empty
[2020-09-15T17:22:26.319Z]         # or the correct datetime
[2020-09-15T17:22:26.319Z]         datetime.datetime = JsonDatetime
[2020-09-15T17:22:26.319Z]         writer.write(datetime.datetime(
[2020-09-15T17:22:26.319Z]             year=2019,
[2020-09-15T17:22:26.319Z]             month=1,
[2020-09-15T17:22:26.319Z]             day=1,
[2020-09-15T17:22:26.319Z]             hour=1,
[2020-09-15T17:22:26.319Z]             minute=1,
[2020-09-15T17:22:26.319Z]             second=1,
[2020-09-15T17:22:26.319Z]         ))
[2020-09-15T17:22:26.319Z]     
[2020-09-15T17:22:26.319Z] >       assert wfile.getvalue() == (
[2020-09-15T17:22:26.319Z]             b''
[2020-09-15T17:22:26.319Z]             b'Content-Length: 10\r\n'
[2020-09-15T17:22:26.319Z]             b'Content-Type: application/vscode-jsonrpc; charset=utf8\r\n'
[2020-09-15T17:22:26.319Z]             b'\r\n'
[2020-09-15T17:22:26.319Z]             b'1546300861'
[2020-09-15T17:22:26.319Z]             )
[2020-09-15T17:22:26.319Z] E       AssertionError: assert b'Content-Len...r\n1546304461' == b'Content-Len...r\n1546300861'
[2020-09-15T17:22:26.319Z] E         At index 84 diff: b'4' != b'0'
[2020-09-15T17:22:26.319Z] E         Use -v to get the full diff
[2020-09-15T17:22:26.319Z] 
[2020-09-15T17:22:26.319Z] test/test_streams.py:124: AssertionError
[2020-09-15T17:22:26.319Z] =============================== warnings summary ===============================
[2020-09-15T17:22:26.319Z] /usr/lib/python3.8/site-packages/_pytest/junitxml.py:446
[2020-09-15T17:22:26.319Z]   /usr/lib/python3.8/site-packages/_pytest/junitxml.py:446: PytestDeprecationWarning: The 'junit_family' default value will change to 'xunit2' in pytest 6.0. See:
[2020-09-15T17:22:26.319Z]     https://docs.pytest.org/en/stable/deprecations.html#junit-family-default-value-change-to-xunit2
[2020-09-15T17:22:26.319Z]   for more information.
[2020-09-15T17:22:26.319Z]     _issue_warning_captured(deprecated.JUNIT_XML_DEFAULT_FAMILY, config.hook, 2)
[2020-09-15T17:22:26.319Z] 
[2020-09-15T17:22:26.319Z] -- Docs: https://docs.pytest.org/en/stable/warnings.html
[2020-09-15T17:22:26.319Z] - generated xml file: /build/python-jsonrpc-server/src/python-jsonrpc-server-0.4.0/pytest.xml -
[2020-09-15T17:22:26.319Z] 
[2020-09-15T17:22:26.319Z] ----------- coverage: platform linux, python 3.8.5-final-0 -----------
[2020-09-15T17:22:26.319Z] Name                    Stmts   Miss  Cover
[2020-09-15T17:22:26.319Z] -------------------------------------------
[2020-09-15T17:22:26.319Z] test/__init__.py            0      0   100%
[2020-09-15T17:22:26.319Z] test/test_endpoint.py     133      4    97%
[2020-09-15T17:22:26.319Z] test/test_streams.py       52      2    96%
[2020-09-15T17:22:26.319Z] -------------------------------------------
[2020-09-15T17:22:26.319Z] TOTAL                     185      6    97%
[2020-09-15T17:22:26.319Z] Coverage HTML written to dir htmlcov
[2020-09-15T17:22:26.319Z] 
[2020-09-15T17:22:26.319Z] =========================== short test summary info ============================
[2020-09-15T17:22:26.319Z] FAILED test/test_streams.py::test_writer_bad_message - AssertionError: assert...
[2020-09-15T17:22:26.319Z] =================== 1 failed, 26 passed, 1 warning in 0.31s ====================
[2020-09-15T17:22:26.319Z] Coverage.py warning: Module pyls was never imported. (module-not-imported)
[2020-09-15T17:22:29.547Z] ==> ERROR: A failure occurred in check().
[2020-09-15T17:22:29.547Z]     Aborting...
[2020-09-15T17:22:30.458Z] ==> ERROR: Build failed, check /build/buildpkg/default-x86_64/jenkins/build
[Pipeline] }
[2020-09-15T17:22:30.461Z] ERROR: Failed to build source
[2020-09-15T17:22:30.461Z] ERROR: script returned exit code 255
[Pipeline] // catchError
[Pipeline] }
[Pipeline] // dir
Post stage
[Pipeline] emailext
[2020-09-15T17:22:30.564Z] Sending email to: artix-build-failures at artixlinux.org


More information about the artix-build-failures mailing list