[artix-build-failures] [world] Failure: vulkan-tools

jenkins at artixlinux.org jenkins at artixlinux.org
Wed Sep 2 16:08:05 CEST 2020


   Failure

   Build: x86_64/extra

   Packages:

   vulkan-tools-1.2.151-1-x86_64.pkg.tar.zst

   author: Nathan Owens

   email: ndowens at artixlinux.org

   [1]https://orion.artixlinux.org/job/packagesV/job/vulkan-tools/job/mast
   er/3/

References

   1. https://orion.artixlinux.org/job/packagesV/job/vulkan-tools/job/master/3/
-------------- next part --------------
Push event to branch master
Querying the current revision of branch master...
Current revision of branch master is c678abac75db70f8e01fc30b1e021fc0ee90333a
Obtained Jenkinsfile from c678abac75db70f8e01fc30b1e021fc0ee90333a
Running in Durability level: PERFORMANCE_OPTIMIZED
Loading library artix-ci at master
Attempting to resolve master from remote references...
 > git --version # timeout=10
 > git --version # 'git version 2.27.0'
 > git ls-remote -- https://gitea.artixlinux.org/artix/pipeline-libs.git # timeout=10
Found match: refs/heads/master revision 63982f52a13081d21ce5a9e2e2b5a16634730d63
The recommended git tool is: NONE
Warning: CredentialId "jenkins-gotea-token" could not be found.
Cloning the remote Git repository
Cloning with configured refspecs honoured and without tags
Cloning repository https://gitea.artixlinux.org/artix/pipeline-libs.git
 > git init /var/lib/jenkins/workspace/packagesV_vulkan-tools_master at libs/artix-ci # timeout=10
Fetching upstream changes from https://gitea.artixlinux.org/artix/pipeline-libs.git
 > git --version # timeout=10
 > git --version # 'git version 2.27.0'
 > git fetch --no-tags --force --progress -- https://gitea.artixlinux.org/artix/pipeline-libs.git +refs/heads/master:refs/remotes/origin/master # timeout=10
 > git config remote.origin.url https://gitea.artixlinux.org/artix/pipeline-libs.git # timeout=10
 > git config --add remote.origin.fetch +refs/heads/master:refs/remotes/origin/master # timeout=10
Avoid second fetch
Checking out Revision 63982f52a13081d21ce5a9e2e2b5a16634730d63 (master)
 > git config core.sparsecheckout # timeout=10
 > git checkout -f 63982f52a13081d21ce5a9e2e2b5a16634730d63 # timeout=10
Commit message: "rm obsolete layout bool"
[Gitea] Notifying branch build status: PENDING Build started...
[Gitea] Notified
[Pipeline] Start of Pipeline
[Pipeline] node
Still waiting to schedule task
Waiting for next available executor
Running on Jenkins in /var/lib/jenkins/workspace/packagesV_vulkan-tools_master
[Pipeline] {
[Pipeline] timestamps
[Pipeline] {
[Pipeline] stage
[Pipeline] { (Prepare)
[Pipeline] catchError
[Pipeline] {
[Pipeline] checkout
[2020-09-02T14:07:26.302Z] The recommended git tool is: NONE
[2020-09-02T14:07:26.302Z] Warning: CredentialId "jenkins-gotea-token" could not be found.
[2020-09-02T14:07:26.302Z] Cloning the remote Git repository
[2020-09-02T14:07:26.303Z] Cloning with configured refspecs honoured and without tags
[2020-09-02T14:07:26.303Z] Cloning repository https://237b7412742b4068af4173944de150f12959f4d3@gitea.artixlinux.org/packagesV/vulkan-tools.git
[2020-09-02T14:07:26.303Z]  > git init /var/lib/jenkins/workspace/packagesV_vulkan-tools_master # timeout=10
[2020-09-02T14:07:26.310Z] Fetching upstream changes from https://237b7412742b4068af4173944de150f12959f4d3@gitea.artixlinux.org/packagesV/vulkan-tools.git
[2020-09-02T14:07:26.310Z]  > git --version # timeout=10
[2020-09-02T14:07:26.314Z]  > git --version # 'git version 2.27.0'
[2020-09-02T14:07:26.314Z]  > git fetch --no-tags --force --progress -- https://237b7412742b4068af4173944de150f12959f4d3@gitea.artixlinux.org/packagesV/vulkan-tools.git +refs/heads/master:refs/remotes/origin/master # timeout=10
[2020-09-02T14:07:26.476Z]  > git config remote.origin.url https://237b7412742b4068af4173944de150f12959f4d3@gitea.artixlinux.org/packagesV/vulkan-tools.git # timeout=10
[2020-09-02T14:07:26.480Z]  > git config --add remote.origin.fetch +refs/heads/master:refs/remotes/origin/master # timeout=10
[2020-09-02T14:07:26.486Z] Avoid second fetch
[2020-09-02T14:07:26.486Z] Checking out Revision c678abac75db70f8e01fc30b1e021fc0ee90333a (master)
[2020-09-02T14:07:26.486Z]  > git config core.sparsecheckout # timeout=10
[2020-09-02T14:07:26.490Z]  > git checkout -f c678abac75db70f8e01fc30b1e021fc0ee90333a # timeout=10
[2020-09-02T14:07:26.500Z] Commit message: "[trunk] -> [extra] 'vulkan-tools-1.2.151-1' add"
[2020-09-02T14:07:26.500Z]  > git rev-list --no-walk 9c0cf4eac077100b333ef610f0b51d3bba07acf3 # timeout=10
[2020-09-02T14:07:26.512Z] Cleaning workspace
[2020-09-02T14:07:26.512Z]  > git rev-parse --verify HEAD # timeout=10
[2020-09-02T14:07:26.516Z] Resetting working tree
[2020-09-02T14:07:26.516Z]  > git reset --hard # timeout=10
[2020-09-02T14:07:26.523Z]  > git clean -fdx # timeout=10
[2020-09-02T14:07:26.528Z] [Gitea] Notifying branch build status: PENDING Build started...
[2020-09-02T14:07:26.675Z] [Gitea] Notified
[Pipeline] libraryResource
[Pipeline] readYaml
[Pipeline] sh
[2020-09-02T14:07:26.944Z] + git show -s --format=%an c678abac75db70f8e01fc30b1e021fc0ee90333a
[Pipeline] sh
[2020-09-02T14:07:27.201Z] + git show -s --format=%ae c678abac75db70f8e01fc30b1e021fc0ee90333a
[Pipeline] sh
[2020-09-02T14:07:27.458Z] + git show --pretty=format: --name-status c678abac75db70f8e01fc30b1e021fc0ee90333a
[Pipeline] fileExists
[Pipeline] sh
[2020-09-02T14:07:27.727Z] + pkg2yaml -d x86_64/extra
[Pipeline] readYaml
[Pipeline] }
[Pipeline] // catchError
[Pipeline] }
[Pipeline] // stage
[Pipeline] stage
[Pipeline] { (Build)
[Pipeline] withCredentials
[2020-09-02T14:07:27.893Z] Masking supported pattern matches of $BUILDBOT_GPGP
[Pipeline] {
[Pipeline] echo
[2020-09-02T14:07:27.919Z] isLibBump: false
[Pipeline] dir
[2020-09-02T14:07:27.925Z] Running in /var/lib/jenkins/workspace/packagesV_vulkan-tools_master/x86_64/extra
[Pipeline] {
[Pipeline] catchError
[Pipeline] {
[Pipeline] sh
[2020-09-02T14:07:28.191Z] + buildpkg -C -d world
[2020-09-02T14:07:31.419Z] :: Synchronizing package databases...
[2020-09-02T14:07:31.419Z]  system is up to date
[2020-09-02T14:07:31.419Z] downloading world.db...
[2020-09-02T14:07:31.419Z]  galaxy is up to date
[2020-09-02T14:07:31.419Z]  extra is up to date
[2020-09-02T14:07:31.419Z] downloading community.db...
[2020-09-02T14:07:31.419Z] :: Starting full system upgrade...
[2020-09-02T14:07:31.669Z]  there is nothing to do
[2020-09-02T14:07:32.580Z] ==> Building in chroot for [default] (x86_64)...
[2020-09-02T14:07:35.062Z] ==> Synchronizing chroot copy [/build/buildpkg/buildpkg/default-x86_64/root] -> [jenkins]...done
[2020-09-02T14:07:35.613Z] ==> Making package: vulkan-tools 1.2.151-1 (Wed Sep  2 16:07:35 2020)
[2020-09-02T14:07:35.613Z] ==> Retrieving sources...
[2020-09-02T14:07:35.613Z]   -> Downloading vulkan-tools-1.2.151.tar.gz...
[2020-09-02T14:07:35.613Z]   % Total    % Received % Xferd  Average Speed   Time    Time     Time  Current
[2020-09-02T14:07:35.613Z]                                  Dload  Upload   Total   Spent    Left  Speed
[2020-09-02T14:07:36.164Z] 
  0     0    0     0    0     0      0      0 --:--:-- --:--:-- --:--:--     0
100   135  100   135    0     0    360      0 --:--:-- --:--:-- --:--:--   360
[2020-09-02T14:07:36.964Z] 
100 14311    0 14311    0     0  17242      0 --:--:-- --:--:-- --:--:-- 17242
100  701k    0  701k    0     0   593k      0 --:--:--  0:00:01 --:--:-- 1964k
[2020-09-02T14:07:36.964Z] ==> Validating source files with sha256sums...
[2020-09-02T14:07:36.964Z]     vulkan-tools-1.2.151.tar.gz ... Passed
[2020-09-02T14:07:42.158Z] ==> Making package: vulkan-tools 1.2.151-1 (Wed 02 Sep 2020 02:07:41 PM UTC)
[2020-09-02T14:07:42.158Z] ==> Checking runtime dependencies...
[2020-09-02T14:07:42.158Z] ==> Installing missing dependencies...
[2020-09-02T14:07:42.158Z] resolving dependencies...
[2020-09-02T14:07:42.158Z] looking for conflicting packages...
[2020-09-02T14:07:42.158Z] 
[2020-09-02T14:07:42.158Z] Package (5)              New Version  Net Change
[2020-09-02T14:07:42.158Z] 
[2020-09-02T14:07:42.158Z] world/libxau             1.0.9-3        0.02 MiB
[2020-09-02T14:07:42.158Z] world/libxdmcp           1.1.3-3        0.13 MiB
[2020-09-02T14:07:42.158Z] world/xcb-proto          1.14-1         0.83 MiB
[2020-09-02T14:07:42.158Z] world/libxcb             1.14-1         3.73 MiB
[2020-09-02T14:07:42.159Z] world/vulkan-icd-loader  1.2.151-1      0.38 MiB
[2020-09-02T14:07:42.159Z] 
[2020-09-02T14:07:42.159Z] Total Installed Size:  5.08 MiB
[2020-09-02T14:07:42.159Z] 
[2020-09-02T14:07:42.159Z] :: Proceed with installation? [Y/n] 
[2020-09-02T14:07:42.159Z] checking keyring...
[2020-09-02T14:07:42.159Z] checking package integrity...
[2020-09-02T14:07:42.159Z] loading package files...
[2020-09-02T14:07:42.159Z] checking for file conflicts...
[2020-09-02T14:07:42.159Z] checking available disk space...
[2020-09-02T14:07:42.159Z] :: Processing package changes...
[2020-09-02T14:07:42.159Z] installing xcb-proto...
[2020-09-02T14:07:42.159Z] installing libxdmcp...
[2020-09-02T14:07:42.159Z] installing libxau...
[2020-09-02T14:07:42.159Z] installing libxcb...
[2020-09-02T14:07:42.409Z] installing vulkan-icd-loader...
[2020-09-02T14:07:42.409Z] Optional dependencies for vulkan-icd-loader
[2020-09-02T14:07:42.409Z]     vulkan-driver: packaged vulkan driver
[2020-09-02T14:07:42.409Z] ==> Checking buildtime dependencies...
[2020-09-02T14:07:42.409Z] ==> Installing missing dependencies...
[2020-09-02T14:07:42.659Z] resolving dependencies...
[2020-09-02T14:07:42.659Z] looking for conflicting packages...
[2020-09-02T14:07:42.659Z] 
[2020-09-02T14:07:42.659Z] Package (16)            New Version       Net Change  Download Size
[2020-09-02T14:07:42.659Z] 
[2020-09-02T14:07:42.659Z] world/jsoncpp           1.9.3-1             1.76 MiB               
[2020-09-02T14:07:42.659Z] system/libnsl           1.3.0-1             0.19 MiB               
[2020-09-02T14:07:42.659Z] world/libuv             1.39.0-1            0.53 MiB               
[2020-09-02T14:07:42.659Z] system/pcre2            10.35-1             3.90 MiB               
[2020-09-02T14:07:42.659Z] world/perl-error        0.17029-2           0.04 MiB               
[2020-09-02T14:07:42.659Z] world/perl-mailtools    2.21-4              0.11 MiB               
[2020-09-02T14:07:42.659Z] world/perl-timedate     2.33-2              0.08 MiB               
[2020-09-02T14:07:42.660Z] world/rhash             1.4.0-1             0.29 MiB               
[2020-09-02T14:07:42.660Z] world/shared-mime-info  2.0+1+g6bf9e4f-2    4.32 MiB               
[2020-09-02T14:07:42.660Z] world/xorgproto         2020.1-1            1.40 MiB               
[2020-09-02T14:07:42.660Z] world/cmake             3.18.2-1           43.13 MiB               
[2020-09-02T14:07:42.660Z] world/git               2.28.0-1           41.50 MiB               
[2020-09-02T14:07:42.660Z] world/libx11            1.6.12-1           10.16 MiB               
[2020-09-02T14:07:42.660Z] world/python            3.8.5-1            77.65 MiB               
[2020-09-02T14:07:42.660Z] world/vulkan-headers    1:1.2.152-1         8.45 MiB       0.52 MiB
[2020-09-02T14:07:42.660Z] world/wayland           1.18.0-2            0.73 MiB               
[2020-09-02T14:07:42.660Z] 
[2020-09-02T14:07:42.660Z] Total Download Size:     0.52 MiB
[2020-09-02T14:07:42.660Z] Total Installed Size:  194.24 MiB
[2020-09-02T14:07:42.660Z] 
[2020-09-02T14:07:42.660Z] :: Proceed with installation? [Y/n] 
[2020-09-02T14:07:42.660Z] :: Retrieving packages...
[2020-09-02T14:07:42.660Z] downloading vulkan-headers-1:1.2.152-1-any.pkg.tar.zst...
[2020-09-02T14:07:42.660Z] checking keyring...
[2020-09-02T14:07:42.660Z] checking package integrity...
[2020-09-02T14:07:44.003Z] loading package files...
[2020-09-02T14:07:44.003Z] checking for file conflicts...
[2020-09-02T14:07:44.003Z] checking available disk space...
[2020-09-02T14:07:44.003Z] :: Processing package changes...
[2020-09-02T14:07:44.003Z] installing perl-error...
[2020-09-02T14:07:44.003Z] installing perl-timedate...
[2020-09-02T14:07:44.003Z] installing perl-mailtools...
[2020-09-02T14:07:44.003Z] installing pcre2...
[2020-09-02T14:07:44.003Z] installing git...
[2020-09-02T14:07:44.253Z] Optional dependencies for git
[2020-09-02T14:07:44.253Z]     tk: gitk and git gui
[2020-09-02T14:07:44.253Z]     perl-libwww: git svn
[2020-09-02T14:07:44.253Z]     perl-term-readkey: git svn and interactive.singlekey setting
[2020-09-02T14:07:44.253Z]     perl-mime-tools: git send-email
[2020-09-02T14:07:44.253Z]     perl-net-smtp-ssl: git send-email TLS support
[2020-09-02T14:07:44.253Z]     perl-authen-sasl: git send-email TLS support
[2020-09-02T14:07:44.253Z]     perl-mediawiki-api: git mediawiki support
[2020-09-02T14:07:44.253Z]     perl-datetime-format-iso8601: git mediawiki support
[2020-09-02T14:07:44.253Z]     perl-lwp-protocol-https: git mediawiki https support
[2020-09-02T14:07:44.253Z]     perl-cgi: gitweb (web interface) support
[2020-09-02T14:07:44.253Z]     python: git svn & git p4 [pending]
[2020-09-02T14:07:44.253Z]     subversion: git svn
[2020-09-02T14:07:44.253Z]     org.freedesktop.secrets: keyring credential helper
[2020-09-02T14:07:44.253Z]     libsecret: libsecret credential helper [installed]
[2020-09-02T14:07:44.253Z] installing shared-mime-info...
[2020-09-02T14:07:44.253Z] installing jsoncpp...
[2020-09-02T14:07:44.253Z] Optional dependencies for jsoncpp
[2020-09-02T14:07:44.253Z]     jsoncpp-doc: documentation
[2020-09-02T14:07:44.253Z] installing libnsl...
[2020-09-02T14:07:44.253Z] installing libuv...
[2020-09-02T14:07:44.253Z] installing rhash...
[2020-09-02T14:07:44.253Z] installing cmake...
[2020-09-02T14:07:44.503Z] Optional dependencies for cmake
[2020-09-02T14:07:44.504Z]     qt5-base: cmake-gui
[2020-09-02T14:07:44.504Z] installing python...
[2020-09-02T14:07:44.754Z] Optional dependencies for python
[2020-09-02T14:07:44.754Z]     python-setuptools
[2020-09-02T14:07:44.754Z]     python-pip
[2020-09-02T14:07:44.754Z]     sqlite [installed]
[2020-09-02T14:07:44.754Z]     mpdecimal: for decimal
[2020-09-02T14:07:44.754Z]     xz: for lzma [installed]
[2020-09-02T14:07:44.754Z]     tk: for tkinter
[2020-09-02T14:07:44.754Z] installing vulkan-headers...
[2020-09-02T14:07:44.754Z] installing xorgproto...
[2020-09-02T14:07:44.754Z] installing libx11...
[2020-09-02T14:07:44.754Z] installing wayland...
[2020-09-02T14:07:45.004Z] :: Running post-transaction hooks...
[2020-09-02T14:07:45.004Z] (1/3) Creating system user accounts...
[2020-09-02T14:07:45.004Z] (2/3) Warn about old perl modules
[2020-09-02T14:07:45.004Z] (3/3) Updating the MIME type database...
[2020-09-02T14:07:45.555Z] ==> Retrieving sources...
[2020-09-02T14:07:45.555Z]   -> Found vulkan-tools-1.2.151.tar.gz
[2020-09-02T14:07:45.555Z] ==> WARNING: Skipping all source file integrity checks.
[2020-09-02T14:07:45.555Z] ==> Extracting sources...
[2020-09-02T14:07:45.555Z]   -> Extracting vulkan-tools-1.2.151.tar.gz with bsdtar
[2020-09-02T14:07:45.555Z] ==> Starting build()...
[2020-09-02T14:07:45.555Z] -- The C compiler identification is GNU 10.2.0
[2020-09-02T14:07:45.805Z] -- The CXX compiler identification is GNU 10.2.0
[2020-09-02T14:07:45.805Z] -- Detecting C compiler ABI info
[2020-09-02T14:07:45.805Z] -- Detecting C compiler ABI info - done
[2020-09-02T14:07:46.056Z] -- Check for working C compiler: /usr/bin/cc - skipped
[2020-09-02T14:07:46.056Z] -- Detecting C compile features
[2020-09-02T14:07:46.056Z] -- Detecting C compile features - done
[2020-09-02T14:07:46.056Z] -- Detecting CXX compiler ABI info
[2020-09-02T14:07:46.056Z] -- Detecting CXX compiler ABI info - done
[2020-09-02T14:07:46.056Z] -- Check for working CXX compiler: /usr/bin/c++ - skipped
[2020-09-02T14:07:46.056Z] -- Detecting CXX compile features
[2020-09-02T14:07:46.056Z] -- Detecting CXX compile features - done
[2020-09-02T14:07:46.056Z] -- Using find_package to locate Vulkan
[2020-09-02T14:07:46.056Z] -- Found Vulkan: /usr/lib/libvulkan.so  
[2020-09-02T14:07:46.306Z] -- Found VulkanHeaders: /usr/include  
[2020-09-02T14:07:46.306Z] CMake Warning (dev) at /usr/share/cmake-3.18/Modules/FindPackageHandleStandardArgs.cmake:273 (message):
[2020-09-02T14:07:46.306Z]   The package name passed to `find_package_handle_standard_args`
[2020-09-02T14:07:46.306Z]   (VulkanRegistry) does not match the name of the calling package
[2020-09-02T14:07:46.306Z]   (VulkanHeaders).  This can lead to problems in calling code that expects
[2020-09-02T14:07:46.306Z]   `find_package` result variables (e.g., `_FOUND`) to follow a certain
[2020-09-02T14:07:46.306Z]   pattern.
[2020-09-02T14:07:46.306Z] Call Stack (most recent call first):
[2020-09-02T14:07:46.306Z]   cmake/FindVulkanHeaders.cmake:65 (find_package_handle_standard_args)
[2020-09-02T14:07:46.306Z]   CMakeLists.txt:97 (find_package)
[2020-09-02T14:07:46.306Z] This warning is for project developers.  Use -Wno-dev to suppress it.
[2020-09-02T14:07:46.306Z] 
[2020-09-02T14:07:46.306Z] -- Found VulkanRegistry: /usr/share/vulkan/registry  
[2020-09-02T14:07:46.306Z] -- Vulkan FOUND = TRUE
[2020-09-02T14:07:46.306Z] -- Vulkan Lib Dir = /usr/lib
[2020-09-02T14:07:46.306Z] -- Vulkan Lib = /usr/lib/libvulkan.so
[2020-09-02T14:07:46.306Z] -- Vulkan Headers Include = /usr/include
[2020-09-02T14:07:46.306Z] -- Vulkan Headers Registry = /usr/share/vulkan/registry
[2020-09-02T14:07:46.306Z] -- Using GLSLANG_INSTALL_DIR to look for glslangValidator
[2020-09-02T14:07:46.306Z] -- Found PkgConfig: /usr/bin/pkg-config (found version "1.7.3") 
[2020-09-02T14:07:46.307Z] CMake Warning (dev) at /usr/share/cmake-3.18/Modules/FindPackageHandleStandardArgs.cmake:273 (message):
[2020-09-02T14:07:46.307Z]   The package name passed to `find_package_handle_standard_args` (xcb) does
[2020-09-02T14:07:46.307Z]   not match the name of the calling package (XCB).  This can lead to problems
[2020-09-02T14:07:46.307Z]   in calling code that expects `find_package` result variables (e.g.,
[2020-09-02T14:07:46.307Z]   `_FOUND`) to follow a certain pattern.
[2020-09-02T14:07:46.307Z] Call Stack (most recent call first):
[2020-09-02T14:07:46.307Z]   cmake/FindXCB.cmake:38 (find_package_handle_standard_args)
[2020-09-02T14:07:46.307Z]   cube/CMakeLists.txt:53 (find_package)
[2020-09-02T14:07:46.307Z] This warning is for project developers.  Use -Wno-dev to suppress it.
[2020-09-02T14:07:46.307Z] 
[2020-09-02T14:07:46.307Z] -- Found xcb: /usr/include  
[2020-09-02T14:07:46.307Z] -- Found X11: /usr/include   
[2020-09-02T14:07:46.307Z] -- Looking for XOpenDisplay in /usr/lib/libX11.so
[2020-09-02T14:07:46.307Z] -- Looking for XOpenDisplay in /usr/lib/libX11.so - found
[2020-09-02T14:07:46.307Z] -- Looking for gethostbyname
[2020-09-02T14:07:46.557Z] -- Looking for gethostbyname - found
[2020-09-02T14:07:46.557Z] -- Looking for connect
[2020-09-02T14:07:46.557Z] -- Looking for connect - found
[2020-09-02T14:07:46.807Z] -- Looking for remove
[2020-09-02T14:07:46.807Z] -- Looking for remove - found
[2020-09-02T14:07:46.807Z] -- Looking for shmat
[2020-09-02T14:07:47.058Z] -- Looking for shmat - found
[2020-09-02T14:07:47.058Z] CMake Warning (dev) at /usr/share/cmake-3.18/Modules/FindPackageHandleStandardArgs.cmake:273 (message):
[2020-09-02T14:07:47.058Z]   The package name passed to `find_package_handle_standard_args`
[2020-09-02T14:07:47.058Z]   (WAYLAND_CLIENT) does not match the name of the calling package (Wayland).
[2020-09-02T14:07:47.058Z]   This can lead to problems in calling code that expects `find_package`
[2020-09-02T14:07:47.058Z]   result variables (e.g., `_FOUND`) to follow a certain pattern.
[2020-09-02T14:07:47.058Z] Call Stack (most recent call first):
[2020-09-02T14:07:47.058Z]   cmake/FindWayland.cmake:52 (FIND_PACKAGE_HANDLE_STANDARD_ARGS)
[2020-09-02T14:07:47.058Z]   cube/CMakeLists.txt:61 (find_package)
[2020-09-02T14:07:47.058Z] This warning is for project developers.  Use -Wno-dev to suppress it.
[2020-09-02T14:07:47.058Z] 
[2020-09-02T14:07:47.058Z] -- Found WAYLAND_CLIENT: /usr/lib/libwayland-client.so  
[2020-09-02T14:07:47.058Z] CMake Warning (dev) at /usr/share/cmake-3.18/Modules/FindPackageHandleStandardArgs.cmake:273 (message):
[2020-09-02T14:07:47.058Z]   The package name passed to `find_package_handle_standard_args`
[2020-09-02T14:07:47.058Z]   (WAYLAND_SERVER) does not match the name of the calling package (Wayland).
[2020-09-02T14:07:47.058Z]   This can lead to problems in calling code that expects `find_package`
[2020-09-02T14:07:47.058Z]   result variables (e.g., `_FOUND`) to follow a certain pattern.
[2020-09-02T14:07:47.058Z] Call Stack (most recent call first):
[2020-09-02T14:07:47.058Z]   cmake/FindWayland.cmake:53 (FIND_PACKAGE_HANDLE_STANDARD_ARGS)
[2020-09-02T14:07:47.058Z]   cube/CMakeLists.txt:61 (find_package)
[2020-09-02T14:07:47.058Z] This warning is for project developers.  Use -Wno-dev to suppress it.
[2020-09-02T14:07:47.058Z] 
[2020-09-02T14:07:47.058Z] -- Found WAYLAND_SERVER: /usr/lib/libwayland-server.so  
[2020-09-02T14:07:47.058Z] CMake Warning (dev) at /usr/share/cmake-3.18/Modules/FindPackageHandleStandardArgs.cmake:273 (message):
[2020-09-02T14:07:47.058Z]   The package name passed to `find_package_handle_standard_args`
[2020-09-02T14:07:47.058Z]   (WAYLAND_EGL) does not match the name of the calling package (Wayland).
[2020-09-02T14:07:47.058Z]   This can lead to problems in calling code that expects `find_package`
[2020-09-02T14:07:47.058Z]   result variables (e.g., `_FOUND`) to follow a certain pattern.
[2020-09-02T14:07:47.058Z] Call Stack (most recent call first):
[2020-09-02T14:07:47.058Z]   cmake/FindWayland.cmake:54 (FIND_PACKAGE_HANDLE_STANDARD_ARGS)
[2020-09-02T14:07:47.058Z]   cube/CMakeLists.txt:61 (find_package)
[2020-09-02T14:07:47.058Z] This warning is for project developers.  Use -Wno-dev to suppress it.
[2020-09-02T14:07:47.058Z] 
[2020-09-02T14:07:47.058Z] -- Found WAYLAND_EGL: /usr/lib/libwayland-egl.so  
[2020-09-02T14:07:47.058Z] CMake Warning (dev) at /usr/share/cmake-3.18/Modules/FindPackageHandleStandardArgs.cmake:273 (message):
[2020-09-02T14:07:47.058Z]   The package name passed to `find_package_handle_standard_args`
[2020-09-02T14:07:47.058Z]   (WAYLAND_CURSOR) does not match the name of the calling package (Wayland).
[2020-09-02T14:07:47.058Z]   This can lead to problems in calling code that expects `find_package`
[2020-09-02T14:07:47.058Z]   result variables (e.g., `_FOUND`) to follow a certain pattern.
[2020-09-02T14:07:47.058Z] Call Stack (most recent call first):
[2020-09-02T14:07:47.058Z]   cmake/FindWayland.cmake:55 (FIND_PACKAGE_HANDLE_STANDARD_ARGS)
[2020-09-02T14:07:47.058Z]   cube/CMakeLists.txt:61 (find_package)
[2020-09-02T14:07:47.058Z] This warning is for project developers.  Use -Wno-dev to suppress it.
[2020-09-02T14:07:47.058Z] 
[2020-09-02T14:07:47.058Z] -- Found WAYLAND_CURSOR: /usr/lib/libwayland-cursor.so  
[2020-09-02T14:07:47.058Z] CMake Warning (dev) at /usr/share/cmake-3.18/Modules/FindPackageHandleStandardArgs.cmake:273 (message):
[2020-09-02T14:07:47.058Z]   The package name passed to `find_package_handle_standard_args` (WAYLAND)
[2020-09-02T14:07:47.058Z]   does not match the name of the calling package (Wayland).  This can lead to
[2020-09-02T14:07:47.058Z]   problems in calling code that expects `find_package` result variables
[2020-09-02T14:07:47.058Z]   (e.g., `_FOUND`) to follow a certain pattern.
[2020-09-02T14:07:47.058Z] Call Stack (most recent call first):
[2020-09-02T14:07:47.058Z]   cmake/FindWayland.cmake:56 (FIND_PACKAGE_HANDLE_STANDARD_ARGS)
[2020-09-02T14:07:47.058Z]   cube/CMakeLists.txt:61 (find_package)
[2020-09-02T14:07:47.058Z] This warning is for project developers.  Use -Wno-dev to suppress it.
[2020-09-02T14:07:47.058Z] 
[2020-09-02T14:07:47.058Z] -- Found WAYLAND: /usr/lib/libwayland-client.so;/usr/lib/libwayland-server.so;/usr/lib/libwayland-egl.so;/usr/lib/libwayland-cursor.so  
[2020-09-02T14:07:47.058Z] -- Looking for clock_gettime in rt
[2020-09-02T14:07:47.309Z] -- Looking for clock_gettime in rt - found
[2020-09-02T14:07:47.309Z] CMake Warning (dev) at /usr/share/cmake-3.18/Modules/FindPackageHandleStandardArgs.cmake:273 (message):
[2020-09-02T14:07:47.309Z]   The package name passed to `find_package_handle_standard_args` (xcb) does
[2020-09-02T14:07:47.309Z]   not match the name of the calling package (XCB).  This can lead to problems
[2020-09-02T14:07:47.309Z]   in calling code that expects `find_package` result variables (e.g.,
[2020-09-02T14:07:47.309Z]   `_FOUND`) to follow a certain pattern.
[2020-09-02T14:07:47.309Z] Call Stack (most recent call first):
[2020-09-02T14:07:47.309Z]   cmake/FindXCB.cmake:38 (find_package_handle_standard_args)
[2020-09-02T14:07:47.309Z]   vulkaninfo/CMakeLists.txt:46 (find_package)
[2020-09-02T14:07:47.309Z] This warning is for project developers.  Use -Wno-dev to suppress it.
[2020-09-02T14:07:47.309Z] 
[2020-09-02T14:07:47.309Z] CMake Warning (dev) at /usr/share/cmake-3.18/Modules/FindPackageHandleStandardArgs.cmake:273 (message):
[2020-09-02T14:07:47.309Z]   The package name passed to `find_package_handle_standard_args`
[2020-09-02T14:07:47.309Z]   (WAYLAND_CLIENT) does not match the name of the calling package (Wayland).
[2020-09-02T14:07:47.309Z]   This can lead to problems in calling code that expects `find_package`
[2020-09-02T14:07:47.309Z]   result variables (e.g., `_FOUND`) to follow a certain pattern.
[2020-09-02T14:07:47.309Z] Call Stack (most recent call first):
[2020-09-02T14:07:47.309Z]   cmake/FindWayland.cmake:52 (FIND_PACKAGE_HANDLE_STANDARD_ARGS)
[2020-09-02T14:07:47.309Z]   vulkaninfo/CMakeLists.txt:60 (find_package)
[2020-09-02T14:07:47.309Z] This warning is for project developers.  Use -Wno-dev to suppress it.
[2020-09-02T14:07:47.309Z] 
[2020-09-02T14:07:47.309Z] CMake Warning (dev) at /usr/share/cmake-3.18/Modules/FindPackageHandleStandardArgs.cmake:273 (message):
[2020-09-02T14:07:47.309Z]   The package name passed to `find_package_handle_standard_args`
[2020-09-02T14:07:47.309Z]   (WAYLAND_SERVER) does not match the name of the calling package (Wayland).
[2020-09-02T14:07:47.309Z]   This can lead to problems in calling code that expects `find_package`
[2020-09-02T14:07:47.309Z]   result variables (e.g., `_FOUND`) to follow a certain pattern.
[2020-09-02T14:07:47.309Z] Call Stack (most recent call first):
[2020-09-02T14:07:47.309Z]   cmake/FindWayland.cmake:53 (FIND_PACKAGE_HANDLE_STANDARD_ARGS)
[2020-09-02T14:07:47.309Z]   vulkaninfo/CMakeLists.txt:60 (find_package)
[2020-09-02T14:07:47.309Z] This warning is for project developers.  Use -Wno-dev to suppress it.
[2020-09-02T14:07:47.309Z] 
[2020-09-02T14:07:47.309Z] CMake Warning (dev) at /usr/share/cmake-3.18/Modules/FindPackageHandleStandardArgs.cmake:273 (message):
[2020-09-02T14:07:47.309Z]   The package name passed to `find_package_handle_standard_args`
[2020-09-02T14:07:47.309Z]   (WAYLAND_EGL) does not match the name of the calling package (Wayland).
[2020-09-02T14:07:47.309Z]   This can lead to problems in calling code that expects `find_package`
[2020-09-02T14:07:47.309Z]   result variables (e.g., `_FOUND`) to follow a certain pattern.
[2020-09-02T14:07:47.309Z] Call Stack (most recent call first):
[2020-09-02T14:07:47.309Z]   cmake/FindWayland.cmake:54 (FIND_PACKAGE_HANDLE_STANDARD_ARGS)
[2020-09-02T14:07:47.309Z]   vulkaninfo/CMakeLists.txt:60 (find_package)
[2020-09-02T14:07:47.309Z] This warning is for project developers.  Use -Wno-dev to suppress it.
[2020-09-02T14:07:47.309Z] 
[2020-09-02T14:07:47.309Z] CMake Warning (dev) at /usr/share/cmake-3.18/Modules/FindPackageHandleStandardArgs.cmake:273 (message):
[2020-09-02T14:07:47.309Z]   The package name passed to `find_package_handle_standard_args`
[2020-09-02T14:07:47.309Z]   (WAYLAND_CURSOR) does not match the name of the calling package (Wayland).
[2020-09-02T14:07:47.309Z]   This can lead to problems in calling code that expects `find_package`
[2020-09-02T14:07:47.309Z]   result variables (e.g., `_FOUND`) to follow a certain pattern.
[2020-09-02T14:07:47.309Z] Call Stack (most recent call first):
[2020-09-02T14:07:47.309Z]   cmake/FindWayland.cmake:55 (FIND_PACKAGE_HANDLE_STANDARD_ARGS)
[2020-09-02T14:07:47.309Z]   vulkaninfo/CMakeLists.txt:60 (find_package)
[2020-09-02T14:07:47.309Z] This warning is for project developers.  Use -Wno-dev to suppress it.
[2020-09-02T14:07:47.309Z] 
[2020-09-02T14:07:47.309Z] CMake Warning (dev) at /usr/share/cmake-3.18/Modules/FindPackageHandleStandardArgs.cmake:273 (message):
[2020-09-02T14:07:47.309Z]   The package name passed to `find_package_handle_standard_args` (WAYLAND)
[2020-09-02T14:07:47.309Z]   does not match the name of the calling package (Wayland).  This can lead to
[2020-09-02T14:07:47.309Z]   problems in calling code that expects `find_package` result variables
[2020-09-02T14:07:47.309Z]   (e.g., `_FOUND`) to follow a certain pattern.
[2020-09-02T14:07:47.309Z] Call Stack (most recent call first):
[2020-09-02T14:07:47.309Z]   cmake/FindWayland.cmake:56 (FIND_PACKAGE_HANDLE_STANDARD_ARGS)
[2020-09-02T14:07:47.309Z]   vulkaninfo/CMakeLists.txt:60 (find_package)
[2020-09-02T14:07:47.309Z] This warning is for project developers.  Use -Wno-dev to suppress it.
[2020-09-02T14:07:47.309Z] 
[2020-09-02T14:07:47.309Z] -- Configuring done
[2020-09-02T14:07:47.309Z] -- Generating done
[2020-09-02T14:07:47.309Z] -- Build files have been written to: /build/vulkan-tools/src/Vulkan-Tools-1.2.151/build
[2020-09-02T14:07:47.309Z] make[2]: *** No rule to make target 'cube/GLSLANG_VALIDATOR-NOTFOUND', needed by 'cube/cube.frag.inc'.  Stop.
[2020-09-02T14:07:47.309Z] make[2]: *** No rule to make target 'cube/GLSLANG_VALIDATOR-NOTFOUND', needed by 'cube/cube.frag.inc'.  Stop.
[2020-09-02T14:07:47.309Z] make[1]: *** [CMakeFiles/Makefile2:191: cube/CMakeFiles/vkcubepp.dir/all] Error 2
[2020-09-02T14:07:47.309Z] make[1]: *** Waiting for unfinished jobs....
[2020-09-02T14:07:47.309Z] make[1]: *** [CMakeFiles/Makefile2:218: cube/CMakeFiles/vkcube.dir/all] Error 2
[2020-09-02T14:07:47.309Z] Scanning dependencies of target vulkaninfo
[2020-09-02T14:07:47.309Z] [ 10%] Building CXX object vulkaninfo/CMakeFiles/vulkaninfo.dir/vulkaninfo.cpp.o
[2020-09-02T14:08:05.269Z] [ 20%] Linking CXX executable vulkaninfo
[2020-09-02T14:08:05.269Z] [ 20%] Built target vulkaninfo
[2020-09-02T14:08:05.269Z] make: *** [Makefile:149: all] Error 2
[2020-09-02T14:08:05.269Z] ==> ERROR: A failure occurred in build().
[2020-09-02T14:08:05.269Z]     Aborting...
[2020-09-02T14:08:05.520Z] ==> ERROR: Build failed, check /build/buildpkg/buildpkg/default-x86_64/jenkins/build
[Pipeline] }
[2020-09-02T14:08:05.522Z] ERROR: Failed to build source
[2020-09-02T14:08:05.522Z] ERROR: script returned exit code 255
[Pipeline] // catchError
[Pipeline] }
[Pipeline] // dir
Post stage
[Pipeline] emailext
[2020-09-02T14:08:05.604Z] Sending email to: artix-build-failures at artixlinux.org


More information about the artix-build-failures mailing list