[artix-build-failures] [galaxy-goblins] Failure: python-dateutil

jenkins at artixlinux.org jenkins at artixlinux.org
Thu Nov 12 13:04:01 CET 2020


   Failure

   Build: x86_64/community-staging

   Packages:

   python-dateutil-2.8.1-5-any.pkg.tar.zst
   python2-dateutil-2.8.1-5-any.pkg.tar.zst

   author: alium

   email: alium at artixlinux.org

   [1]https://orion.artixlinux.org/job/packagesPython/job/python-dateutil/
   job/master/2/

References

   1. https://orion.artixlinux.org/job/packagesPython/job/python-dateutil/job/master/2/
-------------- next part --------------
Push event to branch master
Querying the current revision of branch master...
Current revision of branch master is 0f78c6df8448cfebce779a62d1033d4f3e7924ed
Obtained Jenkinsfile from 0f78c6df8448cfebce779a62d1033d4f3e7924ed
Running in Durability level: PERFORMANCE_OPTIMIZED
Loading library artix-ci at master
Attempting to resolve master from remote references...
 > git --version # timeout=10
 > git --version # 'git version 2.27.0'
 > git ls-remote -- https://gitea.artixlinux.org/artix/pipeline-libs.git # timeout=10
Found match: refs/heads/master revision 6271842ae2c48166f805c969881e1444705a8d74
Selected Git installation does not exist. Using Default
The recommended git tool is: NONE
Warning: CredentialId "jenkins-gotea-token" could not be found.
 > git rev-parse --is-inside-work-tree # timeout=10
Fetching changes from the remote Git repository
 > git config remote.origin.url https://gitea.artixlinux.org/artix/pipeline-libs.git # timeout=10
Fetching without tags
Fetching upstream changes from https://gitea.artixlinux.org/artix/pipeline-libs.git
 > git --version # timeout=10
 > git --version # 'git version 2.27.0'
 > git fetch --no-tags --force --progress -- https://gitea.artixlinux.org/artix/pipeline-libs.git +refs/heads/master:refs/remotes/origin/master # timeout=10
Checking out Revision 6271842ae2c48166f805c969881e1444705a8d74 (master)
 > git config core.sparsecheckout # timeout=10
 > git checkout -f 6271842ae2c48166f805c969881e1444705a8d74 # timeout=10
Commit message: "zse map type prop instead of def type"
[Gitea] Notifying branch build status: PENDING Build started...
[Gitea] Notified
[Pipeline] Start of Pipeline
[Pipeline] node
Still waiting to schedule task
Waiting for next available executor
Running on Jenkins in /var/lib/jenkins/workspace/gesPython_python-dateutil_master
[Pipeline] {
[Pipeline] timestamps
[Pipeline] {
[Pipeline] stage
[Pipeline] { (Prepare)
[Pipeline] catchError
[Pipeline] {
[Pipeline] checkout
[2020-11-12T12:03:33.584Z] The recommended git tool is: NONE
[2020-11-12T12:03:33.584Z] Warning: CredentialId "jenkins-gotea-token" could not be found.
[2020-11-12T12:03:33.584Z]  > git rev-parse --is-inside-work-tree # timeout=10
[2020-11-12T12:03:33.589Z] Fetching changes from the remote Git repository
[2020-11-12T12:03:33.589Z]  > git config remote.origin.url https://237b7412742b4068af4173944de150f12959f4d3@gitea.artixlinux.org/packagesPython/python-dateutil.git # timeout=10
[2020-11-12T12:03:33.594Z] Cleaning workspace
[2020-11-12T12:03:33.594Z]  > git rev-parse --verify HEAD # timeout=10
[2020-11-12T12:03:33.598Z] Resetting working tree
[2020-11-12T12:03:33.598Z]  > git reset --hard # timeout=10
[2020-11-12T12:03:33.604Z]  > git clean -fdx # timeout=10
[2020-11-12T12:03:33.609Z] Fetching without tags
[2020-11-12T12:03:33.609Z] Fetching upstream changes from https://237b7412742b4068af4173944de150f12959f4d3@gitea.artixlinux.org/packagesPython/python-dateutil.git
[2020-11-12T12:03:33.609Z]  > git --version # timeout=10
[2020-11-12T12:03:33.612Z]  > git --version # 'git version 2.27.0'
[2020-11-12T12:03:33.612Z]  > git fetch --no-tags --force --progress -- https://237b7412742b4068af4173944de150f12959f4d3@gitea.artixlinux.org/packagesPython/python-dateutil.git +refs/heads/master:refs/remotes/origin/master # timeout=10
[2020-11-12T12:03:33.743Z] Checking out Revision 0f78c6df8448cfebce779a62d1033d4f3e7924ed (master)
[2020-11-12T12:03:33.743Z]  > git config core.sparsecheckout # timeout=10
[2020-11-12T12:03:33.748Z]  > git checkout -f 0f78c6df8448cfebce779a62d1033d4f3e7924ed # timeout=10
[2020-11-12T12:03:33.757Z] Commit message: "[trunk] -> [community-staging] 'python-dateutil-2.8.1-5' add"
[2020-11-12T12:03:33.757Z]  > git rev-list --no-walk 16b58f80add49e51a8a6188eb5df7612f170dd25 # timeout=10
[2020-11-12T12:03:33.769Z] Cleaning workspace
[2020-11-12T12:03:33.769Z]  > git rev-parse --verify HEAD # timeout=10
[2020-11-12T12:03:33.773Z] Resetting working tree
[2020-11-12T12:03:33.773Z]  > git reset --hard # timeout=10
[2020-11-12T12:03:33.780Z]  > git clean -fdx # timeout=10
[2020-11-12T12:03:33.785Z] [Gitea] Notifying branch build status: PENDING Build started...
[2020-11-12T12:03:33.919Z] [Gitea] Notified
[Pipeline] libraryResource
[Pipeline] readYaml
[Pipeline] sh
[2020-11-12T12:03:34.191Z] + git show -s --format=%an 0f78c6df8448cfebce779a62d1033d4f3e7924ed
[Pipeline] sh
[2020-11-12T12:03:34.449Z] + git show -s --format=%ae 0f78c6df8448cfebce779a62d1033d4f3e7924ed
[Pipeline] sh
[2020-11-12T12:03:34.706Z] + git show --pretty=format: --name-status 0f78c6df8448cfebce779a62d1033d4f3e7924ed
[Pipeline] fileExists
[Pipeline] sh
[2020-11-12T12:03:34.977Z] + pkg2yaml -d x86_64/community-staging
[Pipeline] readYaml
[Pipeline] }
[Pipeline] // catchError
[Pipeline] }
[Pipeline] // stage
[Pipeline] stage
[Pipeline] { (Build)
[Pipeline] withCredentials
[2020-11-12T12:03:35.150Z] Masking supported pattern matches of $BUILDBOT_GPGP
[Pipeline] {
[Pipeline] echo
[2020-11-12T12:03:35.176Z] isLibBump: false
[Pipeline] dir
[2020-11-12T12:03:35.181Z] Running in /var/lib/jenkins/workspace/gesPython_python-dateutil_master/x86_64/community-staging
[Pipeline] {
[Pipeline] catchError
[Pipeline] {
[Pipeline] sh
[2020-11-12T12:03:35.448Z] + buildpkg -C -d galaxy-goblins
[2020-11-12T12:03:38.675Z] :: Synchronizing package databases...
[2020-11-12T12:03:38.675Z]  goblins is up to date
[2020-11-12T12:03:38.675Z]  gremlins is up to date
[2020-11-12T12:03:38.675Z]  system is up to date
[2020-11-12T12:03:38.675Z]  world is up to date
[2020-11-12T12:03:38.675Z] downloading galaxy-goblins.db...
[2020-11-12T12:03:38.675Z]  galaxy-gremlins is up to date
[2020-11-12T12:03:38.675Z]  galaxy is up to date
[2020-11-12T12:03:38.675Z]  extra is up to date
[2020-11-12T12:03:38.675Z]  community-staging is up to date
[2020-11-12T12:03:38.675Z]  community-testing is up to date
[2020-11-12T12:03:38.675Z]  community is up to date
[2020-11-12T12:03:38.675Z] :: Starting full system upgrade...
[2020-11-12T12:03:38.926Z]  there is nothing to do
[2020-11-12T12:03:39.837Z] ==> Building in chroot for [goblins] (x86_64)...
[2020-11-12T12:03:40.638Z] ==> Synchronizing chroot copy [/build/buildpkg/goblins-x86_64/root] -> [jenkins]...done
[2020-11-12T12:03:42.499Z] ==> Making package: python-dateutil 2.8.1-5 (Thu Nov 12 13:03:42 2020)
[2020-11-12T12:03:42.499Z] ==> Retrieving sources...
[2020-11-12T12:03:42.499Z]   -> Found python-dateutil-2.8.1.tar.gz
[2020-11-12T12:03:42.499Z]   -> Found python-dateutil-2.8.1.tar.gz.asc
[2020-11-12T12:03:42.499Z] ==> Validating source files with sha256sums...
[2020-11-12T12:03:42.499Z]     python-dateutil-2.8.1.tar.gz ... Passed
[2020-11-12T12:03:42.499Z]     python-dateutil-2.8.1.tar.gz.asc ... Skipped
[2020-11-12T12:03:42.499Z] ==> Verifying source file signatures with gpg...
[2020-11-12T12:03:42.499Z]     python-dateutil-2.8.1.tar.gz ... Passed (WARNING: the key has expired.)
[2020-11-12T12:03:42.499Z] ==> WARNING: Warnings have occurred while verifying the signatures.
[2020-11-12T12:03:42.499Z]     Please make sure you really trust them.
[2020-11-12T12:03:48.980Z] ==> Making package: python-dateutil 2.8.1-5 (Thu 12 Nov 2020 12:03:48 PM UTC)
[2020-11-12T12:03:48.980Z] ==> Checking runtime dependencies...
[2020-11-12T12:03:48.980Z] ==> Checking buildtime dependencies...
[2020-11-12T12:03:48.980Z] ==> Installing missing dependencies...
[2020-11-12T12:03:48.980Z] resolving dependencies...
[2020-11-12T12:03:48.980Z] looking for conflicting packages...
[2020-11-12T12:03:48.980Z] 
[2020-11-12T12:03:48.980Z] Package (31)                              New Version  Net Change
[2020-11-12T12:03:48.980Z] 
[2020-11-12T12:03:48.980Z] system/libnsl                             1.3.0-1        0.19 MiB
[2020-11-12T12:03:48.980Z] goblins/python                            3.9.0-1       80.76 MiB
[2020-11-12T12:03:48.980Z] galaxy-goblins/python-apipkg              1.5-4          0.02 MiB
[2020-11-12T12:03:48.980Z] goblins/python-appdirs                    1.4.4-2        0.07 MiB
[2020-11-12T12:03:48.980Z] goblins/python-attrs                      20.3.0-2       0.37 MiB
[2020-11-12T12:03:48.980Z] galaxy-goblins/python-dateutil            2.8.1-4        0.79 MiB
[2020-11-12T12:03:48.980Z] galaxy-goblins/python-importlib-metadata  2.0.0-2        0.19 MiB
[2020-11-12T12:03:48.980Z] galaxy-goblins/python-iniconfig           1.0.1-2        0.02 MiB
[2020-11-12T12:03:48.980Z] galaxy-goblins/python-more-itertools      8.6.0-2        0.27 MiB
[2020-11-12T12:03:48.980Z] goblins/python-ordered-set                4.0.2-2        0.06 MiB
[2020-11-12T12:03:48.980Z] goblins/python-packaging                  20.4-3         0.17 MiB
[2020-11-12T12:03:48.980Z] galaxy-goblins/python-pluggy              0.13.1-3       0.12 MiB
[2020-11-12T12:03:48.980Z] galaxy-goblins/python-py                  1.9.0-2        0.72 MiB
[2020-11-12T12:03:48.980Z] goblins/python-pyparsing                  2.4.7-2        0.73 MiB
[2020-11-12T12:03:48.980Z] goblins/python-setuptools                 1:50.3.2-3     2.98 MiB
[2020-11-12T12:03:48.980Z] galaxy-goblins/python-sortedcontainers    2.3.0-3        0.33 MiB
[2020-11-12T12:03:48.981Z] galaxy-goblins/python-toml                0.10.2-2       0.14 MiB
[2020-11-12T12:03:48.981Z] galaxy-goblins/python-zipp                3.4.0-2        0.03 MiB
[2020-11-12T12:03:48.981Z] world/python2                             2.7.18-2      79.62 MiB
[2020-11-12T12:03:48.981Z] goblins/python2-appdirs                   1.4.4-2        0.08 MiB
[2020-11-12T12:03:48.981Z] world/python2-ordered-set                 3.1.1-2        0.05 MiB
[2020-11-12T12:03:48.981Z] goblins/python2-packaging                 20.4-3         0.19 MiB
[2020-11-12T12:03:48.981Z] goblins/python2-pyparsing                 2.4.7-2        0.79 MiB
[2020-11-12T12:03:48.981Z] extra/python2-setuptools                  2:44.1.1-1     1.75 MiB
[2020-11-12T12:03:48.981Z] galaxy-goblins/python-freezegun           0.3.15-2       0.08 MiB
[2020-11-12T12:03:48.981Z] galaxy-goblins/python-hypothesis          5.41.2-3       5.25 MiB
[2020-11-12T12:03:48.981Z] galaxy-goblins/python-pytest              6.1.2-2        2.40 MiB
[2020-11-12T12:03:48.981Z] galaxy-goblins/python-setuptools-scm      4.1.2-2        0.11 MiB
[2020-11-12T12:03:48.981Z] goblins/python-six                        1.15.0-2       0.09 MiB
[2020-11-12T12:03:48.981Z] galaxy-goblins/python2-setuptools-scm     4.1.2-2        0.12 MiB
[2020-11-12T12:03:48.981Z] goblins/python2-six                       1.15.0-2       0.10 MiB
[2020-11-12T12:03:48.981Z] 
[2020-11-12T12:03:48.981Z] Total Installed Size:  178.60 MiB
[2020-11-12T12:03:48.981Z] 
[2020-11-12T12:03:48.981Z] :: Proceed with installation? [Y/n] 
[2020-11-12T12:03:48.981Z] checking keyring...
[2020-11-12T12:03:48.981Z] checking package integrity...
[2020-11-12T12:03:50.324Z] loading package files...
[2020-11-12T12:03:50.324Z] checking for file conflicts...
[2020-11-12T12:03:50.574Z] checking available disk space...
[2020-11-12T12:03:50.574Z] :: Processing package changes...
[2020-11-12T12:03:50.574Z] installing libnsl...
[2020-11-12T12:03:50.574Z] installing python...
[2020-11-12T12:03:50.824Z] Optional dependencies for python
[2020-11-12T12:03:50.824Z]     python-setuptools [pending]
[2020-11-12T12:03:50.824Z]     python-pip
[2020-11-12T12:03:50.824Z]     sqlite [installed]
[2020-11-12T12:03:50.824Z]     mpdecimal: for decimal
[2020-11-12T12:03:50.824Z]     xz: for lzma [installed]
[2020-11-12T12:03:50.824Z]     tk: for tkinter
[2020-11-12T12:03:50.824Z] installing python-appdirs...
[2020-11-12T12:03:50.824Z] installing python-pyparsing...
[2020-11-12T12:03:50.824Z] installing python-six...
[2020-11-12T12:03:50.824Z] installing python-packaging...
[2020-11-12T12:03:50.824Z] installing python-ordered-set...
[2020-11-12T12:03:50.824Z] installing python-setuptools...
[2020-11-12T12:03:50.824Z] installing python-setuptools-scm...
[2020-11-12T12:03:50.824Z] installing python2...
[2020-11-12T12:03:51.375Z] Optional dependencies for python2
[2020-11-12T12:03:51.375Z]     tk: for IDLE
[2020-11-12T12:03:51.375Z]     python2-setuptools [pending]
[2020-11-12T12:03:51.375Z]     python2-pip
[2020-11-12T12:03:51.375Z] installing python2-appdirs...
[2020-11-12T12:03:51.375Z] installing python2-pyparsing...
[2020-11-12T12:03:51.375Z] installing python2-six...
[2020-11-12T12:03:51.375Z] installing python2-packaging...
[2020-11-12T12:03:51.375Z] installing python2-ordered-set...
[2020-11-12T12:03:51.375Z] installing python2-setuptools...
[2020-11-12T12:03:51.375Z] installing python2-setuptools-scm...
[2020-11-12T12:03:51.375Z] installing python-attrs...
[2020-11-12T12:03:51.375Z] installing python-iniconfig...
[2020-11-12T12:03:51.375Z] installing python-more-itertools...
[2020-11-12T12:03:51.375Z] installing python-zipp...
[2020-11-12T12:03:51.375Z] installing python-importlib-metadata...
[2020-11-12T12:03:51.375Z] installing python-pluggy...
[2020-11-12T12:03:51.375Z] installing python-apipkg...
[2020-11-12T12:03:51.375Z] installing python-py...
[2020-11-12T12:03:51.375Z] installing python-toml...
[2020-11-12T12:03:51.375Z] installing python-pytest...
[2020-11-12T12:03:51.375Z] installing python-dateutil...
[2020-11-12T12:03:51.375Z] installing python-freezegun...
[2020-11-12T12:03:51.375Z] installing python-sortedcontainers...
[2020-11-12T12:03:51.375Z] installing python-hypothesis...
[2020-11-12T12:03:51.375Z] Optional dependencies for python-hypothesis
[2020-11-12T12:03:51.375Z]     python-pytz: for datetime and django module
[2020-11-12T12:03:51.375Z]     python-faker: for fakefactory and django module
[2020-11-12T12:03:51.375Z]     python-django: for django module
[2020-11-12T12:03:51.375Z]     python-numpy: for numpy module
[2020-11-12T12:03:51.375Z]     python-pytest: for pytest module [installed]
[2020-11-12T12:03:51.375Z]     python-lark-parser: for lark module
[2020-11-12T12:03:51.625Z] ==> Retrieving sources...
[2020-11-12T12:03:51.625Z]   -> Found python-dateutil-2.8.1.tar.gz
[2020-11-12T12:03:51.625Z]   -> Found python-dateutil-2.8.1.tar.gz.asc
[2020-11-12T12:03:51.625Z] ==> WARNING: Skipping all source file integrity checks.
[2020-11-12T12:03:51.625Z] ==> Extracting sources...
[2020-11-12T12:03:51.625Z]   -> Extracting python-dateutil-2.8.1.tar.gz with bsdtar
[2020-11-12T12:03:51.625Z] ==> Starting prepare()...
[2020-11-12T12:03:51.625Z] ==> Starting build()...
[2020-11-12T12:03:51.876Z] running build
[2020-11-12T12:03:51.876Z] running build_py
[2020-11-12T12:03:51.876Z] creating build
[2020-11-12T12:03:51.876Z] creating build/lib
[2020-11-12T12:03:51.876Z] creating build/lib/dateutil
[2020-11-12T12:03:51.876Z] copying dateutil/__init__.py -> build/lib/dateutil
[2020-11-12T12:03:51.876Z] copying dateutil/relativedelta.py -> build/lib/dateutil
[2020-11-12T12:03:51.876Z] copying dateutil/easter.py -> build/lib/dateutil
[2020-11-12T12:03:51.876Z] copying dateutil/_common.py -> build/lib/dateutil
[2020-11-12T12:03:51.876Z] copying dateutil/_version.py -> build/lib/dateutil
[2020-11-12T12:03:51.876Z] copying dateutil/utils.py -> build/lib/dateutil
[2020-11-12T12:03:51.876Z] copying dateutil/tzwin.py -> build/lib/dateutil
[2020-11-12T12:03:51.876Z] copying dateutil/rrule.py -> build/lib/dateutil
[2020-11-12T12:03:51.876Z] creating build/lib/dateutil/tz
[2020-11-12T12:03:51.876Z] copying dateutil/tz/__init__.py -> build/lib/dateutil/tz
[2020-11-12T12:03:51.876Z] copying dateutil/tz/_factories.py -> build/lib/dateutil/tz
[2020-11-12T12:03:51.876Z] copying dateutil/tz/_common.py -> build/lib/dateutil/tz
[2020-11-12T12:03:51.876Z] copying dateutil/tz/tz.py -> build/lib/dateutil/tz
[2020-11-12T12:03:51.876Z] copying dateutil/tz/win.py -> build/lib/dateutil/tz
[2020-11-12T12:03:51.876Z] creating build/lib/dateutil/zoneinfo
[2020-11-12T12:03:51.876Z] copying dateutil/zoneinfo/__init__.py -> build/lib/dateutil/zoneinfo
[2020-11-12T12:03:51.876Z] copying dateutil/zoneinfo/rebuild.py -> build/lib/dateutil/zoneinfo
[2020-11-12T12:03:51.876Z] creating build/lib/dateutil/parser
[2020-11-12T12:03:51.876Z] copying dateutil/parser/__init__.py -> build/lib/dateutil/parser
[2020-11-12T12:03:51.876Z] copying dateutil/parser/_parser.py -> build/lib/dateutil/parser
[2020-11-12T12:03:51.876Z] copying dateutil/parser/isoparser.py -> build/lib/dateutil/parser
[2020-11-12T12:03:51.876Z] copying dateutil/zoneinfo/dateutil-zoneinfo.tar.gz -> build/lib/dateutil/zoneinfo
[2020-11-12T12:03:52.126Z] running build
[2020-11-12T12:03:52.126Z] running build_py
[2020-11-12T12:03:52.126Z] creating build
[2020-11-12T12:03:52.126Z] creating build/lib
[2020-11-12T12:03:52.126Z] creating build/lib/dateutil
[2020-11-12T12:03:52.126Z] copying dateutil/__init__.py -> build/lib/dateutil
[2020-11-12T12:03:52.126Z] copying dateutil/relativedelta.py -> build/lib/dateutil
[2020-11-12T12:03:52.126Z] copying dateutil/easter.py -> build/lib/dateutil
[2020-11-12T12:03:52.126Z] copying dateutil/_common.py -> build/lib/dateutil
[2020-11-12T12:03:52.126Z] copying dateutil/_version.py -> build/lib/dateutil
[2020-11-12T12:03:52.126Z] copying dateutil/utils.py -> build/lib/dateutil
[2020-11-12T12:03:52.126Z] copying dateutil/tzwin.py -> build/lib/dateutil
[2020-11-12T12:03:52.126Z] copying dateutil/rrule.py -> build/lib/dateutil
[2020-11-12T12:03:52.126Z] creating build/lib/dateutil/tz
[2020-11-12T12:03:52.126Z] copying dateutil/tz/__init__.py -> build/lib/dateutil/tz
[2020-11-12T12:03:52.126Z] copying dateutil/tz/_factories.py -> build/lib/dateutil/tz
[2020-11-12T12:03:52.126Z] copying dateutil/tz/_common.py -> build/lib/dateutil/tz
[2020-11-12T12:03:52.126Z] copying dateutil/tz/tz.py -> build/lib/dateutil/tz
[2020-11-12T12:03:52.126Z] copying dateutil/tz/win.py -> build/lib/dateutil/tz
[2020-11-12T12:03:52.126Z] creating build/lib/dateutil/zoneinfo
[2020-11-12T12:03:52.126Z] copying dateutil/zoneinfo/__init__.py -> build/lib/dateutil/zoneinfo
[2020-11-12T12:03:52.126Z] copying dateutil/zoneinfo/rebuild.py -> build/lib/dateutil/zoneinfo
[2020-11-12T12:03:52.126Z] creating build/lib/dateutil/parser
[2020-11-12T12:03:52.126Z] copying dateutil/parser/__init__.py -> build/lib/dateutil/parser
[2020-11-12T12:03:52.126Z] copying dateutil/parser/_parser.py -> build/lib/dateutil/parser
[2020-11-12T12:03:52.126Z] copying dateutil/parser/isoparser.py -> build/lib/dateutil/parser
[2020-11-12T12:03:52.126Z] copying dateutil/zoneinfo/dateutil-zoneinfo.tar.gz -> build/lib/dateutil/zoneinfo
[2020-11-12T12:03:52.126Z] ==> Starting check()...
[2020-11-12T12:03:55.354Z] ============================= test session starts ==============================
[2020-11-12T12:03:55.354Z] platform linux -- Python 3.9.0, pytest-6.1.2, py-1.9.0, pluggy-0.13.1
[2020-11-12T12:03:55.354Z] rootdir: /build/python-dateutil/src/python-dateutil-2.8.1, configfile: setup.cfg
[2020-11-12T12:03:55.354Z] plugins: hypothesis-5.41.2
[2020-11-12T12:03:55.354Z] collected 2076 items
[2020-11-12T12:03:55.354Z] 
[2020-11-12T12:03:55.354Z] dateutil/test/test_easter.py ........................................... [  2%]
[2020-11-12T12:03:55.354Z] ........................................................................ [  5%]
[2020-11-12T12:03:55.354Z] ................................................                         [  7%]
[2020-11-12T12:03:55.354Z] dateutil/test/test_import_star.py .                                      [  7%]
[2020-11-12T12:03:55.354Z] dateutil/test/test_imports.py .................sss...                    [  9%]
[2020-11-12T12:03:55.354Z] dateutil/test/test_internals.py ....                                     [  9%]
[2020-11-12T12:03:55.354Z] dateutil/test/test_isoparser.py ........................................ [ 11%]
[2020-11-12T12:03:55.354Z] ........................................................................ [ 14%]
[2020-11-12T12:03:55.605Z] ........................................................................ [ 18%]
[2020-11-12T12:03:55.605Z] ........................................................................ [ 21%]
[2020-11-12T12:03:55.605Z] ........................................................................ [ 25%]
[2020-11-12T12:03:55.855Z] .......x...x............................................................ [ 28%]
[2020-11-12T12:03:55.855Z] ........................................................................ [ 31%]
[2020-11-12T12:03:55.855Z] ........................................................................ [ 35%]
[2020-11-12T12:03:56.105Z] .....................xx                                                  [ 36%]
[2020-11-12T12:03:56.105Z] dateutil/test/test_parser.py ........................................... [ 38%]
[2020-11-12T12:03:56.105Z] ........................................................................ [ 42%]
[2020-11-12T12:03:56.356Z] ........................................................................ [ 45%]
[2020-11-12T12:03:57.106Z] .................................xxxxxxxxxxxxx.........                  [ 48%]
[2020-11-12T12:03:57.106Z] dateutil/test/test_relativedelta.py .................................... [ 49%]
[2020-11-12T12:03:57.106Z] .............................................                            [ 52%]
[2020-11-12T12:03:57.357Z] dateutil/test/test_rrule.py ............................................ [ 54%]
[2020-11-12T12:03:57.357Z] ........................................................................ [ 57%]
[2020-11-12T12:03:57.607Z] ........................................................................ [ 61%]
[2020-11-12T12:03:57.607Z] ........................................................................ [ 64%]
[2020-11-12T12:03:57.857Z] ........................................................................ [ 68%]
[2020-11-12T12:03:58.107Z] ........................................................................ [ 71%]
[2020-11-12T12:03:58.358Z] ........................................................................ [ 75%]
[2020-11-12T12:03:58.608Z] ................................................................x....... [ 78%]
[2020-11-12T12:03:58.608Z] ..............                                                           [ 79%]
[2020-11-12T12:03:58.608Z] dateutil/test/test_tz.py ............................s...............s.. [ 81%]
[2020-11-12T12:03:58.858Z] ...............................F...........s............................ [ 84%]
[2020-11-12T12:03:59.359Z] .x.....s......................................s......................... [ 88%]
[2020-11-12T12:03:59.609Z] ..s..................................................................... [ 91%]
[2020-11-12T12:03:59.609Z] ............s......................................s.sssssssssssssssssss [ 95%]
[2020-11-12T12:03:59.859Z] sssssssssssssss....s..........s......................................... [ 98%]
[2020-11-12T12:03:59.859Z] ...............                                                          [ 99%]
[2020-11-12T12:03:59.859Z] dateutil/test/test_utils.py .......                                      [ 99%]
[2020-11-12T12:04:00.110Z] dateutil/test/property/test_isoparse_prop.py .                           [ 99%]
[2020-11-12T12:04:00.360Z] dateutil/test/property/test_parser_prop.py ..                            [ 99%]
[2020-11-12T12:04:00.360Z] docs/exercises/solutions/mlk_day_rrule_solution.py .                     [100%]
[2020-11-12T12:04:00.360Z] 
[2020-11-12T12:04:00.360Z] =================================== FAILURES ===================================
[2020-11-12T12:04:00.360Z] ______________________ test_tzlocal_local_time_trim_colon ______________________
[2020-11-12T12:04:00.360Z] 
[2020-11-12T12:04:00.360Z]     @mark_tzlocal_nix
[2020-11-12T12:04:00.360Z]     def test_tzlocal_local_time_trim_colon():
[2020-11-12T12:04:00.360Z]         with TZEnvContext(':/etc/localtime'):
[2020-11-12T12:04:00.360Z] >           assert tz.gettz() is not None
[2020-11-12T12:04:00.360Z] E           assert None is not None
[2020-11-12T12:04:00.360Z] E            +  where None = <dateutil.tz.tz.__get_gettz.<locals>.GettzFunc object at 0x7f8d087959d0>()
[2020-11-12T12:04:00.360Z] E            +    where <dateutil.tz.tz.__get_gettz.<locals>.GettzFunc object at 0x7f8d087959d0> = tz.gettz
[2020-11-12T12:04:00.360Z] 
[2020-11-12T12:04:00.360Z] dateutil/test/test_tz.py:990: AssertionError
[2020-11-12T12:04:00.360Z] =========================== short test summary info ============================
[2020-11-12T12:04:00.360Z] FAILED dateutil/test/test_tz.py::test_tzlocal_local_time_trim_colon - assert ...
[2020-11-12T12:04:00.360Z] ============ 1 failed, 2009 passed, 47 skipped, 19 xfailed in 7.54s ============
[2020-11-12T12:04:00.611Z] ==> ERROR: A failure occurred in check().
[2020-11-12T12:04:00.611Z]     Aborting...
[2020-11-12T12:04:01.522Z] ==> ERROR: Build failed, check /build/buildpkg/goblins-x86_64/jenkins/build
[Pipeline] }
[2020-11-12T12:04:01.525Z] ERROR: Failed to build source
[2020-11-12T12:04:01.525Z] ERROR: script returned exit code 255
[Pipeline] // catchError
[Pipeline] }
[Pipeline] // dir
Post stage
[Pipeline] emailext
[2020-11-12T12:04:01.609Z] Sending email to: artix-build-failures at artixlinux.org


More information about the artix-build-failures mailing list