[artix-build-failures] [galaxy-goblins] Failure: opencc

jenkins at artixlinux.org jenkins at artixlinux.org
Thu Nov 12 03:40:00 CET 2020


   Failure

   Build: x86_64/community-staging

   Packages:

   opencc-1.1.1-5-x86_64.pkg.tar.zst opencc-doc-1.1.1-5-x86_64.pkg.tar.zst

   author: Nathan Owens

   email: ndowens at artixlinux.org

   [1]https://orion.artixlinux.org/job/packagesO/job/opencc/job/master/3/

References

   1. https://orion.artixlinux.org/job/packagesO/job/opencc/job/master/3/
-------------- next part --------------
Push event to branch master
Querying the current revision of branch master...
Current revision of branch master is 6fe5c29e88bbbe81c4238418dc2ce73eee361270
Obtained Jenkinsfile from 6fe5c29e88bbbe81c4238418dc2ce73eee361270
Running in Durability level: PERFORMANCE_OPTIMIZED
Loading library artix-ci at master
Attempting to resolve master from remote references...
 > git --version # timeout=10
 > git --version # 'git version 2.27.0'
 > git ls-remote -- https://gitea.artixlinux.org/artix/pipeline-libs.git # timeout=10
Found match: refs/heads/master revision 6271842ae2c48166f805c969881e1444705a8d74
Selected Git installation does not exist. Using Default
The recommended git tool is: NONE
Warning: CredentialId "jenkins-gotea-token" could not be found.
 > git rev-parse --is-inside-work-tree # timeout=10
Fetching changes from the remote Git repository
 > git config remote.origin.url https://gitea.artixlinux.org/artix/pipeline-libs.git # timeout=10
Fetching without tags
Fetching upstream changes from https://gitea.artixlinux.org/artix/pipeline-libs.git
 > git --version # timeout=10
 > git --version # 'git version 2.27.0'
 > git fetch --no-tags --force --progress -- https://gitea.artixlinux.org/artix/pipeline-libs.git +refs/heads/master:refs/remotes/origin/master # timeout=10
Checking out Revision 6271842ae2c48166f805c969881e1444705a8d74 (master)
 > git config core.sparsecheckout # timeout=10
 > git checkout -f 6271842ae2c48166f805c969881e1444705a8d74 # timeout=10
Commit message: "zse map type prop instead of def type"
[Gitea] Notifying branch build status: PENDING Build started...
[Gitea] Notified
[Pipeline] Start of Pipeline
[Pipeline] node
Still waiting to schedule task
Waiting for next available executor
Running on Jenkins in /var/lib/jenkins/workspace/packagesO_opencc_master
[Pipeline] {
[Pipeline] timestamps
[Pipeline] {
[Pipeline] stage
[Pipeline] { (Prepare)
[Pipeline] catchError
[Pipeline] {
[Pipeline] checkout
[2020-11-12T02:39:30.361Z] The recommended git tool is: NONE
[2020-11-12T02:39:30.361Z] Warning: CredentialId "jenkins-gotea-token" could not be found.
[2020-11-12T02:39:30.362Z]  > git rev-parse --is-inside-work-tree # timeout=10
[2020-11-12T02:39:30.366Z] Fetching changes from the remote Git repository
[2020-11-12T02:39:30.366Z]  > git config remote.origin.url https://237b7412742b4068af4173944de150f12959f4d3@gitea.artixlinux.org/packagesO/opencc.git # timeout=10
[2020-11-12T02:39:30.371Z] Cleaning workspace
[2020-11-12T02:39:30.371Z]  > git rev-parse --verify HEAD # timeout=10
[2020-11-12T02:39:30.375Z] Resetting working tree
[2020-11-12T02:39:30.375Z]  > git reset --hard # timeout=10
[2020-11-12T02:39:30.380Z]  > git clean -fdx # timeout=10
[2020-11-12T02:39:30.386Z] Fetching without tags
[2020-11-12T02:39:30.386Z] Fetching upstream changes from https://237b7412742b4068af4173944de150f12959f4d3@gitea.artixlinux.org/packagesO/opencc.git
[2020-11-12T02:39:30.386Z]  > git --version # timeout=10
[2020-11-12T02:39:30.390Z]  > git --version # 'git version 2.27.0'
[2020-11-12T02:39:30.390Z]  > git fetch --no-tags --force --progress -- https://237b7412742b4068af4173944de150f12959f4d3@gitea.artixlinux.org/packagesO/opencc.git +refs/heads/master:refs/remotes/origin/master # timeout=10
[2020-11-12T02:39:30.533Z] Checking out Revision 6fe5c29e88bbbe81c4238418dc2ce73eee361270 (master)
[2020-11-12T02:39:30.533Z]  > git config core.sparsecheckout # timeout=10
[2020-11-12T02:39:30.538Z]  > git checkout -f 6fe5c29e88bbbe81c4238418dc2ce73eee361270 # timeout=10
[2020-11-12T02:39:30.588Z] Commit message: "[trunk] -> [community-staging] 'opencc-1.1.1-5' add"
[2020-11-12T02:39:30.588Z]  > git rev-list --no-walk ba970730e80a19aa81aa53c22e76f62d4a6b24ce # timeout=10
[2020-11-12T02:39:30.600Z] Cleaning workspace
[2020-11-12T02:39:30.600Z]  > git rev-parse --verify HEAD # timeout=10
[2020-11-12T02:39:30.605Z] Resetting working tree
[2020-11-12T02:39:30.605Z]  > git reset --hard # timeout=10
[2020-11-12T02:39:30.611Z]  > git clean -fdx # timeout=10
[2020-11-12T02:39:30.617Z] [Gitea] Notifying branch build status: PENDING Build started...
[2020-11-12T02:39:30.741Z] [Gitea] Notified
[Pipeline] libraryResource
[Pipeline] readYaml
[Pipeline] sh
[2020-11-12T02:39:31.018Z] + git show -s --format=%an 6fe5c29e88bbbe81c4238418dc2ce73eee361270
[Pipeline] sh
[2020-11-12T02:39:31.276Z] + git show -s --format=%ae 6fe5c29e88bbbe81c4238418dc2ce73eee361270
[Pipeline] sh
[2020-11-12T02:39:31.534Z] + git show --pretty=format: --name-status 6fe5c29e88bbbe81c4238418dc2ce73eee361270
[Pipeline] fileExists
[Pipeline] sh
[2020-11-12T02:39:31.809Z] + pkg2yaml -d x86_64/community-staging
[Pipeline] readYaml
[Pipeline] }
[Pipeline] // catchError
[Pipeline] }
[Pipeline] // stage
[Pipeline] stage
[Pipeline] { (Build)
[Pipeline] withCredentials
[2020-11-12T02:39:31.994Z] Masking supported pattern matches of $BUILDBOT_GPGP
[Pipeline] {
[Pipeline] echo
[2020-11-12T02:39:32.029Z] isLibBump: false
[Pipeline] dir
[2020-11-12T02:39:32.034Z] Running in /var/lib/jenkins/workspace/packagesO_opencc_master/x86_64/community-staging
[Pipeline] {
[Pipeline] catchError
[Pipeline] {
[Pipeline] sh
[2020-11-12T02:39:32.311Z] + buildpkg -C -d galaxy-goblins
[2020-11-12T02:39:35.539Z] :: Synchronizing package databases...
[2020-11-12T02:39:35.539Z]  goblins is up to date
[2020-11-12T02:39:35.539Z]  gremlins is up to date
[2020-11-12T02:39:35.539Z]  system is up to date
[2020-11-12T02:39:35.539Z]  world is up to date
[2020-11-12T02:39:35.539Z] downloading galaxy-goblins.db...
[2020-11-12T02:39:35.539Z]  galaxy-gremlins is up to date
[2020-11-12T02:39:35.539Z]  galaxy is up to date
[2020-11-12T02:39:35.539Z]  extra is up to date
[2020-11-12T02:39:35.539Z]  community-staging is up to date
[2020-11-12T02:39:35.539Z]  community-testing is up to date
[2020-11-12T02:39:35.539Z]  community is up to date
[2020-11-12T02:39:35.539Z] :: Starting full system upgrade...
[2020-11-12T02:39:35.789Z]  there is nothing to do
[2020-11-12T02:39:37.133Z] ==> Building in chroot for [goblins] (x86_64)...
[2020-11-12T02:39:37.683Z] ==> Synchronizing chroot copy [/build/buildpkg/goblins-x86_64/root] -> [jenkins]...done
[2020-11-12T02:39:39.545Z] ==> Making package: opencc 1.1.1-5 (Thu Nov 12 03:39:39 2020)
[2020-11-12T02:39:39.545Z] ==> Retrieving sources...
[2020-11-12T02:39:39.545Z]   -> Found opencc-1.1.1.tar.gz
[2020-11-12T02:39:39.545Z]   -> Found opencc-fix-missing-include.patch
[2020-11-12T02:39:39.545Z] ==> Validating source files with sha512sums...
[2020-11-12T02:39:39.545Z]     opencc-1.1.1.tar.gz ... Passed
[2020-11-12T02:39:39.545Z]     opencc-fix-missing-include.patch ... Passed
[2020-11-12T02:39:46.026Z] ==> Making package: opencc 1.1.1-5 (Thu 12 Nov 2020 02:39:45 AM UTC)
[2020-11-12T02:39:46.027Z] ==> Checking runtime dependencies...
[2020-11-12T02:39:46.027Z] ==> Checking buildtime dependencies...
[2020-11-12T02:39:46.027Z] ==> Installing missing dependencies...
[2020-11-12T02:39:46.277Z] resolving dependencies...
[2020-11-12T02:39:46.277Z] looking for conflicting packages...
[2020-11-12T02:39:46.277Z] 
[2020-11-12T02:39:46.277Z] Package (15)                 New Version       Net Change  Download Size
[2020-11-12T02:39:46.277Z] 
[2020-11-12T02:39:46.277Z] world/jsoncpp                1.9.4-1             1.76 MiB               
[2020-11-12T02:39:46.277Z] system/libnsl                1.3.0-1             0.19 MiB               
[2020-11-12T02:39:46.277Z] world/libuv                  1.40.0-1            0.53 MiB               
[2020-11-12T02:39:46.277Z] goblins/python               3.9.0-1            80.76 MiB               
[2020-11-12T02:39:46.277Z] goblins/python-appdirs       1.4.4-2             0.07 MiB               
[2020-11-12T02:39:46.277Z] goblins/python-ordered-set   4.0.2-2             0.06 MiB               
[2020-11-12T02:39:46.277Z] goblins/python-packaging     20.4-3              0.17 MiB               
[2020-11-12T02:39:46.277Z] goblins/python-pyparsing     2.4.7-2             0.73 MiB               
[2020-11-12T02:39:46.277Z] goblins/python-six           1.15.0-2            0.09 MiB               
[2020-11-12T02:39:46.277Z] world/rhash                  1.4.0-1             0.29 MiB               
[2020-11-12T02:39:46.277Z] world/shared-mime-info       2.0+1+g6bf9e4f-2    4.32 MiB               
[2020-11-12T02:39:46.277Z] world/cmake                  3.18.4-1           43.13 MiB               
[2020-11-12T02:39:46.277Z] world/doxygen                1.8.20-1           16.54 MiB       4.38 MiB
[2020-11-12T02:39:46.277Z] goblins/python-setuptools    1:50.3.2-3          2.98 MiB               
[2020-11-12T02:39:46.277Z] galaxy-goblins/python-wheel  0.35.1-3            0.16 MiB       0.04 MiB
[2020-11-12T02:39:46.277Z] 
[2020-11-12T02:39:46.277Z] Total Download Size:     4.42 MiB
[2020-11-12T02:39:46.277Z] Total Installed Size:  151.80 MiB
[2020-11-12T02:39:46.277Z] 
[2020-11-12T02:39:46.277Z] :: Proceed with installation? [Y/n] 
[2020-11-12T02:39:46.277Z] :: Retrieving packages...
[2020-11-12T02:39:46.277Z] downloading doxygen-1.8.20-1-x86_64.pkg.tar.zst...
[2020-11-12T02:39:46.277Z] downloading python-wheel-0.35.1-3-any.pkg.tar.zst...
[2020-11-12T02:39:46.277Z] checking keyring...
[2020-11-12T02:39:46.277Z] checking package integrity...
[2020-11-12T02:39:47.621Z] loading package files...
[2020-11-12T02:39:47.621Z] checking for file conflicts...
[2020-11-12T02:39:47.621Z] checking available disk space...
[2020-11-12T02:39:47.621Z] :: Processing package changes...
[2020-11-12T02:39:47.621Z] installing shared-mime-info...
[2020-11-12T02:39:47.621Z] installing jsoncpp...
[2020-11-12T02:39:47.621Z] Optional dependencies for jsoncpp
[2020-11-12T02:39:47.621Z]     jsoncpp-doc: documentation
[2020-11-12T02:39:47.621Z] installing libnsl...
[2020-11-12T02:39:47.621Z] installing libuv...
[2020-11-12T02:39:47.621Z] installing rhash...
[2020-11-12T02:39:47.621Z] installing cmake...
[2020-11-12T02:39:47.871Z] Optional dependencies for cmake
[2020-11-12T02:39:47.871Z]     qt5-base: cmake-gui
[2020-11-12T02:39:47.871Z] installing doxygen...
[2020-11-12T02:39:47.871Z] Optional dependencies for doxygen
[2020-11-12T02:39:47.871Z]     graphviz: for caller/callee graph generation
[2020-11-12T02:39:47.871Z]     qt5-base: for doxywizard
[2020-11-12T02:39:47.871Z] installing python...
[2020-11-12T02:39:48.122Z] Optional dependencies for python
[2020-11-12T02:39:48.122Z]     python-setuptools [pending]
[2020-11-12T02:39:48.122Z]     python-pip
[2020-11-12T02:39:48.122Z]     sqlite [installed]
[2020-11-12T02:39:48.122Z]     mpdecimal: for decimal
[2020-11-12T02:39:48.122Z]     xz: for lzma [installed]
[2020-11-12T02:39:48.122Z]     tk: for tkinter
[2020-11-12T02:39:48.122Z] installing python-appdirs...
[2020-11-12T02:39:48.122Z] installing python-pyparsing...
[2020-11-12T02:39:48.122Z] installing python-six...
[2020-11-12T02:39:48.122Z] installing python-packaging...
[2020-11-12T02:39:48.122Z] installing python-ordered-set...
[2020-11-12T02:39:48.122Z] installing python-setuptools...
[2020-11-12T02:39:48.122Z] installing python-wheel...
[2020-11-12T02:39:48.122Z] Optional dependencies for python-wheel
[2020-11-12T02:39:48.122Z]     python-xdg: for wheel.signatures
[2020-11-12T02:39:48.372Z] :: Running post-transaction hooks...
[2020-11-12T02:39:48.372Z] (1/1) Updating the MIME type database...
[2020-11-12T02:39:48.623Z] ==> Retrieving sources...
[2020-11-12T02:39:48.623Z]   -> Found opencc-1.1.1.tar.gz
[2020-11-12T02:39:48.623Z]   -> Found opencc-fix-missing-include.patch
[2020-11-12T02:39:48.623Z] ==> WARNING: Skipping all source file integrity checks.
[2020-11-12T02:39:48.623Z] ==> Extracting sources...
[2020-11-12T02:39:48.623Z]   -> Extracting opencc-1.1.1.tar.gz with bsdtar
[2020-11-12T02:39:48.873Z] ==> Starting prepare()...
[2020-11-12T02:39:48.873Z] patching file src/SimpleConverter.hpp
[2020-11-12T02:39:48.873Z] ==> Starting build()...
[2020-11-12T02:39:48.873Z] CMake Warning:
[2020-11-12T02:39:48.873Z]   No source or binary directory provided.  Both will be assumed to be the
[2020-11-12T02:39:48.873Z]   same as the current working directory, but note that this warning will
[2020-11-12T02:39:48.873Z]   become a fatal error in future CMake releases.
[2020-11-12T02:39:48.873Z] 
[2020-11-12T02:39:48.873Z] 
[2020-11-12T02:39:49.124Z] -- The CXX compiler identification is GNU 10.2.0
[2020-11-12T02:39:49.124Z] -- Detecting CXX compiler ABI info
[2020-11-12T02:39:49.124Z] -- Detecting CXX compiler ABI info - done
[2020-11-12T02:39:49.374Z] -- Check for working CXX compiler: /usr/bin/c++ - skipped
[2020-11-12T02:39:49.374Z] -- Detecting CXX compile features
[2020-11-12T02:39:49.374Z] -- Detecting CXX compile features - done
[2020-11-12T02:39:49.374Z] -- Use bundled marisa library.
[2020-11-12T02:39:49.374Z] -- Performing Test COMPILER_HAS_HIDDEN_VISIBILITY
[2020-11-12T02:39:49.374Z] -- Performing Test COMPILER_HAS_HIDDEN_VISIBILITY - Success
[2020-11-12T02:39:49.374Z] -- Performing Test COMPILER_HAS_HIDDEN_INLINE_VISIBILITY
[2020-11-12T02:39:49.625Z] -- Performing Test COMPILER_HAS_HIDDEN_INLINE_VISIBILITY - Success
[2020-11-12T02:39:49.625Z] -- Performing Test COMPILER_HAS_DEPRECATED_ATTR
[2020-11-12T02:39:49.625Z] -- Performing Test COMPILER_HAS_DEPRECATED_ATTR - Success
[2020-11-12T02:39:49.875Z] -- Found Doxygen: /usr/bin/doxygen (found version "1.8.20") found components: doxygen missing components: dot
[2020-11-12T02:39:49.875Z] -- Found PythonInterp: /usr/bin/python (found version "3.9") 
[2020-11-12T02:39:49.875Z] -- Configuring done
[2020-11-12T02:39:49.875Z] -- Generating done
[2020-11-12T02:39:49.875Z] -- Build files have been written to: /build/opencc/src/OpenCC-ver.1.1.1
[2020-11-12T02:39:49.875Z] Scanning dependencies of target apidoc
[2020-11-12T02:39:49.875Z] Scanning dependencies of target marisa
[2020-11-12T02:39:49.875Z] [  1%] Building API Documentation
[2020-11-12T02:39:50.125Z] warning: Tag 'TCL_SUBST' at line 205 of file '/build/opencc/src/OpenCC-ver.1.1.1/doc/opencc.doxy' has become obsolete.
[2020-11-12T02:39:50.125Z]          To avoid this warning please remove this line from your configuration file or upgrade it using "doxygen -u"
[2020-11-12T02:39:50.125Z] warning: Tag 'PERL_PATH' at line 1617 of file '/build/opencc/src/OpenCC-ver.1.1.1/doc/opencc.doxy' has become obsolete.
[2020-11-12T02:39:50.126Z]          To avoid this warning please remove this line from your configuration file or upgrade it using "doxygen -u"
[2020-11-12T02:39:50.126Z] warning: Tag 'MSCGEN_PATH' at line 1638 of file '/build/opencc/src/OpenCC-ver.1.1.1/doc/opencc.doxy' has become obsolete.
[2020-11-12T02:39:50.126Z]          To avoid this warning please remove this line from your configuration file or upgrade it using "doxygen -u"
[2020-11-12T02:39:50.126Z] [  3%] Building CXX object deps/marisa-0.2.5/CMakeFiles/marisa.dir/lib/marisa/grimoire/trie/tail.cc.o
[2020-11-12T02:39:50.126Z] [  5%] Building CXX object deps/marisa-0.2.5/CMakeFiles/marisa.dir/lib/marisa/grimoire/io/writer.cc.o
[2020-11-12T02:39:50.126Z] [  6%] Building CXX object deps/marisa-0.2.5/CMakeFiles/marisa.dir/lib/marisa/grimoire/io/reader.cc.o
[2020-11-12T02:39:50.126Z] [  8%] Building CXX object deps/marisa-0.2.5/CMakeFiles/marisa.dir/lib/marisa/grimoire/vector/bit-vector.cc.o
[2020-11-12T02:39:50.126Z] [ 10%] Building CXX object deps/marisa-0.2.5/CMakeFiles/marisa.dir/lib/marisa/keyset.cc.o
[2020-11-12T02:39:50.126Z] [ 13%] Building CXX object deps/marisa-0.2.5/CMakeFiles/marisa.dir/lib/marisa/agent.cc.o
[2020-11-12T02:39:50.126Z] [ 13%] Building CXX object deps/marisa-0.2.5/CMakeFiles/marisa.dir/lib/marisa/trie.cc.o
[2020-11-12T02:39:50.126Z] [ 15%] Building CXX object deps/marisa-0.2.5/CMakeFiles/marisa.dir/lib/marisa/grimoire/trie/louds-trie.cc.o
[2020-11-12T02:39:50.126Z] [ 16%] Building CXX object deps/marisa-0.2.5/CMakeFiles/marisa.dir/lib/marisa/grimoire/io/mapper.cc.o
[2020-11-12T02:39:50.376Z] [ 16%] Built target apidoc
[2020-11-12T02:39:52.858Z] [ 18%] Linking CXX static library libmarisa.a
[2020-11-12T02:39:52.859Z] [ 18%] Built target marisa
[2020-11-12T02:39:52.859Z] Scanning dependencies of target libopencc
[2020-11-12T02:39:52.859Z] [ 20%] Building CXX object src/CMakeFiles/libopencc.dir/DictGroup.cpp.o
[2020-11-12T02:39:53.109Z] [ 22%] Building CXX object src/CMakeFiles/libopencc.dir/Converter.cpp.o
[2020-11-12T02:39:53.109Z] [ 25%] Building CXX object src/CMakeFiles/libopencc.dir/Lexicon.cpp.o
[2020-11-12T02:39:53.109Z] [ 25%] Building CXX object src/CMakeFiles/libopencc.dir/MarisaDict.cpp.o
[2020-11-12T02:39:53.109Z] [ 28%] Building CXX object src/CMakeFiles/libopencc.dir/MaxMatchSegmentation.cpp.o
[2020-11-12T02:39:53.109Z] [ 28%] Building CXX object src/CMakeFiles/libopencc.dir/SimpleConverter.cpp.o
[2020-11-12T02:39:53.109Z] [ 30%] Building CXX object src/CMakeFiles/libopencc.dir/SerializedValues.cpp.o
[2020-11-12T02:39:53.109Z] [ 35%] Building CXX object src/CMakeFiles/libopencc.dir/Segmentation.cpp.o
[2020-11-12T02:39:53.109Z] [ 33%] Building CXX object src/CMakeFiles/libopencc.dir/PhraseExtract.cpp.o
[2020-11-12T02:39:53.109Z] [ 35%] Building CXX object src/CMakeFiles/libopencc.dir/TextDict.cpp.o
[2020-11-12T02:39:53.109Z] [ 37%] Building CXX object src/CMakeFiles/libopencc.dir/Conversion.cpp.o
[2020-11-12T02:39:53.109Z] [ 40%] Building CXX object src/CMakeFiles/libopencc.dir/Config.cpp.o
[2020-11-12T02:39:53.109Z] [ 42%] Building CXX object src/CMakeFiles/libopencc.dir/UTF8StringSlice.cpp.o
[2020-11-12T02:39:53.109Z] [ 40%] Building CXX object src/CMakeFiles/libopencc.dir/ConversionChain.cpp.o
[2020-11-12T02:39:53.109Z] [ 44%] Building CXX object src/CMakeFiles/libopencc.dir/UTF8Util.cpp.o
[2020-11-12T02:39:53.109Z] [ 45%] Building CXX object src/CMakeFiles/libopencc.dir/Dict.cpp.o
[2020-11-12T02:39:53.109Z] [ 47%] Building CXX object src/CMakeFiles/libopencc.dir/BinaryDict.cpp.o
[2020-11-12T02:39:53.109Z] [ 49%] Building CXX object src/CMakeFiles/libopencc.dir/DictConverter.cpp.o
[2020-11-12T02:39:53.109Z] [ 50%] Building CXX object src/CMakeFiles/libopencc.dir/DictEntry.cpp.o
[2020-11-12T02:39:53.109Z] [ 52%] Building CXX object src/CMakeFiles/libopencc.dir/DartsDict.cpp.o
[2020-11-12T02:39:53.660Z] /build/opencc/src/OpenCC-ver.1.1.1/src/PhraseExtract.cpp: In member function ‘void opencc::PhraseExtract::DictType::BuildTrie()’:
[2020-11-12T02:39:53.660Z] /build/opencc/src/OpenCC-ver.1.1.1/src/PhraseExtract.cpp:104:23: warning: comparison of integer expressions of different signedness: ‘int’ and ‘std::vector<std::pair<opencc::UTF8StringSliceBase<unsigned char>, opencc::PhraseExtract::Signals> >::size_type’ {aka ‘long unsigned int’} [-Wsign-compare]
[2020-11-12T02:39:53.660Z]   104 |     for (int i = 0; i < items.size(); i++) {
[2020-11-12T02:39:53.660Z]       |                     ~~^~~~~~~~~~~~~~
[2020-11-12T02:39:54.211Z] In file included from /build/opencc/src/OpenCC-ver.1.1.1/src/Config.cpp:23:
[2020-11-12T02:39:54.211Z] /build/opencc/src/OpenCC-ver.1.1.1/src/../deps/rapidjson-1.1.0/document.h: In instantiation of ‘void rapidjson::GenericValue<Encoding, Allocator>::SetObjectRaw(rapidjson::GenericValue<Encoding, Allocator>::Member*, rapidjson::SizeType, Allocator&) [with Encoding = rapidjson::UTF8<>; Allocator = rapidjson::MemoryPoolAllocator<>; rapidjson::GenericValue<Encoding, Allocator>::Member = rapidjson::GenericMember<rapidjson::UTF8<>, rapidjson::MemoryPoolAllocator<> >; rapidjson::SizeType = unsigned int]’:
[2020-11-12T02:39:54.211Z] /build/opencc/src/OpenCC-ver.1.1.1/src/../deps/rapidjson-1.1.0/document.h:2363:55:   required from ‘bool rapidjson::GenericDocument<Encoding, Allocator, StackAllocator>::EndObject(rapidjson::SizeType) [with Encoding = rapidjson::UTF8<>; Allocator = rapidjson::MemoryPoolAllocator<>; StackAllocator = rapidjson::CrtAllocator; rapidjson::SizeType = unsigned int]’
[2020-11-12T02:39:54.211Z] /build/opencc/src/OpenCC-ver.1.1.1/src/../deps/rapidjson-1.1.0/reader.h:1736:40:   required from ‘rapidjson::GenericReader<SourceEncoding, TargetEncoding, StackAllocator>::IterativeParsingState rapidjson::GenericReader<SourceEncoding, TargetEncoding, StackAllocator>::Transit(rapidjson::GenericReader<SourceEncoding, TargetEncoding, StackAllocator>::IterativeParsingState, rapidjson::GenericReader<SourceEncoding, TargetEncoding, StackAllocator>::Token, rapidjson::GenericReader<SourceEncoding, TargetEncoding, StackAllocator>::IterativeParsingState, InputStream&, Handler&) [with unsigned int parseFlags = 1; InputStream = rapidjson::GenericInsituStringStream<rapidjson::UTF8<> >; Handler = rapidjson::GenericDocument<rapidjson::UTF8<> >; SourceEncoding = rapidjson::UTF8<>; TargetEncoding = rapidjson::UTF8<>; StackAllocator = rapidjson::CrtAllocator]’
[2020-11-12T02:39:54.211Z] /build/opencc/src/OpenCC-ver.1.1.1/src/../deps/rapidjson-1.1.0/reader.h:1832:58:   required from ‘rapidjson::ParseResult rapidjson::GenericReader<SourceEncoding, TargetEncoding, StackAllocator>::IterativeParse(InputStream&, Handler&) [with unsigned int parseFlags = 1; InputStream = rapidjson::GenericInsituStringStream<rapidjson::UTF8<> >; Handler = rapidjson::GenericDocument<rapidjson::UTF8<> >; SourceEncoding = rapidjson::UTF8<>; TargetEncoding = rapidjson::UTF8<>; StackAllocator = rapidjson::CrtAllocator]’
[2020-11-12T02:39:54.211Z] /build/opencc/src/OpenCC-ver.1.1.1/src/../deps/rapidjson-1.1.0/reader.h:487:46:   required from ‘rapidjson::ParseResult rapidjson::GenericReader<SourceEncoding, TargetEncoding, StackAllocator>::Parse(InputStream&, Handler&) [with unsigned int parseFlags = 1; InputStream = rapidjson::GenericInsituStringStream<rapidjson::UTF8<> >; Handler = rapidjson::GenericDocument<rapidjson::UTF8<> >; SourceEncoding = rapidjson::UTF8<>; TargetEncoding = rapidjson::UTF8<>; StackAllocator = rapidjson::CrtAllocator]’
[2020-11-12T02:39:54.211Z] /build/opencc/src/OpenCC-ver.1.1.1/src/../deps/rapidjson-1.1.0/document.h:2159:57:   required from ‘rapidjson::GenericDocument<Encoding, Allocator, StackAllocator>& rapidjson::GenericDocument<Encoding, Allocator, StackAllocator>::ParseStream(InputStream&) [with unsigned int parseFlags = 1; SourceEncoding = rapidjson::UTF8<>; InputStream = rapidjson::GenericInsituStringStream<rapidjson::UTF8<> >; Encoding = rapidjson::UTF8<>; Allocator = rapidjson::MemoryPoolAllocator<>; StackAllocator = rapidjson::CrtAllocator]’
[2020-11-12T02:39:54.211Z] /build/opencc/src/OpenCC-ver.1.1.1/src/../deps/rapidjson-1.1.0/document.h:2175:62:   required from ‘rapidjson::GenericDocument<Encoding, Allocator, StackAllocator>& rapidjson::GenericDocument<Encoding, Allocator, StackAllocator>::ParseStream(InputStream&) [with unsigned int parseFlags = 1; InputStream = rapidjson::GenericInsituStringStream<rapidjson::UTF8<> >; Encoding = rapidjson::UTF8<>; Allocator = rapidjson::MemoryPoolAllocator<>; StackAllocator = rapidjson::CrtAllocator]’
[2020-11-12T02:39:54.211Z] /build/opencc/src/OpenCC-ver.1.1.1/src/../deps/rapidjson-1.1.0/document.h:2200:58:   required from ‘rapidjson::GenericDocument<Encoding, Allocator, StackAllocator>& rapidjson::GenericDocument<Encoding, Allocator, StackAllocator>::ParseInsitu(rapidjson::GenericDocument<Encoding, Allocator, StackAllocator>::Ch*) [with unsigned int parseFlags = 0; Encoding = rapidjson::UTF8<>; Allocator = rapidjson::MemoryPoolAllocator<>; StackAllocator = rapidjson::CrtAllocator; rapidjson::GenericDocument<Encoding, Allocator, StackAllocator>::Ch = char]’
[2020-11-12T02:39:54.211Z] /build/opencc/src/OpenCC-ver.1.1.1/src/Config.cpp:242:53:   required from here
[2020-11-12T02:39:54.211Z] /build/opencc/src/OpenCC-ver.1.1.1/src/../deps/rapidjson-1.1.0/document.h:1952:24: warning: ‘void* memcpy(void*, const void*, size_t)’ writing to an object of type ‘rapidjson::GenericValue<rapidjson::UTF8<> >::Member’ {aka ‘struct rapidjson::GenericMember<rapidjson::UTF8<>, rapidjson::MemoryPoolAllocator<> >’} with no trivial copy-assignment; use copy-assignment instead [-Wclass-memaccess]
[2020-11-12T02:39:54.211Z]  1952 |             std::memcpy(m, members, count * sizeof(Member));
[2020-11-12T02:39:54.211Z]       |             ~~~~~~~~~~~^~~~~~~~~~~~~~~~~~~~~~~~~~~~~~~~~~~~
[2020-11-12T02:39:54.211Z] In file included from /build/opencc/src/OpenCC-ver.1.1.1/src/Config.cpp:23:
[2020-11-12T02:39:54.211Z] /build/opencc/src/OpenCC-ver.1.1.1/src/../deps/rapidjson-1.1.0/document.h:71:8: note: ‘rapidjson::GenericValue<rapidjson::UTF8<> >::Member’ {aka ‘struct rapidjson::GenericMember<rapidjson::UTF8<>, rapidjson::MemoryPoolAllocator<> >’} declared here
[2020-11-12T02:39:54.211Z]    71 | struct GenericMember {
[2020-11-12T02:39:54.211Z]       |        ^~~~~~~~~~~~~
[2020-11-12T02:39:54.211Z] In file included from /build/opencc/src/OpenCC-ver.1.1.1/src/Config.cpp:23:
[2020-11-12T02:39:54.211Z] /build/opencc/src/OpenCC-ver.1.1.1/src/../deps/rapidjson-1.1.0/document.h: In instantiation of ‘void rapidjson::GenericValue<Encoding, Allocator>::SetArrayRaw(rapidjson::GenericValue<Encoding, Allocator>*, rapidjson::SizeType, Allocator&) [with Encoding = rapidjson::UTF8<>; Allocator = rapidjson::MemoryPoolAllocator<>; rapidjson::SizeType = unsigned int]’:
[2020-11-12T02:39:54.211Z] /build/opencc/src/OpenCC-ver.1.1.1/src/../deps/rapidjson-1.1.0/document.h:2371:54:   required from ‘bool rapidjson::GenericDocument<Encoding, Allocator, StackAllocator>::EndArray(rapidjson::SizeType) [with Encoding = rapidjson::UTF8<>; Allocator = rapidjson::MemoryPoolAllocator<>; StackAllocator = rapidjson::CrtAllocator; rapidjson::SizeType = unsigned int]’
[2020-11-12T02:39:54.211Z] /build/opencc/src/OpenCC-ver.1.1.1/src/../deps/rapidjson-1.1.0/reader.h:1766:39:   required from ‘rapidjson::GenericReader<SourceEncoding, TargetEncoding, StackAllocator>::IterativeParsingState rapidjson::GenericReader<SourceEncoding, TargetEncoding, StackAllocator>::Transit(rapidjson::GenericReader<SourceEncoding, TargetEncoding, StackAllocator>::IterativeParsingState, rapidjson::GenericReader<SourceEncoding, TargetEncoding, StackAllocator>::Token, rapidjson::GenericReader<SourceEncoding, TargetEncoding, StackAllocator>::IterativeParsingState, InputStream&, Handler&) [with unsigned int parseFlags = 1; InputStream = rapidjson::GenericInsituStringStream<rapidjson::UTF8<> >; Handler = rapidjson::GenericDocument<rapidjson::UTF8<> >; SourceEncoding = rapidjson::UTF8<>; TargetEncoding = rapidjson::UTF8<>; StackAllocator = rapidjson::CrtAllocator]’
[2020-11-12T02:39:54.211Z] /build/opencc/src/OpenCC-ver.1.1.1/src/../deps/rapidjson-1.1.0/reader.h:1832:58:   required from ‘rapidjson::ParseResult rapidjson::GenericReader<SourceEncoding, TargetEncoding, StackAllocator>::IterativeParse(InputStream&, Handler&) [with unsigned int parseFlags = 1; InputStream = rapidjson::GenericInsituStringStream<rapidjson::UTF8<> >; Handler = rapidjson::GenericDocument<rapidjson::UTF8<> >; SourceEncoding = rapidjson::UTF8<>; TargetEncoding = rapidjson::UTF8<>; StackAllocator = rapidjson::CrtAllocator]’
[2020-11-12T02:39:54.211Z] /build/opencc/src/OpenCC-ver.1.1.1/src/../deps/rapidjson-1.1.0/reader.h:487:46:   required from ‘rapidjson::ParseResult rapidjson::GenericReader<SourceEncoding, TargetEncoding, StackAllocator>::Parse(InputStream&, Handler&) [with unsigned int parseFlags = 1; InputStream = rapidjson::GenericInsituStringStream<rapidjson::UTF8<> >; Handler = rapidjson::GenericDocument<rapidjson::UTF8<> >; SourceEncoding = rapidjson::UTF8<>; TargetEncoding = rapidjson::UTF8<>; StackAllocator = rapidjson::CrtAllocator]’
[2020-11-12T02:39:54.211Z] /build/opencc/src/OpenCC-ver.1.1.1/src/../deps/rapidjson-1.1.0/document.h:2159:57:   required from ‘rapidjson::GenericDocument<Encoding, Allocator, StackAllocator>& rapidjson::GenericDocument<Encoding, Allocator, StackAllocator>::ParseStream(InputStream&) [with unsigned int parseFlags = 1; SourceEncoding = rapidjson::UTF8<>; InputStream = rapidjson::GenericInsituStringStream<rapidjson::UTF8<> >; Encoding = rapidjson::UTF8<>; Allocator = rapidjson::MemoryPoolAllocator<>; StackAllocator = rapidjson::CrtAllocator]’
[2020-11-12T02:39:54.211Z] /build/opencc/src/OpenCC-ver.1.1.1/src/../deps/rapidjson-1.1.0/document.h:2175:62:   required from ‘rapidjson::GenericDocument<Encoding, Allocator, StackAllocator>& rapidjson::GenericDocument<Encoding, Allocator, StackAllocator>::ParseStream(InputStream&) [with unsigned int parseFlags = 1; InputStream = rapidjson::GenericInsituStringStream<rapidjson::UTF8<> >; Encoding = rapidjson::UTF8<>; Allocator = rapidjson::MemoryPoolAllocator<>; StackAllocator = rapidjson::CrtAllocator]’
[2020-11-12T02:39:54.212Z] /build/opencc/src/OpenCC-ver.1.1.1/src/../deps/rapidjson-1.1.0/document.h:2200:58:   required from ‘rapidjson::GenericDocument<Encoding, Allocator, StackAllocator>& rapidjson::GenericDocument<Encoding, Allocator, StackAllocator>::ParseInsitu(rapidjson::GenericDocument<Encoding, Allocator, StackAllocator>::Ch*) [with unsigned int parseFlags = 0; Encoding = rapidjson::UTF8<>; Allocator = rapidjson::MemoryPoolAllocator<>; StackAllocator = rapidjson::CrtAllocator; rapidjson::GenericDocument<Encoding, Allocator, StackAllocator>::Ch = char]’
[2020-11-12T02:39:54.212Z] /build/opencc/src/OpenCC-ver.1.1.1/src/Config.cpp:242:53:   required from here
[2020-11-12T02:39:54.212Z] /build/opencc/src/OpenCC-ver.1.1.1/src/../deps/rapidjson-1.1.0/document.h:1939:24: warning: ‘void* memcpy(void*, const void*, size_t)’ writing to an object of type ‘class rapidjson::GenericValue<rapidjson::UTF8<> >’ with no trivial copy-assignment; use copy-assignment or copy-initialization instead [-Wclass-memaccess]
[2020-11-12T02:39:54.212Z]  1939 |             std::memcpy(e, values, count * sizeof(GenericValue));
[2020-11-12T02:39:54.212Z]       |             ~~~~~~~~~~~^~~~~~~~~~~~~~~~~~~~~~~~~~~~~~~~~~~~~~~~~
[2020-11-12T02:39:54.212Z] /build/opencc/src/OpenCC-ver.1.1.1/src/../deps/rapidjson-1.1.0/document.h:540:7: note: ‘class rapidjson::GenericValue<rapidjson::UTF8<> >’ declared here
[2020-11-12T02:39:54.212Z]   540 | class GenericValue {
[2020-11-12T02:39:54.212Z]       |       ^~~~~~~~~~~~
[2020-11-12T02:39:56.073Z] [ 54%] Linking CXX shared library libopencc.so
[2020-11-12T02:39:56.073Z] [ 54%] Built target libopencc
[2020-11-12T02:39:56.073Z] Scanning dependencies of target opencc
[2020-11-12T02:39:56.073Z] Scanning dependencies of target opencc_dict
[2020-11-12T02:39:56.073Z] Scanning dependencies of target opencc_phrase_extract
[2020-11-12T02:39:56.073Z] [ 55%] Building CXX object src/tools/CMakeFiles/opencc.dir/CommandLine.cpp.o
[2020-11-12T02:39:56.073Z] [ 57%] Building CXX object src/tools/CMakeFiles/opencc_dict.dir/DictConverter.cpp.o
[2020-11-12T02:39:56.073Z] [ 59%] Building CXX object src/tools/CMakeFiles/opencc_phrase_extract.dir/PhraseExtract.cpp.o
[2020-11-12T02:39:59.302Z] [ 61%] Linking CXX executable opencc_dict
[2020-11-12T02:39:59.302Z] [ 61%] Built target opencc_dict
[2020-11-12T02:39:59.302Z] Scanning dependencies of target Dictionaries
[2020-11-12T02:39:59.302Z] [ 62%] Building JPVariants.ocd2
[2020-11-12T02:39:59.302Z] [ 64%] Linking CXX executable opencc
[2020-11-12T02:39:59.302Z] [ 66%] Building TSCharacters.ocd2
[2020-11-12T02:39:59.302Z] [ 69%] Building HKVariantsRevPhrases.ocd2
[2020-11-12T02:39:59.302Z] [ 69%] Building HKVariants.ocd2
[2020-11-12T02:39:59.302Z] [ 71%] Building JPShinjitaiPhrases.ocd2
[2020-11-12T02:39:59.302Z] [ 76%] Generating HKVariantsRev.txt
[2020-11-12T02:39:59.302Z] [ 76%] Building JPShinjitaiCharacters.ocd2
[2020-11-12T02:39:59.302Z] [ 76%] Generating TWVariantsRev.txt
[2020-11-12T02:39:59.302Z] [ 77%] Generating TWPhrases.txt
[2020-11-12T02:39:59.302Z] [ 79%] Building STCharacters.ocd2
[2020-11-12T02:39:59.302Z] [ 83%] Generating JPVariantsRev.txt
[2020-11-12T02:39:59.302Z] [ 83%] Building STPhrases.ocd2
[2020-11-12T02:39:59.302Z] [ 84%] Building TWVariants.ocd2
[2020-11-12T02:39:59.302Z] [ 86%] Building TSPhrases.ocd2
[2020-11-12T02:39:59.302Z] [ 88%] Building TWVariantsRevPhrases.ocd2
[2020-11-12T02:39:59.302Z] Error copying file "/build/opencc/src/OpenCC-ver.1.1.1/src/libopencc.so.1.1.1" to "/build/opencc/src/OpenCC-ver.1.1.1/src/tools".
[2020-11-12T02:39:59.302Z] make[2]: *** [data/CMakeFiles/Dictionaries.dir/build.make:120: data/TWVariants.ocd2] Error 1
[2020-11-12T02:39:59.302Z] make[2]: *** Waiting for unfinished jobs....
[2020-11-12T02:39:59.302Z] /usr/bin/ld: CMakeFiles/opencc.dir/CommandLine.cpp.o: in function `Convert(std::__cxx11::basic_string<char, std::char_traits<char>, std::allocator<char> >)':
[2020-11-12T02:39:59.302Z] CommandLine.cpp:(.text+0xe6b): warning: the use of `tmpnam' is dangerous, better use `mkstemp'
[2020-11-12T02:39:59.302Z] [ 89%] Linking CXX executable opencc_phrase_extract
[2020-11-12T02:39:59.302Z] [ 89%] Built target opencc
[2020-11-12T02:39:59.302Z] make[1]: *** [CMakeFiles/Makefile2:1171: data/CMakeFiles/Dictionaries.dir/all] Error 2
[2020-11-12T02:39:59.302Z] make[1]: *** Waiting for unfinished jobs....
[2020-11-12T02:39:59.302Z] [ 89%] Built target opencc_phrase_extract
[2020-11-12T02:39:59.302Z] make: *** [Makefile:182: all] Error 2
[2020-11-12T02:39:59.302Z] ==> ERROR: A failure occurred in build().
[2020-11-12T02:39:59.302Z]     Aborting...
[2020-11-12T02:40:00.213Z] ==> ERROR: Build failed, check /build/buildpkg/goblins-x86_64/jenkins/build
[Pipeline] }
[2020-11-12T02:40:00.217Z] ERROR: Failed to build source
[2020-11-12T02:40:00.217Z] ERROR: script returned exit code 255
[Pipeline] // catchError
[Pipeline] }
[Pipeline] // dir
Post stage
[Pipeline] emailext
[2020-11-12T02:40:00.314Z] Sending email to: artix-build-failures at artixlinux.org


More information about the artix-build-failures mailing list