[artix-build-failures] [galaxy] Failure: fish

jenkins at artixlinux.org jenkins at artixlinux.org
Sun May 24 13:29:02 CEST 2020


   Failure

   Build: repos/community-x86_64

   Packages:

   [fish-3.1.2-2-x86_64.pkg.tar.zst]

   authorName: alium

   authorEmail: alium at artixlinux.org

   [1]https://orion.artixlinux.org/job/packagesF/job/fish/job/master/11/

References

   1. https://orion.artixlinux.org/job/packagesF/job/fish/job/master/11/
-------------- next part --------------
Push event to branch master
Querying the current revision of branch master...
Current revision of branch master is de1c0c5e541a18e3bd9bb13b746f6fdfebf5a44a
Obtained Jenkinsfile from de1c0c5e541a18e3bd9bb13b746f6fdfebf5a44a
Running in Durability level: PERFORMANCE_OPTIMIZED
Loading library artix-ci at master
Attempting to resolve master from remote references...
 > git --version # timeout=10
 > git ls-remote -- https://gitea.artixlinux.org/artix/pipeline-libs.git # timeout=10
Found match: refs/heads/master revision 77f77ff85eedb6eb60b64faf8c328ab86dbb479c
Warning: CredentialId "gitea-ci" could not be found.
 > git rev-parse --is-inside-work-tree # timeout=10
Fetching changes from the remote Git repository
 > git config remote.origin.url https://gitea.artixlinux.org/artix/pipeline-libs.git # timeout=10
Fetching without tags
Fetching upstream changes from https://gitea.artixlinux.org/artix/pipeline-libs.git
 > git --version # timeout=10
 > git fetch --no-tags --force --progress -- https://gitea.artixlinux.org/artix/pipeline-libs.git +refs/heads/master:refs/remotes/origin/master # timeout=10
Checking out Revision 77f77ff85eedb6eb60b64faf8c328ab86dbb479c (master)
 > git config core.sparsecheckout # timeout=10
 > git checkout -f 77f77ff85eedb6eb60b64faf8c328ab86dbb479c # timeout=10
Commit message: "Notify: remove fail condition"
[Gitea] Notifying branch build status: PENDING Build started...
[Gitea] Notified
[Pipeline] Start of Pipeline
[Pipeline] node
Running on Jenkins in /build/jenkins/workspace/packagesF_fish_master
[Pipeline] {
[Pipeline] timestamps
[Pipeline] {
[Pipeline] stage
[Pipeline] { (Prepare)
[Pipeline] checkout
[2020-05-24T11:27:12.886Z] Warning: CredentialId "jenkins-ci" could not be found.
[2020-05-24T11:27:12.886Z]  > git rev-parse --is-inside-work-tree # timeout=10
[2020-05-24T11:27:12.891Z] Fetching changes from the remote Git repository
[2020-05-24T11:27:12.891Z]  > git config remote.origin.url https://237b7412742b4068af4173944de150f12959f4d3@gitea.artixlinux.org/packagesF/fish.git # timeout=10
[2020-05-24T11:27:12.978Z] Cleaning workspace
[2020-05-24T11:27:12.978Z]  > git rev-parse --verify HEAD # timeout=10
[2020-05-24T11:27:12.983Z] Resetting working tree
[2020-05-24T11:27:12.983Z]  > git reset --hard # timeout=10
[2020-05-24T11:27:12.990Z]  > git clean -fdx # timeout=10
[2020-05-24T11:27:12.996Z] Fetching without tags
[2020-05-24T11:27:12.996Z] Fetching upstream changes from https://237b7412742b4068af4173944de150f12959f4d3@gitea.artixlinux.org/packagesF/fish.git
[2020-05-24T11:27:12.996Z]  > git --version # timeout=10
[2020-05-24T11:27:13.000Z]  > git fetch --no-tags --force --progress -- https://237b7412742b4068af4173944de150f12959f4d3@gitea.artixlinux.org/packagesF/fish.git +refs/heads/master:refs/remotes/origin/master # timeout=10
[2020-05-24T11:27:13.135Z] Checking out Revision de1c0c5e541a18e3bd9bb13b746f6fdfebf5a44a (master)
[2020-05-24T11:27:13.136Z]  > git config core.sparsecheckout # timeout=10
[2020-05-24T11:27:13.141Z]  > git checkout -f de1c0c5e541a18e3bd9bb13b746f6fdfebf5a44a # timeout=10
[2020-05-24T11:27:13.150Z] Commit message: "[trunk] -> [community] 'fish-3.1.2-2' add"
[2020-05-24T11:27:13.151Z]  > git rev-list --no-walk 77c28bf45aaceaa720c0639b2f1d0b0d458abfe7 # timeout=10
[2020-05-24T11:27:13.164Z] [Gitea] Notifying branch build status: PENDING Build started...
[2020-05-24T11:27:13.460Z] [Gitea] Notified
[Pipeline] libraryResource
[Pipeline] readYaml
[Pipeline] sh
[2020-05-24T11:27:13.806Z] + git rev-parse @
[Pipeline] sh
[2020-05-24T11:27:14.064Z] + git show -s --format=%an de1c0c5e541a18e3bd9bb13b746f6fdfebf5a44a
[Pipeline] sh
[2020-05-24T11:27:14.323Z] + git show -s --format=%ae de1c0c5e541a18e3bd9bb13b746f6fdfebf5a44a
[Pipeline] sh
[2020-05-24T11:27:14.580Z] + git show --pretty=format: --name-status de1c0c5e541a18e3bd9bb13b746f6fdfebf5a44a
[Pipeline] fileExists
[Pipeline] sh
[2020-05-24T11:27:14.847Z] + pkg2yaml repos/community-x86_64
[Pipeline] readYaml
[Pipeline] }
[Pipeline] // stage
[Pipeline] stage
[Pipeline] { (Build)
[Pipeline] echo
[2020-05-24T11:27:14.967Z] isRebuild: false
[Pipeline] dir
[2020-05-24T11:27:14.972Z] Running in /build/jenkins/workspace/packagesF_fish_master/repos/community-x86_64
[Pipeline] {
[Pipeline] sh
[2020-05-24T11:27:15.231Z] + buildpkg-galaxy
[2020-05-24T11:27:18.459Z] :: Synchronizing package databases...
[2020-05-24T11:27:18.459Z]  system is up to date
[2020-05-24T11:27:18.459Z] downloading world.db...
[2020-05-24T11:27:18.459Z]  galaxy is up to date
[2020-05-24T11:27:18.459Z]  extra is up to date
[2020-05-24T11:27:18.459Z]  community is up to date
[2020-05-24T11:27:18.459Z] :: Starting full system upgrade...
[2020-05-24T11:27:18.459Z]  there is nothing to do
[2020-05-24T11:27:19.370Z] ==> Building in chroot for [default] (x86_64)...
[2020-05-24T11:27:20.281Z] ==> Synchronizing chroot copy [/build/buildpkg/default-x86_64/root] -> [jenkins]...done
[2020-05-24T11:27:21.192Z] ==> Making package: fish 3.1.2-2 (Sun May 24 13:27:20 2020)
[2020-05-24T11:27:21.192Z] ==> Retrieving sources...
[2020-05-24T11:27:21.192Z]   -> Found fish-3.1.2.tar.gz
[2020-05-24T11:27:21.192Z]   -> Found fish-3.1.2.tar.gz.asc
[2020-05-24T11:27:21.192Z] ==> Validating source files with sha256sums...
[2020-05-24T11:27:21.192Z]     fish-3.1.2.tar.gz ... Passed
[2020-05-24T11:27:21.192Z]     fish-3.1.2.tar.gz.asc ... Skipped
[2020-05-24T11:27:21.192Z] ==> Validating source files with sha512sums...
[2020-05-24T11:27:21.192Z]     fish-3.1.2.tar.gz ... Passed
[2020-05-24T11:27:21.192Z]     fish-3.1.2.tar.gz.asc ... Skipped
[2020-05-24T11:27:21.192Z] ==> Verifying source file signatures with gpg...
[2020-05-24T11:27:21.192Z]     fish-3.1.2.tar.gz ... Passed
[2020-05-24T11:27:26.386Z] ==> Making package: fish 3.1.2-2 (Sun 24 May 2020 11:27:25 AM UTC)
[2020-05-24T11:27:26.386Z] ==> Checking runtime dependencies...
[2020-05-24T11:27:26.386Z] ==> Installing missing dependencies...
[2020-05-24T11:27:26.386Z] resolving dependencies...
[2020-05-24T11:27:26.386Z] looking for conflicting packages...
[2020-05-24T11:27:26.386Z] 
[2020-05-24T11:27:26.386Z] Package (1)   New Version  Net Change
[2020-05-24T11:27:26.386Z] 
[2020-05-24T11:27:26.386Z] system/pcre2  10.35-1        3.90 MiB
[2020-05-24T11:27:26.386Z] 
[2020-05-24T11:27:26.386Z] Total Installed Size:  3.90 MiB
[2020-05-24T11:27:26.386Z] 
[2020-05-24T11:27:26.386Z] :: Proceed with installation? [Y/n] 
[2020-05-24T11:27:26.386Z] checking keyring...
[2020-05-24T11:27:26.386Z] checking package integrity...
[2020-05-24T11:27:26.386Z] loading package files...
[2020-05-24T11:27:26.386Z] checking for file conflicts...
[2020-05-24T11:27:26.386Z] checking available disk space...
[2020-05-24T11:27:26.386Z] :: Processing package changes...
[2020-05-24T11:27:26.386Z] installing pcre2...
[2020-05-24T11:27:26.386Z] ==> Checking buildtime dependencies...
[2020-05-24T11:27:26.386Z] ==> Installing missing dependencies...
[2020-05-24T11:27:26.386Z] resolving dependencies...
[2020-05-24T11:27:26.386Z] looking for conflicting packages...
[2020-05-24T11:27:26.386Z] 
[2020-05-24T11:27:26.386Z] Package (35)                                 New Version       Net Change
[2020-05-24T11:27:26.386Z] 
[2020-05-24T11:27:26.386Z] world/jsoncpp                                1.9.2-1             1.60 MiB
[2020-05-24T11:27:26.386Z] system/libnsl                                1.2.0-2             0.19 MiB
[2020-05-24T11:27:26.386Z] world/libuv                                  1.38.0-1            0.52 MiB
[2020-05-24T11:27:26.386Z] world/python                                 3.8.3-1            77.54 MiB
[2020-05-24T11:27:26.386Z] world/python-appdirs                         1.4.4-1             0.07 MiB
[2020-05-24T11:27:26.386Z] galaxy/python-babel                          2.8.0-4            26.42 MiB
[2020-05-24T11:27:26.386Z] world/python-chardet                         3.0.4-5             1.12 MiB
[2020-05-24T11:27:26.386Z] galaxy/python-docutils                       0.16-1              4.22 MiB
[2020-05-24T11:27:26.386Z] world/python-idna                            2.9-1               0.67 MiB
[2020-05-24T11:27:26.386Z] galaxy/python-imagesize                      1.2.0-1             0.02 MiB
[2020-05-24T11:27:26.386Z] galaxy/python-jinja                          2.11.2-1            1.18 MiB
[2020-05-24T11:27:26.386Z] world/python-markupsafe                      1.1.1-4             0.08 MiB
[2020-05-24T11:27:26.386Z] world/python-ordered-set                     3.1.1-2             0.05 MiB
[2020-05-24T11:27:26.386Z] world/python-packaging                       20.4-1              0.17 MiB
[2020-05-24T11:27:26.386Z] galaxy/python-pygments                       2.6.1-2             9.42 MiB
[2020-05-24T11:27:26.386Z] world/python-pyparsing                       2.4.7-1             0.73 MiB
[2020-05-24T11:27:26.386Z] galaxy/python-pytz                           2020.1-1            0.96 MiB
[2020-05-24T11:27:26.386Z] world/python-requests                        2.23.0-1            0.44 MiB
[2020-05-24T11:27:26.386Z] world/python-setuptools                      1:46.4.0-1          1.54 MiB
[2020-05-24T11:27:26.386Z] world/python-six                             1.14.0-1            0.09 MiB
[2020-05-24T11:27:26.386Z] galaxy/python-snowballstemmer                2.0.0-3             1.44 MiB
[2020-05-24T11:27:26.386Z] galaxy/python-sphinx-alabaster-theme         0.7.12-3            0.04 MiB
[2020-05-24T11:27:26.386Z] galaxy/python-sphinxcontrib-applehelp        1.0.2-1             0.24 MiB
[2020-05-24T11:27:26.386Z] galaxy/python-sphinxcontrib-devhelp          1.0.2-1             0.12 MiB
[2020-05-24T11:27:26.386Z] galaxy/python-sphinxcontrib-htmlhelp         1.0.3-1             0.16 MiB
[2020-05-24T11:27:26.386Z] galaxy/python-sphinxcontrib-jsmath           1.0.1-4             0.01 MiB
[2020-05-24T11:27:26.386Z] galaxy/python-sphinxcontrib-qthelp           1.0.3-1             0.15 MiB
[2020-05-24T11:27:26.386Z] galaxy/python-sphinxcontrib-serializinghtml  1.1.4-1             0.12 MiB
[2020-05-24T11:27:26.386Z] world/python-urllib3                         1.25.9-1            0.64 MiB
[2020-05-24T11:27:26.386Z] world/rhash                                  1.3.9-2             0.29 MiB
[2020-05-24T11:27:26.386Z] world/shared-mime-info                       2.0+1+g6bf9e4f-2    4.32 MiB
[2020-05-24T11:27:26.386Z] world/tcl                                    8.6.10-2            6.64 MiB
[2020-05-24T11:27:26.386Z] world/cmake                                  3.17.2-2           39.26 MiB
[2020-05-24T11:27:26.386Z] world/expect                                 5.45.4-2.1          0.41 MiB
[2020-05-24T11:27:26.386Z] galaxy/python-sphinx                         3.0.3-1            14.82 MiB
[2020-05-24T11:27:26.386Z] 
[2020-05-24T11:27:26.386Z] Total Installed Size:  195.67 MiB
[2020-05-24T11:27:26.386Z] 
[2020-05-24T11:27:26.386Z] :: Proceed with installation? [Y/n] 
[2020-05-24T11:27:26.386Z] checking keyring...
[2020-05-24T11:27:26.387Z] checking package integrity...
[2020-05-24T11:27:28.248Z] loading package files...
[2020-05-24T11:27:28.498Z] checking for file conflicts...
[2020-05-24T11:27:28.498Z] checking available disk space...
[2020-05-24T11:27:28.498Z] :: Processing package changes...
[2020-05-24T11:27:28.498Z] installing shared-mime-info...
[2020-05-24T11:27:28.498Z] installing jsoncpp...
[2020-05-24T11:27:28.498Z] Optional dependencies for jsoncpp
[2020-05-24T11:27:28.498Z]     jsoncpp-doc: documentation
[2020-05-24T11:27:28.498Z] installing libnsl...
[2020-05-24T11:27:28.498Z] installing libuv...
[2020-05-24T11:27:28.498Z] installing rhash...
[2020-05-24T11:27:28.498Z] installing cmake...
[2020-05-24T11:27:29.409Z] Optional dependencies for cmake
[2020-05-24T11:27:29.409Z]     qt5-base: cmake-gui
[2020-05-24T11:27:29.409Z] installing python...
[2020-05-24T11:27:29.659Z] Optional dependencies for python
[2020-05-24T11:27:29.659Z]     python-setuptools [pending]
[2020-05-24T11:27:29.659Z]     python-pip
[2020-05-24T11:27:29.659Z]     sqlite [installed]
[2020-05-24T11:27:29.659Z]     mpdecimal: for decimal
[2020-05-24T11:27:29.659Z]     xz: for lzma [installed]
[2020-05-24T11:27:29.659Z]     tk: for tkinter
[2020-05-24T11:27:29.659Z] installing python-pytz...
[2020-05-24T11:27:29.659Z] installing python-babel...
[2020-05-24T11:27:30.210Z] installing python-docutils...
[2020-05-24T11:27:30.460Z] installing python-imagesize...
[2020-05-24T11:27:30.460Z] installing python-appdirs...
[2020-05-24T11:27:30.460Z] installing python-pyparsing...
[2020-05-24T11:27:30.460Z] installing python-six...
[2020-05-24T11:27:30.460Z] installing python-packaging...
[2020-05-24T11:27:30.460Z] installing python-ordered-set...
[2020-05-24T11:27:30.460Z] installing python-setuptools...
[2020-05-24T11:27:30.460Z] installing python-markupsafe...
[2020-05-24T11:27:30.460Z] installing python-jinja...
[2020-05-24T11:27:30.460Z] Optional dependencies for python-jinja
[2020-05-24T11:27:30.460Z]     python-babel: for i18n support [installed]
[2020-05-24T11:27:30.460Z] installing python-pygments...
[2020-05-24T11:27:30.710Z] installing python-urllib3...
[2020-05-24T11:27:30.710Z] Optional dependencies for python-urllib3
[2020-05-24T11:27:30.710Z]     python-pysocks: SOCKS support
[2020-05-24T11:27:30.711Z]     python-brotli: Brotli support
[2020-05-24T11:27:30.711Z]     python-pyopenssl: security support
[2020-05-24T11:27:30.711Z] installing python-chardet...
[2020-05-24T11:27:30.711Z] installing python-idna...
[2020-05-24T11:27:30.711Z] installing python-requests...
[2020-05-24T11:27:30.711Z] Optional dependencies for python-requests
[2020-05-24T11:27:30.711Z]     python-pysocks: SOCKS proxy support
[2020-05-24T11:27:30.711Z] installing python-snowballstemmer...
[2020-05-24T11:27:30.711Z] Optional dependencies for python-snowballstemmer
[2020-05-24T11:27:30.711Z]     python-pystemmer: for improved performance
[2020-05-24T11:27:30.711Z] installing python-sphinx-alabaster-theme...
[2020-05-24T11:27:30.711Z] installing python-sphinxcontrib-applehelp...
[2020-05-24T11:27:30.711Z] installing python-sphinxcontrib-devhelp...
[2020-05-24T11:27:30.711Z] installing python-sphinxcontrib-htmlhelp...
[2020-05-24T11:27:30.711Z] installing python-sphinxcontrib-jsmath...
[2020-05-24T11:27:30.711Z] installing python-sphinxcontrib-qthelp...
[2020-05-24T11:27:30.711Z] installing python-sphinxcontrib-serializinghtml...
[2020-05-24T11:27:30.711Z] installing python-sphinx...
[2020-05-24T11:27:30.961Z] Optional dependencies for python-sphinx
[2020-05-24T11:27:30.961Z]     imagemagick: for ext.imgconverter
[2020-05-24T11:27:30.961Z]     texlive-latexextra: for generation of PDF documentation
[2020-05-24T11:27:30.961Z] installing tcl...
[2020-05-24T11:27:30.961Z] installing expect...
[2020-05-24T11:27:31.211Z] :: Running post-transaction hooks...
[2020-05-24T11:27:31.211Z] (1/1) Updating the MIME type database...
[2020-05-24T11:27:31.461Z] ==> Retrieving sources...
[2020-05-24T11:27:31.461Z]   -> Found fish-3.1.2.tar.gz
[2020-05-24T11:27:31.461Z]   -> Found fish-3.1.2.tar.gz.asc
[2020-05-24T11:27:31.461Z] ==> WARNING: Skipping all source file integrity checks.
[2020-05-24T11:27:31.461Z] ==> Extracting sources...
[2020-05-24T11:27:31.462Z]   -> Extracting fish-3.1.2.tar.gz with bsdtar
[2020-05-24T11:27:31.712Z] ==> Starting build()...
[2020-05-24T11:27:31.962Z] -- The C compiler identification is GNU 10.1.0
[2020-05-24T11:27:31.962Z] -- The CXX compiler identification is GNU 10.1.0
[2020-05-24T11:27:31.962Z] -- Check for working C compiler: /usr/bin/cc
[2020-05-24T11:27:32.213Z] -- Check for working C compiler: /usr/bin/cc - works
[2020-05-24T11:27:32.213Z] -- Detecting C compiler ABI info
[2020-05-24T11:27:32.213Z] -- Detecting C compiler ABI info - done
[2020-05-24T11:27:32.213Z] -- Detecting C compile features
[2020-05-24T11:27:32.213Z] -- Detecting C compile features - done
[2020-05-24T11:27:32.213Z] -- Check for working CXX compiler: /usr/bin/c++
[2020-05-24T11:27:32.463Z] -- Check for working CXX compiler: /usr/bin/c++ - works
[2020-05-24T11:27:32.463Z] -- Detecting CXX compiler ABI info
[2020-05-24T11:27:32.713Z] -- Detecting CXX compiler ABI info - done
[2020-05-24T11:27:32.713Z] -- Detecting CXX compile features
[2020-05-24T11:27:32.713Z] -- Detecting CXX compile features - done
[2020-05-24T11:27:32.713Z] -- Found Curses: /usr/lib/libcurses.so  
[2020-05-24T11:27:32.713Z] -- Looking for pthread.h
[2020-05-24T11:27:32.964Z] -- Looking for pthread.h - found
[2020-05-24T11:27:32.964Z] -- Performing Test CMAKE_HAVE_LIBC_PTHREAD
[2020-05-24T11:27:32.964Z] -- Performing Test CMAKE_HAVE_LIBC_PTHREAD - Failed
[2020-05-24T11:27:32.964Z] -- Check if compiler accepts -pthread
[2020-05-24T11:27:33.214Z] -- Check if compiler accepts -pthread - yes
[2020-05-24T11:27:33.214Z] -- Found Threads: TRUE  
[2020-05-24T11:27:33.214Z] -- Looking for backtrace_symbols
[2020-05-24T11:27:33.214Z] -- Looking for backtrace_symbols - found
[2020-05-24T11:27:33.214Z] -- Looking for clock_gettime
[2020-05-24T11:27:33.465Z] -- Looking for clock_gettime - found
[2020-05-24T11:27:33.465Z] -- Looking for ctermid_r
[2020-05-24T11:27:33.465Z] -- Looking for ctermid_r - not found
[2020-05-24T11:27:33.465Z] -- Performing Test HAVE_STRUCT_DIRENT_D_TYPE
[2020-05-24T11:27:33.715Z] -- Performing Test HAVE_STRUCT_DIRENT_D_TYPE - Success
[2020-05-24T11:27:33.715Z] -- Looking for dirfd
[2020-05-24T11:27:33.715Z] -- Looking for dirfd - found
[2020-05-24T11:27:33.715Z] -- Looking for C++ include execinfo.h
[2020-05-24T11:27:33.965Z] -- Looking for C++ include execinfo.h - found
[2020-05-24T11:27:33.965Z] -- Looking for flock
[2020-05-24T11:27:33.965Z] -- Looking for flock - found
[2020-05-24T11:27:33.965Z] -- Looking for futimens
[2020-05-24T11:27:34.216Z] -- Looking for futimens - found
[2020-05-24T11:27:34.216Z] -- Looking for futimes
[2020-05-24T11:27:34.216Z] -- Looking for futimes - found
[2020-05-24T11:27:34.216Z] -- Looking for getifaddrs
[2020-05-24T11:27:34.466Z] -- Looking for getifaddrs - found
[2020-05-24T11:27:34.466Z] -- Looking for getpwent
[2020-05-24T11:27:34.466Z] -- Looking for getpwent - found
[2020-05-24T11:27:34.466Z] -- Looking for getrusage
[2020-05-24T11:27:34.717Z] -- Looking for getrusage - found
[2020-05-24T11:27:34.717Z] -- Looking for gettext
[2020-05-24T11:27:34.717Z] -- Looking for gettext - found
[2020-05-24T11:27:34.717Z] -- Looking for killpg
[2020-05-24T11:27:34.967Z] -- Looking for killpg - found
[2020-05-24T11:27:34.967Z] -- Looking for lrand48_r
[2020-05-24T11:27:35.217Z] -- Looking for lrand48_r - found
[2020-05-24T11:27:35.217Z] -- Looking for mkostemp
[2020-05-24T11:27:35.217Z] -- Looking for mkostemp - found
[2020-05-24T11:27:35.217Z] -- Looking for include files curses.h, term.h
[2020-05-24T11:27:35.468Z] -- Looking for include files curses.h, term.h - found
[2020-05-24T11:27:35.468Z] -- Looking for C++ include siginfo.h
[2020-05-24T11:27:35.468Z] -- Looking for C++ include siginfo.h - not found
[2020-05-24T11:27:35.468Z] -- Looking for C++ include spawn.h
[2020-05-24T11:27:35.718Z] -- Looking for C++ include spawn.h - found
[2020-05-24T11:27:35.718Z] -- Performing Test HAVE_STRUCT_STAT_ST_CTIME_NSEC
[2020-05-24T11:27:35.718Z] -- Performing Test HAVE_STRUCT_STAT_ST_CTIME_NSEC - Failed
[2020-05-24T11:27:35.718Z] -- Performing Test HAVE_STRUCT_STAT_ST_MTIMESPEC_TV_NSEC
[2020-05-24T11:27:35.718Z] -- Performing Test HAVE_STRUCT_STAT_ST_MTIMESPEC_TV_NSEC - Failed
[2020-05-24T11:27:35.718Z] -- Performing Test HAVE_STRUCT_STAT_ST_MTIM_TV_NSEC
[2020-05-24T11:27:35.968Z] -- Performing Test HAVE_STRUCT_STAT_ST_MTIM_TV_NSEC - Success
[2020-05-24T11:27:35.968Z] -- Looking for sys_errlist
[2020-05-24T11:27:35.968Z] -- Looking for sys_errlist - found
[2020-05-24T11:27:35.968Z] -- Looking for C++ include sys/ioctl.h
[2020-05-24T11:27:36.219Z] -- Looking for C++ include sys/ioctl.h - found
[2020-05-24T11:27:36.219Z] -- Looking for C++ include sys/select.h
[2020-05-24T11:27:36.219Z] -- Looking for C++ include sys/select.h - found
[2020-05-24T11:27:36.219Z] -- Looking for include files sys/types.h, sys/sysctl.h
[2020-05-24T11:27:36.469Z] -- Looking for include files sys/types.h, sys/sysctl.h - found
[2020-05-24T11:27:36.469Z] -- Looking for C++ include termios.h
[2020-05-24T11:27:36.469Z] -- Looking for C++ include termios.h - found
[2020-05-24T11:27:36.469Z] -- Looking for wcscasecmp
[2020-05-24T11:27:36.720Z] -- Looking for wcscasecmp - found
[2020-05-24T11:27:36.720Z] -- Looking for wcsdup
[2020-05-24T11:27:36.720Z] -- Looking for wcsdup - found
[2020-05-24T11:27:36.720Z] -- Looking for wcslcpy
[2020-05-24T11:27:36.970Z] -- Looking for wcslcpy - not found
[2020-05-24T11:27:36.970Z] -- Looking for wcsncasecmp
[2020-05-24T11:27:36.970Z] -- Looking for wcsncasecmp - found
[2020-05-24T11:27:36.970Z] -- Looking for wcsndup
[2020-05-24T11:27:37.221Z] -- Looking for wcsndup - not found
[2020-05-24T11:27:37.221Z] -- Looking for include file xlocale.h
[2020-05-24T11:27:37.221Z] -- Looking for include file xlocale.h - not found
[2020-05-24T11:27:37.221Z] -- Looking for wcstod_l
[2020-05-24T11:27:37.221Z] -- Looking for wcstod_l - found
[2020-05-24T11:27:37.221Z] -- Looking for _sys_errs
[2020-05-24T11:27:37.471Z] -- Looking for _sys_errs - not found
[2020-05-24T11:27:37.471Z] -- Looking for C++ include sys/types.h
[2020-05-24T11:27:37.471Z] -- Looking for C++ include sys/types.h - found
[2020-05-24T11:27:37.471Z] -- Looking for C++ include stdint.h
[2020-05-24T11:27:37.721Z] -- Looking for C++ include stdint.h - found
[2020-05-24T11:27:37.721Z] -- Looking for C++ include stddef.h
[2020-05-24T11:27:37.721Z] -- Looking for C++ include stddef.h - found
[2020-05-24T11:27:37.721Z] -- Check size of struct winsize
[2020-05-24T11:27:37.972Z] -- Check size of struct winsize - done
[2020-05-24T11:27:37.972Z] -- Looking for TIOCGWINSZ
[2020-05-24T11:27:37.972Z] -- Looking for TIOCGWINSZ - found
[2020-05-24T11:27:37.972Z] -- Check size of wchar_t[8]
[2020-05-24T11:27:38.222Z] -- Check size of wchar_t[8] - done
[2020-05-24T11:27:38.222Z] -- Performing Test TPARM_TAKES_VARARGS
[2020-05-24T11:27:38.472Z] -- Performing Test TPARM_TAKES_VARARGS - Success
[2020-05-24T11:27:38.472Z] -- Performing Test HAVE_STD__MAKE_UNIQUE
[2020-05-24T11:27:38.723Z] -- Performing Test HAVE_STD__MAKE_UNIQUE - Failed
[2020-05-24T11:27:38.723Z] -- Performing Test LIBATOMIC_NOT_NEEDED
[2020-05-24T11:27:38.723Z] -- Performing Test LIBATOMIC_NOT_NEEDED - Success
[2020-05-24T11:27:38.723Z] -- Found Intl: /usr/include  
[2020-05-24T11:27:38.973Z] -- Found Gettext: /usr/bin/msgmerge (found version "0.20.2") 
[2020-05-24T11:27:38.973Z] -- Performing Test HAVE__NL_MSG_CAT_CNTR
[2020-05-24T11:27:38.973Z] -- Performing Test HAVE__NL_MSG_CAT_CNTR - Success
[2020-05-24T11:27:38.973Z] -- Found system PCRE2 library /usr/include
[2020-05-24T11:27:38.973Z] -- The following features have been enabled:
[2020-05-24T11:27:38.973Z] 
[2020-05-24T11:27:38.973Z]  * gettext, translate messages with gettext
[2020-05-24T11:27:38.973Z]  * Documentation, user manual and documentation
[2020-05-24T11:27:38.973Z] 
[2020-05-24T11:27:38.973Z] -- The following OPTIONAL packages have been found:
[2020-05-24T11:27:38.973Z] 
[2020-05-24T11:27:38.973Z]  * Curses
[2020-05-24T11:27:38.973Z]  * Intl
[2020-05-24T11:27:38.973Z]  * Gettext
[2020-05-24T11:27:38.973Z] 
[2020-05-24T11:27:38.973Z] -- The following REQUIRED packages have been found:
[2020-05-24T11:27:38.973Z] 
[2020-05-24T11:27:38.973Z]  * Threads
[2020-05-24T11:27:38.973Z] 
[2020-05-24T11:27:38.973Z] -- Configuring done
[2020-05-24T11:27:39.224Z] -- Generating done
[2020-05-24T11:27:39.224Z] -- Build files have been written to: /build/fish/src/fish-3.1.2/build
[2020-05-24T11:27:39.224Z] make: Entering directory '/build/fish/src/fish-3.1.2/build'
[2020-05-24T11:27:39.224Z] /usr/bin/cmake -S/build/fish/src/fish-3.1.2 -B/build/fish/src/fish-3.1.2/build --check-build-system CMakeFiles/Makefile.cmake 0
[2020-05-24T11:27:39.224Z] /usr/bin/cmake -E cmake_progress_start /build/fish/src/fish-3.1.2/build/CMakeFiles /build/fish/src/fish-3.1.2/build/CMakeFiles/progress.marks
[2020-05-24T11:27:39.224Z] make  -f CMakeFiles/Makefile2 all
[2020-05-24T11:27:39.224Z] make[1]: Entering directory '/build/fish/src/fish-3.1.2/build'
[2020-05-24T11:27:39.224Z] make  -f CMakeFiles/CHECK-FISH-BUILD-VERSION-FILE.dir/build.make CMakeFiles/CHECK-FISH-BUILD-VERSION-FILE.dir/depend
[2020-05-24T11:27:39.224Z] make  -f CMakeFiles/pofiles_5.dir/build.make CMakeFiles/pofiles_5.dir/depend
[2020-05-24T11:27:39.224Z] make  -f CMakeFiles/pofiles_9.dir/build.make CMakeFiles/pofiles_9.dir/depend
[2020-05-24T11:27:39.224Z] make  -f CMakeFiles/pofiles_4.dir/build.make CMakeFiles/pofiles_4.dir/depend
[2020-05-24T11:27:39.224Z] make  -f CMakeFiles/pofiles_3.dir/build.make CMakeFiles/pofiles_3.dir/depend
[2020-05-24T11:27:39.224Z] make  -f CMakeFiles/pofiles_2.dir/build.make CMakeFiles/pofiles_2.dir/depend
[2020-05-24T11:27:39.224Z] make  -f CMakeFiles/pofiles_8.dir/build.make CMakeFiles/pofiles_8.dir/depend
[2020-05-24T11:27:39.224Z] make  -f CMakeFiles/pofiles_1.dir/build.make CMakeFiles/pofiles_1.dir/depend
[2020-05-24T11:27:39.224Z] make  -f CMakeFiles/pofiles_7.dir/build.make CMakeFiles/pofiles_7.dir/depend
[2020-05-24T11:27:39.224Z] make  -f CMakeFiles/pofiles_6.dir/build.make CMakeFiles/pofiles_6.dir/depend
[2020-05-24T11:27:39.224Z] make  -f CMakeFiles/fish_test_helper.dir/build.make CMakeFiles/fish_test_helper.dir/depend
[2020-05-24T11:27:39.224Z] make[2]: Entering directory '/build/fish/src/fish-3.1.2/build'
[2020-05-24T11:27:39.224Z] cd /build/fish/src/fish-3.1.2/build && /usr/bin/cmake -E cmake_depends "Unix Makefiles" /build/fish/src/fish-3.1.2 /build/fish/src/fish-3.1.2 /build/fish/src/fish-3.1.2/build /build/fish/src/fish-3.1.2/build /build/fish/src/fish-3.1.2/build/CMakeFiles/CHECK-FISH-BUILD-VERSION-FILE.dir/DependInfo.cmake --color=
[2020-05-24T11:27:39.224Z] make[2]: Entering directory '/build/fish/src/fish-3.1.2/build'
[2020-05-24T11:27:39.224Z] cd /build/fish/src/fish-3.1.2/build && /usr/bin/cmake -E cmake_depends "Unix Makefiles" /build/fish/src/fish-3.1.2 /build/fish/src/fish-3.1.2 /build/fish/src/fish-3.1.2/build /build/fish/src/fish-3.1.2/build /build/fish/src/fish-3.1.2/build/CMakeFiles/pofiles_5.dir/DependInfo.cmake --color=
[2020-05-24T11:27:39.224Z] make[2]: Entering directory '/build/fish/src/fish-3.1.2/build'
[2020-05-24T11:27:39.224Z] cd /build/fish/src/fish-3.1.2/build && /usr/bin/cmake -E cmake_depends "Unix Makefiles" /build/fish/src/fish-3.1.2 /build/fish/src/fish-3.1.2 /build/fish/src/fish-3.1.2/build /build/fish/src/fish-3.1.2/build /build/fish/src/fish-3.1.2/build/CMakeFiles/pofiles_9.dir/DependInfo.cmake --color=
[2020-05-24T11:27:39.224Z] make[2]: Entering directory '/build/fish/src/fish-3.1.2/build'
[2020-05-24T11:27:39.224Z] cd /build/fish/src/fish-3.1.2/build && /usr/bin/cmake -E cmake_depends "Unix Makefiles" /build/fish/src/fish-3.1.2 /build/fish/src/fish-3.1.2 /build/fish/src/fish-3.1.2/build /build/fish/src/fish-3.1.2/build /build/fish/src/fish-3.1.2/build/CMakeFiles/pofiles_4.dir/DependInfo.cmake --color=
[2020-05-24T11:27:39.224Z] make[2]: Entering directory '/build/fish/src/fish-3.1.2/build'
[2020-05-24T11:27:39.224Z] cd /build/fish/src/fish-3.1.2/build && /usr/bin/cmake -E cmake_depends "Unix Makefiles" /build/fish/src/fish-3.1.2 /build/fish/src/fish-3.1.2 /build/fish/src/fish-3.1.2/build /build/fish/src/fish-3.1.2/build /build/fish/src/fish-3.1.2/build/CMakeFiles/pofiles_3.dir/DependInfo.cmake --color=
[2020-05-24T11:27:39.224Z] make[2]: Entering directory '/build/fish/src/fish-3.1.2/build'
[2020-05-24T11:27:39.224Z] cd /build/fish/src/fish-3.1.2/build && /usr/bin/cmake -E cmake_depends "Unix Makefiles" /build/fish/src/fish-3.1.2 /build/fish/src/fish-3.1.2 /build/fish/src/fish-3.1.2/build /build/fish/src/fish-3.1.2/build /build/fish/src/fish-3.1.2/build/CMakeFiles/pofiles_6.dir/DependInfo.cmake --color=
[2020-05-24T11:27:39.224Z] make[2]: Entering directory '/build/fish/src/fish-3.1.2/build'
[2020-05-24T11:27:39.224Z] cd /build/fish/src/fish-3.1.2/build && /usr/bin/cmake -E cmake_depends "Unix Makefiles" /build/fish/src/fish-3.1.2 /build/fish/src/fish-3.1.2 /build/fish/src/fish-3.1.2/build /build/fish/src/fish-3.1.2/build /build/fish/src/fish-3.1.2/build/CMakeFiles/pofiles_2.dir/DependInfo.cmake --color=
[2020-05-24T11:27:39.224Z] make[2]: Entering directory '/build/fish/src/fish-3.1.2/build'
[2020-05-24T11:27:39.224Z] cd /build/fish/src/fish-3.1.2/build && /usr/bin/cmake -E cmake_depends "Unix Makefiles" /build/fish/src/fish-3.1.2 /build/fish/src/fish-3.1.2 /build/fish/src/fish-3.1.2/build /build/fish/src/fish-3.1.2/build /build/fish/src/fish-3.1.2/build/CMakeFiles/pofiles_1.dir/DependInfo.cmake --color=
[2020-05-24T11:27:39.224Z] make[2]: Entering directory '/build/fish/src/fish-3.1.2/build'
[2020-05-24T11:27:39.224Z] cd /build/fish/src/fish-3.1.2/build && /usr/bin/cmake -E cmake_depends "Unix Makefiles" /build/fish/src/fish-3.1.2 /build/fish/src/fish-3.1.2 /build/fish/src/fish-3.1.2/build /build/fish/src/fish-3.1.2/build /build/fish/src/fish-3.1.2/build/CMakeFiles/pofiles_8.dir/DependInfo.cmake --color=
[2020-05-24T11:27:39.224Z] make[2]: Entering directory '/build/fish/src/fish-3.1.2/build'
[2020-05-24T11:27:39.224Z] cd /build/fish/src/fish-3.1.2/build && /usr/bin/cmake -E cmake_depends "Unix Makefiles" /build/fish/src/fish-3.1.2 /build/fish/src/fish-3.1.2 /build/fish/src/fish-3.1.2/build /build/fish/src/fish-3.1.2/build /build/fish/src/fish-3.1.2/build/CMakeFiles/pofiles_7.dir/DependInfo.cmake --color=
[2020-05-24T11:27:39.224Z] make[2]: Entering directory '/build/fish/src/fish-3.1.2/build'
[2020-05-24T11:27:39.224Z] cd /build/fish/src/fish-3.1.2/build && /usr/bin/cmake -E cmake_depends "Unix Makefiles" /build/fish/src/fish-3.1.2 /build/fish/src/fish-3.1.2 /build/fish/src/fish-3.1.2/build /build/fish/src/fish-3.1.2/build /build/fish/src/fish-3.1.2/build/CMakeFiles/fish_test_helper.dir/DependInfo.cmake --color=
[2020-05-24T11:27:39.224Z] Dependee "/build/fish/src/fish-3.1.2/build/CMakeFiles/pofiles_5.dir/DependInfo.cmake" is newer than depender "/build/fish/src/fish-3.1.2/build/CMakeFiles/pofiles_5.dir/depend.internal".
[2020-05-24T11:27:39.224Z] Dependee "/build/fish/src/fish-3.1.2/build/CMakeFiles/CMakeDirectoryInformation.cmake" is newer than depender "/build/fish/src/fish-3.1.2/build/CMakeFiles/pofiles_5.dir/depend.internal".
[2020-05-24T11:27:39.224Z] Scanning dependencies of target pofiles_5
[2020-05-24T11:27:39.224Z] make[2]: Leaving directory '/build/fish/src/fish-3.1.2/build'
[2020-05-24T11:27:39.224Z] make  -f CMakeFiles/pofiles_5.dir/build.make CMakeFiles/pofiles_5.dir/build
[2020-05-24T11:27:39.224Z] Dependee "/build/fish/src/fish-3.1.2/build/CMakeFiles/pofiles_3.dir/DependInfo.cmake" is newer than depender "/build/fish/src/fish-3.1.2/build/CMakeFiles/pofiles_3.dir/depend.internal".
[2020-05-24T11:27:39.224Z] Dependee "/build/fish/src/fish-3.1.2/build/CMakeFiles/CMakeDirectoryInformation.cmake" is newer than depender "/build/fish/src/fish-3.1.2/build/CMakeFiles/pofiles_3.dir/depend.internal".
[2020-05-24T11:27:39.224Z] Dependee "/build/fish/src/fish-3.1.2/build/CMakeFiles/pofiles_8.dir/DependInfo.cmake" is newer than depender "/build/fish/src/fish-3.1.2/build/CMakeFiles/pofiles_8.dir/depend.internal".
[2020-05-24T11:27:39.224Z] Dependee "/build/fish/src/fish-3.1.2/build/CMakeFiles/CMakeDirectoryInformation.cmake" is newer than depender "/build/fish/src/fish-3.1.2/build/CMakeFiles/pofiles_8.dir/depend.internal".
[2020-05-24T11:27:39.224Z] Scanning dependencies of target pofiles_3
[2020-05-24T11:27:39.224Z] Scanning dependencies of target pofiles_8
[2020-05-24T11:27:39.224Z] Dependee "/build/fish/src/fish-3.1.2/build/CMakeFiles/pofiles_9.dir/DependInfo.cmake" is newer than depender "/build/fish/src/fish-3.1.2/build/CMakeFiles/pofiles_9.dir/depend.internal".
[2020-05-24T11:27:39.224Z] Dependee "/build/fish/src/fish-3.1.2/build/CMakeFiles/CMakeDirectoryInformation.cmake" is newer than depender "/build/fish/src/fish-3.1.2/build/CMakeFiles/pofiles_9.dir/depend.internal".
[2020-05-24T11:27:39.224Z] Scanning dependencies of target pofiles_9
[2020-05-24T11:27:39.224Z] make[2]: Leaving directory '/build/fish/src/fish-3.1.2/build'
[2020-05-24T11:27:39.224Z] make[2]: Leaving directory '/build/fish/src/fish-3.1.2/build'
[2020-05-24T11:27:39.224Z] make  -f CMakeFiles/pofiles_3.dir/build.make CMakeFiles/pofiles_3.dir/build
[2020-05-24T11:27:39.224Z] make  -f CMakeFiles/pofiles_8.dir/build.make CMakeFiles/pofiles_8.dir/build
[2020-05-24T11:27:39.224Z] make[2]: Leaving directory '/build/fish/src/fish-3.1.2/build'
[2020-05-24T11:27:39.224Z] make  -f CMakeFiles/pofiles_9.dir/build.make CMakeFiles/pofiles_9.dir/build
[2020-05-24T11:27:39.224Z] make[2]: Entering directory '/build/fish/src/fish-3.1.2/build'
[2020-05-24T11:27:39.224Z] make[2]: Entering directory '/build/fish/src/fish-3.1.2/build'
[2020-05-24T11:27:39.224Z] make[2]: Entering directory '/build/fish/src/fish-3.1.2/build'
[2020-05-24T11:27:39.224Z] Dependee "/build/fish/src/fish-3.1.2/build/CMakeFiles/CHECK-FISH-BUILD-VERSION-FILE.dir/DependInfo.cmake" is newer than depender "/build/fish/src/fish-3.1.2/build/CMakeFiles/CHECK-FISH-BUILD-VERSION-FILE.dir/depend.internal".
[2020-05-24T11:27:39.224Z] Dependee "/build/fish/src/fish-3.1.2/build/CMakeFiles/CMakeDirectoryInformation.cmake" is newer than depender "/build/fish/src/fish-3.1.2/build/CMakeFiles/CHECK-FISH-BUILD-VERSION-FILE.dir/depend.internal".
[2020-05-24T11:27:39.224Z] Dependee "/build/fish/src/fish-3.1.2/build/CMakeFiles/pofiles_4.dir/DependInfo.cmake" is newer than depender "/build/fish/src/fish-3.1.2/build/CMakeFiles/pofiles_4.dir/depend.internal".
[2020-05-24T11:27:39.224Z] Dependee "/build/fish/src/fish-3.1.2/build/CMakeFiles/CMakeDirectoryInformation.cmake" is newer than depender "/build/fish/src/fish-3.1.2/build/CMakeFiles/pofiles_4.dir/depend.internal".
[2020-05-24T11:27:39.224Z] Scanning dependencies of target CHECK-FISH-BUILD-VERSION-FILE
[2020-05-24T11:27:39.224Z] Dependee "/build/fish/src/fish-3.1.2/build/CMakeFiles/pofiles_2.dir/DependInfo.cmake" is newer than depender "/build/fish/src/fish-3.1.2/build/CMakeFiles/pofiles_2.dir/depend.internal".
[2020-05-24T11:27:39.224Z] Dependee "/build/fish/src/fish-3.1.2/build/CMakeFiles/CMakeDirectoryInformation.cmake" is newer than depender "/build/fish/src/fish-3.1.2/build/CMakeFiles/pofiles_2.dir/depend.internal".
[2020-05-24T11:27:39.224Z] Scanning dependencies of target pofiles_4
[2020-05-24T11:27:39.224Z] Scanning dependencies of target pofiles_2
[2020-05-24T11:27:39.224Z] Dependee "/build/fish/src/fish-3.1.2/build/CMakeFiles/pofiles_6.dir/DependInfo.cmake" is newer than depender "/build/fish/src/fish-3.1.2/build/CMakeFiles/pofiles_6.dir/depend.internal".
[2020-05-24T11:27:39.224Z] Dependee "/build/fish/src/fish-3.1.2/build/CMakeFiles/CMakeDirectoryInformation.cmake" is newer than depender "/build/fish/src/fish-3.1.2/build/CMakeFiles/pofiles_6.dir/depend.internal".
[2020-05-24T11:27:39.224Z] make[2]: Entering directory '/build/fish/src/fish-3.1.2/build'
[2020-05-24T11:27:39.224Z] make[2]: Leaving directory '/build/fish/src/fish-3.1.2/build'
[2020-05-24T11:27:39.224Z] Scanning dependencies of target pofiles_6
[2020-05-24T11:27:39.224Z] Dependee "/build/fish/src/fish-3.1.2/build/CMakeFiles/pofiles_1.dir/DependInfo.cmake" is newer than depender "/build/fish/src/fish-3.1.2/build/CMakeFiles/pofiles_1.dir/depend.internal".
[2020-05-24T11:27:39.224Z] Dependee "/build/fish/src/fish-3.1.2/build/CMakeFiles/CMakeDirectoryInformation.cmake" is newer than depender "/build/fish/src/fish-3.1.2/build/CMakeFiles/pofiles_1.dir/depend.internal".
[2020-05-24T11:27:39.224Z] make  -f CMakeFiles/CHECK-FISH-BUILD-VERSION-FILE.dir/build.make CMakeFiles/CHECK-FISH-BUILD-VERSION-FILE.dir/build
[2020-05-24T11:27:39.224Z] make[2]: Leaving directory '/build/fish/src/fish-3.1.2/build'
[2020-05-24T11:27:39.224Z] make[2]: Leaving directory '/build/fish/src/fish-3.1.2/build'
[2020-05-24T11:27:39.224Z] Dependee "/build/fish/src/fish-3.1.2/build/CMakeFiles/pofiles_7.dir/DependInfo.cmake" is newer than depender "/build/fish/src/fish-3.1.2/build/CMakeFiles/pofiles_7.dir/depend.internal".
[2020-05-24T11:27:39.224Z] Dependee "/build/fish/src/fish-3.1.2/build/CMakeFiles/CMakeDirectoryInformation.cmake" is newer than depender "/build/fish/src/fish-3.1.2/build/CMakeFiles/pofiles_7.dir/depend.internal".
[2020-05-24T11:27:39.224Z] Scanning dependencies of target pofiles_1
[2020-05-24T11:27:39.224Z] make  -f CMakeFiles/pofiles_2.dir/build.make CMakeFiles/pofiles_2.dir/build
[2020-05-24T11:27:39.224Z] make  -f CMakeFiles/pofiles_4.dir/build.make CMakeFiles/pofiles_4.dir/build
[2020-05-24T11:27:39.224Z] Scanning dependencies of target pofiles_7
[2020-05-24T11:27:39.224Z] make[2]: Leaving directory '/build/fish/src/fish-3.1.2/build'
[2020-05-24T11:27:39.224Z] make  -f CMakeFiles/pofiles_6.dir/build.make CMakeFiles/pofiles_6.dir/build
[2020-05-24T11:27:39.224Z] Dependee "/build/fish/src/fish-3.1.2/build/CMakeFiles/fish_test_helper.dir/DependInfo.cmake" is newer than depender "/build/fish/src/fish-3.1.2/build/CMakeFiles/fish_test_helper.dir/depend.internal".
[2020-05-24T11:27:39.224Z] Dependee "/build/fish/src/fish-3.1.2/build/CMakeFiles/CMakeDirectoryInformation.cmake" is newer than depender "/build/fish/src/fish-3.1.2/build/CMakeFiles/fish_test_helper.dir/depend.internal".
[2020-05-24T11:27:39.224Z] make[2]: Leaving directory '/build/fish/src/fish-3.1.2/build'
[2020-05-24T11:27:39.224Z] Scanning dependencies of target fish_test_helper
[2020-05-24T11:27:39.224Z] make[2]: Leaving directory '/build/fish/src/fish-3.1.2/build'
[2020-05-24T11:27:39.224Z] make  -f CMakeFiles/pofiles_1.dir/build.make CMakeFiles/pofiles_1.dir/build
[2020-05-24T11:27:39.224Z] make[2]: Entering directory '/build/fish/src/fish-3.1.2/build'
[2020-05-24T11:27:39.224Z] make[2]: Entering directory '/build/fish/src/fish-3.1.2/build'
[2020-05-24T11:27:39.224Z] cd /build/fish/src/fish-3.1.2 && /build/fish/src/fish-3.1.2/build_tools/git_version_gen.sh /build/fish/src/fish-3.1.2/build
[2020-05-24T11:27:39.224Z] make  -f CMakeFiles/pofiles_7.dir/build.make CMakeFiles/pofiles_7.dir/build
[2020-05-24T11:27:39.224Z] make[2]: Leaving directory '/build/fish/src/fish-3.1.2/build'
[2020-05-24T11:27:39.224Z] make[2]: Entering directory '/build/fish/src/fish-3.1.2/build'
[2020-05-24T11:27:39.224Z] make  -f CMakeFiles/fish_test_helper.dir/build.make CMakeFiles/fish_test_helper.dir/build
[2020-05-24T11:27:39.224Z] make[2]: Entering directory '/build/fish/src/fish-3.1.2/build'
[2020-05-24T11:27:39.224Z] make[2]: Entering directory '/build/fish/src/fish-3.1.2/build'
[2020-05-24T11:27:39.224Z] [  1%] Generating fr.gmo
[2020-05-24T11:27:39.224Z] make[2]: Entering directory '/build/fish/src/fish-3.1.2/build'
[2020-05-24T11:27:39.224Z] cd /build/fish/src/fish-3.1.2 && /usr/bin/msgfmt -o /build/fish/src/fish-3.1.2/build/fr.gmo po/fr.po
[2020-05-24T11:27:39.224Z] make[2]: Entering directory '/build/fish/src/fish-3.1.2/build'
[2020-05-24T11:27:39.224Z] [  2%] Generating en.gmo
[2020-05-24T11:27:39.224Z] [  3%] Generating zh_CN.gmo
[2020-05-24T11:27:39.224Z] cd /build/fish/src/fish-3.1.2 && /usr/bin/msgfmt -o /build/fish/src/fish-3.1.2/build/en.gmo po/en.po
[2020-05-24T11:27:39.224Z] cd /build/fish/src/fish-3.1.2 && /usr/bin/msgfmt -o /build/fish/src/fish-3.1.2/build/zh_CN.gmo po/zh_CN.po
[2020-05-24T11:27:39.224Z] [  3%] Generating nn.gmo
[2020-05-24T11:27:39.224Z] cd /build/fish/src/fish-3.1.2 && /usr/bin/msgfmt -o /build/fish/src/fish-3.1.2/build/nn.gmo po/nn.po
[2020-05-24T11:27:39.225Z] [  4%] Generating sv.gmo
[2020-05-24T11:27:39.225Z] cd /build/fish/src/fish-3.1.2 && /usr/bin/msgfmt -o /build/fish/src/fish-3.1.2/build/sv.gmo po/sv.po
[2020-05-24T11:27:39.225Z] [  5%] Generating nb.gmo
[2020-05-24T11:27:39.225Z] cd /build/fish/src/fish-3.1.2 && /usr/bin/msgfmt -o /build/fish/src/fish-3.1.2/build/nb.gmo po/nb.po
[2020-05-24T11:27:39.225Z] [  6%] Generating pl.gmo
[2020-05-24T11:27:39.225Z] FISH_BUILD_VERSION=3.1.2
[2020-05-24T11:27:39.225Z] cd /build/fish/src/fish-3.1.2 && /usr/bin/msgfmt -o /build/fish/src/fish-3.1.2/build/pl.gmo po/pl.po
[2020-05-24T11:27:39.225Z] [  7%] Building CXX object CMakeFiles/fish_test_helper.dir/src/fish_test_helper.cpp.o
[2020-05-24T11:27:39.225Z] [  8%] Generating de.gmo
[2020-05-24T11:27:39.225Z] /usr/bin/c++  -DBINDIR=L\"/usr/bin\" -DCMAKE_BINARY_DIR=\"/build/fish/src/fish-3.1.2/build\" -DCMAKE_SOURCE_DIR=\"/build/fish/src/fish-3.1.2\" -DDATADIR=L\"/usr/share\" -DDOCDIR=L\"/usr/share/doc/fish\" -DLOCALEDIR=\"/usr/share/locale\" -DPREFIX=L\"/usr\" -DSYSCONFDIR=L\"/etc\" -D_REENTRANT -D_UNICODE=1 -I/build/fish/src/fish-3.1.2/build  -D_FORTIFY_SOURCE=2 -march=x86-64 -mtune=generic -O2 -pipe -fno-plt -D_FORTIFY_SOURCE=2 -Wall -Wextra -Wno-implicit-fallthrough -Wno-comment -Wno-address -Wno-strict-aliasing -Wno-redundant-move    -fno-exceptions -std=gnu++11 -o CMakeFiles/fish_test_helper.dir/src/fish_test_helper.cpp.o -c /build/fish/src/fish-3.1.2/src/fish_test_helper.cpp
[2020-05-24T11:27:39.225Z] [  9%] Generating pt_BR.gmo
[2020-05-24T11:27:39.225Z] make[2]: Leaving directory '/build/fish/src/fish-3.1.2/build'
[2020-05-24T11:27:39.225Z] cd /build/fish/src/fish-3.1.2 && /usr/bin/msgfmt -o /build/fish/src/fish-3.1.2/build/de.gmo po/de.po
[2020-05-24T11:27:39.225Z] cd /build/fish/src/fish-3.1.2 && /usr/bin/msgfmt -o /build/fish/src/fish-3.1.2/build/pt_BR.gmo po/pt_BR.po
[2020-05-24T11:27:39.225Z] [  9%] Built target CHECK-FISH-BUILD-VERSION-FILE
[2020-05-24T11:27:39.225Z] make  -f CMakeFiles/build_fish_pc.dir/build.make CMakeFiles/build_fish_pc.dir/depend
[2020-05-24T11:27:39.225Z] make  -f CMakeFiles/fishlib.dir/build.make CMakeFiles/fishlib.dir/depend
[2020-05-24T11:27:39.225Z] make[2]: Entering directory '/build/fish/src/fish-3.1.2/build'
[2020-05-24T11:27:39.225Z] cd /build/fish/src/fish-3.1.2/build && /usr/bin/cmake -E cmake_depends "Unix Makefiles" /build/fish/src/fish-3.1.2 /build/fish/src/fish-3.1.2 /build/fish/src/fish-3.1.2/build /build/fish/src/fish-3.1.2/build /build/fish/src/fish-3.1.2/build/CMakeFiles/build_fish_pc.dir/DependInfo.cmake --color=
[2020-05-24T11:27:39.225Z] make[2]: Entering directory '/build/fish/src/fish-3.1.2/build'
[2020-05-24T11:27:39.225Z] cd /build/fish/src/fish-3.1.2/build && /usr/bin/cmake -E cmake_depends "Unix Makefiles" /build/fish/src/fish-3.1.2 /build/fish/src/fish-3.1.2 /build/fish/src/fish-3.1.2/build /build/fish/src/fish-3.1.2/build /build/fish/src/fish-3.1.2/build/CMakeFiles/fishlib.dir/DependInfo.cmake --color=
[2020-05-24T11:27:39.225Z] Dependee "/build/fish/src/fish-3.1.2/build/CMakeFiles/build_fish_pc.dir/DependInfo.cmake" is newer than depender "/build/fish/src/fish-3.1.2/build/CMakeFiles/build_fish_pc.dir/depend.internal".
[2020-05-24T11:27:39.225Z] Dependee "/build/fish/src/fish-3.1.2/build/CMakeFiles/CMakeDirectoryInformation.cmake" is newer than depender "/build/fish/src/fish-3.1.2/build/CMakeFiles/build_fish_pc.dir/depend.internal".
[2020-05-24T11:27:39.225Z] Scanning dependencies of target build_fish_pc
[2020-05-24T11:27:39.225Z] make[2]: Leaving directory '/build/fish/src/fish-3.1.2/build'
[2020-05-24T11:27:39.225Z] make  -f CMakeFiles/build_fish_pc.dir/build.make CMakeFiles/build_fish_pc.dir/build
[2020-05-24T11:27:39.225Z] Dependee "/build/fish/src/fish-3.1.2/build/CMakeFiles/fishlib.dir/DependInfo.cmake" is newer than depender "/build/fish/src/fish-3.1.2/build/CMakeFiles/fishlib.dir/depend.internal".
[2020-05-24T11:27:39.225Z] Dependee "/build/fish/src/fish-3.1.2/build/CMakeFiles/CMakeDirectoryInformation.cmake" is newer than depender "/build/fish/src/fish-3.1.2/build/CMakeFiles/fishlib.dir/depend.internal".
[2020-05-24T11:27:39.225Z] make[2]: Entering directory '/build/fish/src/fish-3.1.2/build'
[2020-05-24T11:27:39.225Z] [  9%] Generating fish.pc
[2020-05-24T11:27:39.225Z] sed '/Version/d' fish.pc.noversion > fish.pc
[2020-05-24T11:27:39.225Z] printf Version:\  >> fish.pc
[2020-05-24T11:27:39.225Z] sed 's/FISH_BUILD_VERSION=//;s/"//g' FISH-BUILD-VERSION-FILE >> fish.pc
[2020-05-24T11:27:39.225Z] Scanning dependencies of target fishlib
[2020-05-24T11:27:39.225Z] make[2]: Leaving directory '/build/fish/src/fish-3.1.2/build'
[2020-05-24T11:27:39.225Z] make[2]: Leaving directory '/build/fish/src/fish-3.1.2/build'
[2020-05-24T11:27:39.225Z] make  -f CMakeFiles/fishlib.dir/build.make CMakeFiles/fishlib.dir/build
[2020-05-24T11:27:39.225Z] make[2]: Entering directory '/build/fish/src/fish-3.1.2/build'
[2020-05-24T11:27:39.225Z] [ 10%] Built target build_fish_pc
[2020-05-24T11:27:39.225Z] [ 11%] Building CXX object CMakeFiles/fishlib.dir/src/builtin_bind.cpp.o
[2020-05-24T11:27:39.225Z] [ 12%] Building CXX object CMakeFiles/fishlib.dir/src/builtin_cd.cpp.o
[2020-05-24T11:27:39.225Z] /usr/bin/c++  -DBINDIR=L\"/usr/bin\" -DCMAKE_BINARY_DIR=\"/build/fish/src/fish-3.1.2/build\" -DCMAKE_SOURCE_DIR=\"/build/fish/src/fish-3.1.2\" -DDATADIR=L\"/usr/share\" -DDOCDIR=L\"/usr/share/doc/fish\" -DLOCALEDIR=\"/usr/share/locale\" -DPREFIX=L\"/usr\" -DSYSCONFDIR=L\"/etc\" -D_REENTRANT -D_UNICODE=1 -I/build/fish/src/fish-3.1.2/build  -D_FORTIFY_SOURCE=2 -march=x86-64 -mtune=generic -O2 -pipe -fno-plt -D_FORTIFY_SOURCE=2 -Wall -Wextra -Wno-implicit-fallthrough -Wno-comment -Wno-address -Wno-strict-aliasing -Wno-redundant-move    -fno-exceptions -pthread -std=gnu++11 -o CMakeFiles/fishlib.dir/src/builtin_bind.cpp.o -c /build/fish/src/fish-3.1.2/src/builtin_bind.cpp
[2020-05-24T11:27:39.225Z] [ 13%] Building CXX object CMakeFiles/fishlib.dir/src/autoload.cpp.o
[2020-05-24T11:27:39.225Z] /usr/bin/c++  -DBINDIR=L\"/usr/bin\" -DCMAKE_BINARY_DIR=\"/build/fish/src/fish-3.1.2/build\" -DCMAKE_SOURCE_DIR=\"/build/fish/src/fish-3.1.2\" -DDATADIR=L\"/usr/share\" -DDOCDIR=L\"/usr/share/doc/fish\" -DLOCALEDIR=\"/usr/share/locale\" -DPREFIX=L\"/usr\" -DSYSCONFDIR=L\"/etc\" -D_REENTRANT -D_UNICODE=1 -I/build/fish/src/fish-3.1.2/build  -D_FORTIFY_SOURCE=2 -march=x86-64 -mtune=generic -O2 -pipe -fno-plt -D_FORTIFY_SOURCE=2 -Wall -Wextra -Wno-implicit-fallthrough -Wno-comment -Wno-address -Wno-strict-aliasing -Wno-redundant-move    -fno-exceptions -pthread -std=gnu++11 -o CMakeFiles/fishlib.dir/src/builtin_cd.cpp.o -c /build/fish/src/fish-3.1.2/src/builtin_cd.cpp
[2020-05-24T11:27:39.225Z] /usr/bin/c++  -DBINDIR=L\"/usr/bin\" -DCMAKE_BINARY_DIR=\"/build/fish/src/fish-3.1.2/build\" -DCMAKE_SOURCE_DIR=\"/build/fish/src/fish-3.1.2\" -DDATADIR=L\"/usr/share\" -DDOCDIR=L\"/usr/share/doc/fish\" -DLOCALEDIR=\"/usr/share/locale\" -DPREFIX=L\"/usr\" -DSYSCONFDIR=L\"/etc\" -D_REENTRANT -D_UNICODE=1 -I/build/fish/src/fish-3.1.2/build  -D_FORTIFY_SOURCE=2 -march=x86-64 -mtune=generic -O2 -pipe -fno-plt -D_FORTIFY_SOURCE=2 -Wall -Wextra -Wno-implicit-fallthrough -Wno-comment -Wno-address -Wno-strict-aliasing -Wno-redundant-move    -fno-exceptions -pthread -std=gnu++11 -o CMakeFiles/fishlib.dir/src/autoload.cpp.o -c /build/fish/src/fish-3.1.2/src/autoload.cpp
[2020-05-24T11:27:39.225Z] [ 14%] Building CXX object CMakeFiles/fishlib.dir/src/builtin_disown.cpp.o
[2020-05-24T11:27:39.225Z] /usr/bin/c++  -DBINDIR=L\"/usr/bin\" -DCMAKE_BINARY_DIR=\"/build/fish/src/fish-3.1.2/build\" -DCMAKE_SOURCE_DIR=\"/build/fish/src/fish-3.1.2\" -DDATADIR=L\"/usr/share\" -DDOCDIR=L\"/usr/share/doc/fish\" -DLOCALEDIR=\"/usr/share/locale\" -DPREFIX=L\"/usr\" -DSYSCONFDIR=L\"/etc\" -D_REENTRANT -D_UNICODE=1 -I/build/fish/src/fish-3.1.2/build  -D_FORTIFY_SOURCE=2 -march=x86-64 -mtune=generic -O2 -pipe -fno-plt -D_FORTIFY_SOURCE=2 -Wall -Wextra -Wno-implicit-fallthrough -Wno-comment -Wno-address -Wno-strict-aliasing -Wno-redundant-move    -fno-exceptions -pthread -std=gnu++11 -o CMakeFiles/fishlib.dir/src/builtin_disown.cpp.o -c /build/fish/src/fish-3.1.2/src/builtin_disown.cpp
[2020-05-24T11:27:39.225Z] [ 15%] Building CXX object CMakeFiles/fishlib.dir/src/builtin_command.cpp.o
[2020-05-24T11:27:39.225Z] [ 16%] Building CXX object CMakeFiles/fishlib.dir/src/builtin_bg.cpp.o
[2020-05-24T11:27:39.225Z] [ 16%] Building CXX object CMakeFiles/fishlib.dir/src/builtin_builtin.cpp.o
[2020-05-24T11:27:39.225Z] /usr/bin/c++  -DBINDIR=L\"/usr/bin\" -DCMAKE_BINARY_DIR=\"/build/fish/src/fish-3.1.2/build\" -DCMAKE_SOURCE_DIR=\"/build/fish/src/fish-3.1.2\" -DDATADIR=L\"/usr/share\" -DDOCDIR=L\"/usr/share/doc/fish\" -DLOCALEDIR=\"/usr/share/locale\" -DPREFIX=L\"/usr\" -DSYSCONFDIR=L\"/etc\" -D_REENTRANT -D_UNICODE=1 -I/build/fish/src/fish-3.1.2/build  -D_FORTIFY_SOURCE=2 -march=x86-64 -mtune=generic -O2 -pipe -fno-plt -D_FORTIFY_SOURCE=2 -Wall -Wextra -Wno-implicit-fallthrough -Wno-comment -Wno-address -Wno-strict-aliasing -Wno-redundant-move    -fno-exceptions -pthread -std=gnu++11 -o CMakeFiles/fishlib.dir/src/builtin_command.cpp.o -c /build/fish/src/fish-3.1.2/src/builtin_command.cpp
[2020-05-24T11:27:39.225Z] /usr/bin/c++  -DBINDIR=L\"/usr/bin\" -DCMAKE_BINARY_DIR=\"/build/fish/src/fish-3.1.2/build\" -DCMAKE_SOURCE_DIR=\"/build/fish/src/fish-3.1.2\" -DDATADIR=L\"/usr/share\" -DDOCDIR=L\"/usr/share/doc/fish\" -DLOCALEDIR=\"/usr/share/locale\" -DPREFIX=L\"/usr\" -DSYSCONFDIR=L\"/etc\" -D_REENTRANT -D_UNICODE=1 -I/build/fish/src/fish-3.1.2/build  -D_FORTIFY_SOURCE=2 -march=x86-64 -mtune=generic -O2 -pipe -fno-plt -D_FORTIFY_SOURCE=2 -Wall -Wextra -Wno-implicit-fallthrough -Wno-comment -Wno-address -Wno-strict-aliasing -Wno-redundant-move    -fno-exceptions -pthread -std=gnu++11 -o CMakeFiles/fishlib.dir/src/builtin_bg.cpp.o -c /build/fish/src/fish-3.1.2/src/builtin_bg.cpp
[2020-05-24T11:27:39.225Z] /usr/bin/c++  -DBINDIR=L\"/usr/bin\" -DCMAKE_BINARY_DIR=\"/build/fish/src/fish-3.1.2/build\" -DCMAKE_SOURCE_DIR=\"/build/fish/src/fish-3.1.2\" -DDATADIR=L\"/usr/share\" -DDOCDIR=L\"/usr/share/doc/fish\" -DLOCALEDIR=\"/usr/share/locale\" -DPREFIX=L\"/usr\" -DSYSCONFDIR=L\"/etc\" -D_REENTRANT -D_UNICODE=1 -I/build/fish/src/fish-3.1.2/build  -D_FORTIFY_SOURCE=2 -march=x86-64 -mtune=generic -O2 -pipe -fno-plt -D_FORTIFY_SOURCE=2 -Wall -Wextra -Wno-implicit-fallthrough -Wno-comment -Wno-address -Wno-strict-aliasing -Wno-redundant-move    -fno-exceptions -pthread -std=gnu++11 -o CMakeFiles/fishlib.dir/src/builtin_builtin.cpp.o -c /build/fish/src/fish-3.1.2/src/builtin_builtin.cpp
[2020-05-24T11:27:39.225Z] [ 17%] Building CXX object CMakeFiles/fishlib.dir/src/builtin.cpp.o
[2020-05-24T11:27:39.225Z] [ 18%] Building CXX object CMakeFiles/fishlib.dir/src/builtin_block.cpp.o
[2020-05-24T11:27:39.225Z] /usr/bin/c++  -DBINDIR=L\"/usr/bin\" -DCMAKE_BINARY_DIR=\"/build/fish/src/fish-3.1.2/build\" -DCMAKE_SOURCE_DIR=\"/build/fish/src/fish-3.1.2\" -DDATADIR=L\"/usr/share\" -DDOCDIR=L\"/usr/share/doc/fish\" -DLOCALEDIR=\"/usr/share/locale\" -DPREFIX=L\"/usr\" -DSYSCONFDIR=L\"/etc\" -D_REENTRANT -D_UNICODE=1 -I/build/fish/src/fish-3.1.2/build  -D_FORTIFY_SOURCE=2 -march=x86-64 -mtune=generic -O2 -pipe -fno-plt -D_FORTIFY_SOURCE=2 -Wall -Wextra -Wno-implicit-fallthrough -Wno-comment -Wno-address -Wno-strict-aliasing -Wno-redundant-move    -fno-exceptions -pthread -std=gnu++11 -o CMakeFiles/fishlib.dir/src/builtin.cpp.o -c /build/fish/src/fish-3.1.2/src/builtin.cpp
[2020-05-24T11:27:39.225Z] /usr/bin/c++  -DBINDIR=L\"/usr/bin\" -DCMAKE_BINARY_DIR=\"/build/fish/src/fish-3.1.2/build\" -DCMAKE_SOURCE_DIR=\"/build/fish/src/fish-3.1.2\" -DDATADIR=L\"/usr/share\" -DDOCDIR=L\"/usr/share/doc/fish\" -DLOCALEDIR=\"/usr/share/locale\" -DPREFIX=L\"/usr\" -DSYSCONFDIR=L\"/etc\" -D_REENTRANT -D_UNICODE=1 -I/build/fish/src/fish-3.1.2/build  -D_FORTIFY_SOURCE=2 -march=x86-64 -mtune=generic -O2 -pipe -fno-plt -D_FORTIFY_SOURCE=2 -Wall -Wextra -Wno-implicit-fallthrough -Wno-comment -Wno-address -Wno-strict-aliasing -Wno-redundant-move    -fno-exceptions -pthread -std=gnu++11 -o CMakeFiles/fishlib.dir/src/builtin_block.cpp.o -c /build/fish/src/fish-3.1.2/src/builtin_block.cpp
[2020-05-24T11:27:39.225Z] [ 19%] Building CXX object CMakeFiles/fishlib.dir/src/builtin_commandline.cpp.o
[2020-05-24T11:27:39.225Z] [ 20%] Building CXX object CMakeFiles/fishlib.dir/src/builtin_complete.cpp.o
[2020-05-24T11:27:39.225Z] /usr/bin/c++  -DBINDIR=L\"/usr/bin\" -DCMAKE_BINARY_DIR=\"/build/fish/src/fish-3.1.2/build\" -DCMAKE_SOURCE_DIR=\"/build/fish/src/fish-3.1.2\" -DDATADIR=L\"/usr/share\" -DDOCDIR=L\"/usr/share/doc/fish\" -DLOCALEDIR=\"/usr/share/locale\" -DPREFIX=L\"/usr\" -DSYSCONFDIR=L\"/etc\" -D_REENTRANT -D_UNICODE=1 -I/build/fish/src/fish-3.1.2/build  -D_FORTIFY_SOURCE=2 -march=x86-64 -mtune=generic -O2 -pipe -fno-plt -D_FORTIFY_SOURCE=2 -Wall -Wextra -Wno-implicit-fallthrough -Wno-comment -Wno-address -Wno-strict-aliasing -Wno-redundant-move    -fno-exceptions -pthread -std=gnu++11 -o CMakeFiles/fishlib.dir/src/builtin_commandline.cpp.o -c /build/fish/src/fish-3.1.2/src/builtin_commandline.cpp
[2020-05-24T11:27:39.225Z] [ 21%] Building CXX object CMakeFiles/fishlib.dir/src/builtin_contains.cpp.o
[2020-05-24T11:27:39.225Z] [ 21%] Building CXX object CMakeFiles/fishlib.dir/src/builtin_echo.cpp.o
[2020-05-24T11:27:39.225Z] /usr/bin/c++  -DBINDIR=L\"/usr/bin\" -DCMAKE_BINARY_DIR=\"/build/fish/src/fish-3.1.2/build\" -DCMAKE_SOURCE_DIR=\"/build/fish/src/fish-3.1.2\" -DDATADIR=L\"/usr/share\" -DDOCDIR=L\"/usr/share/doc/fish\" -DLOCALEDIR=\"/usr/share/locale\" -DPREFIX=L\"/usr\" -DSYSCONFDIR=L\"/etc\" -D_REENTRANT -D_UNICODE=1 -I/build/fish/src/fish-3.1.2/build  -D_FORTIFY_SOURCE=2 -march=x86-64 -mtune=generic -O2 -pipe -fno-plt -D_FORTIFY_SOURCE=2 -Wall -Wextra -Wno-implicit-fallthrough -Wno-comment -Wno-address -Wno-strict-aliasing -Wno-redundant-move    -fno-exceptions -pthread -std=gnu++11 -o CMakeFiles/fishlib.dir/src/builtin_complete.cpp.o -c /build/fish/src/fish-3.1.2/src/builtin_complete.cpp
[2020-05-24T11:27:39.225Z] /usr/bin/c++  -DBINDIR=L\"/usr/bin\" -DCMAKE_BINARY_DIR=\"/build/fish/src/fish-3.1.2/build\" -DCMAKE_SOURCE_DIR=\"/build/fish/src/fish-3.1.2\" -DDATADIR=L\"/usr/share\" -DDOCDIR=L\"/usr/share/doc/fish\" -DLOCALEDIR=\"/usr/share/locale\" -DPREFIX=L\"/usr\" -DSYSCONFDIR=L\"/etc\" -D_REENTRANT -D_UNICODE=1 -I/build/fish/src/fish-3.1.2/build  -D_FORTIFY_SOURCE=2 -march=x86-64 -mtune=generic -O2 -pipe -fno-plt -D_FORTIFY_SOURCE=2 -Wall -Wextra -Wno-implicit-fallthrough -Wno-comment -Wno-address -Wno-strict-aliasing -Wno-redundant-move    -fno-exceptions -pthread -std=gnu++11 -o CMakeFiles/fishlib.dir/src/builtin_echo.cpp.o -c /build/fish/src/fish-3.1.2/src/builtin_echo.cpp
[2020-05-24T11:27:39.225Z] [ 22%] Building CXX object CMakeFiles/fishlib.dir/src/builtin_emit.cpp.o
[2020-05-24T11:27:39.225Z] /usr/bin/c++  -DBINDIR=L\"/usr/bin\" -DCMAKE_BINARY_DIR=\"/build/fish/src/fish-3.1.2/build\" -DCMAKE_SOURCE_DIR=\"/build/fish/src/fish-3.1.2\" -DDATADIR=L\"/usr/share\" -DDOCDIR=L\"/usr/share/doc/fish\" -DLOCALEDIR=\"/usr/share/locale\" -DPREFIX=L\"/usr\" -DSYSCONFDIR=L\"/etc\" -D_REENTRANT -D_UNICODE=1 -I/build/fish/src/fish-3.1.2/build  -D_FORTIFY_SOURCE=2 -march=x86-64 -mtune=generic -O2 -pipe -fno-plt -D_FORTIFY_SOURCE=2 -Wall -Wextra -Wno-implicit-fallthrough -Wno-comment -Wno-address -Wno-strict-aliasing -Wno-redundant-move    -fno-exceptions -pthread -std=gnu++11 -o CMakeFiles/fishlib.dir/src/builtin_contains.cpp.o -c /build/fish/src/fish-3.1.2/src/builtin_contains.cpp
[2020-05-24T11:27:39.225Z] /usr/bin/c++  -DBINDIR=L\"/usr/bin\" -DCMAKE_BINARY_DIR=\"/build/fish/src/fish-3.1.2/build\" -DCMAKE_SOURCE_DIR=\"/build/fish/src/fish-3.1.2\" -DDATADIR=L\"/usr/share\" -DDOCDIR=L\"/usr/share/doc/fish\" -DLOCALEDIR=\"/usr/share/locale\" -DPREFIX=L\"/usr\" -DSYSCONFDIR=L\"/etc\" -D_REENTRANT -D_UNICODE=1 -I/build/fish/src/fish-3.1.2/build  -D_FORTIFY_SOURCE=2 -march=x86-64 -mtune=generic -O2 -pipe -fno-plt -D_FORTIFY_SOURCE=2 -Wall -Wextra -Wno-implicit-fallthrough -Wno-comment -Wno-address -Wno-strict-aliasing -Wno-redundant-move    -fno-exceptions -pthread -std=gnu++11 -o CMakeFiles/fishlib.dir/src/builtin_emit.cpp.o -c /build/fish/src/fish-3.1.2/src/builtin_emit.cpp
[2020-05-24T11:27:39.476Z] [ 23%] Linking CXX executable fish_test_helper
[2020-05-24T11:27:39.476Z] /usr/bin/cmake -E cmake_link_script CMakeFiles/fish_test_helper.dir/link.txt --verbose=1
[2020-05-24T11:27:39.476Z] /usr/bin/c++  -D_FORTIFY_SOURCE=2 -march=x86-64 -mtune=generic -O2 -pipe -fno-plt -D_FORTIFY_SOURCE=2 -Wall -Wextra -Wno-implicit-fallthrough -Wno-comment -Wno-address -Wno-strict-aliasing -Wno-redundant-move   -Wl,-O1,--sort-common,--as-needed,-z,relro,-z,now -fuse-ld=gold -rdynamic CMakeFiles/fish_test_helper.dir/src/fish_test_helper.cpp.o  -o fish_test_helper 
[2020-05-24T11:27:39.476Z] make[2]: Leaving directory '/build/fish/src/fish-3.1.2/build'
[2020-05-24T11:27:39.476Z] make[2]: Leaving directory '/build/fish/src/fish-3.1.2/build'
[2020-05-24T11:27:39.476Z] make[2]: Leaving directory '/build/fish/src/fish-3.1.2/build'
[2020-05-24T11:27:39.476Z] make[2]: Leaving directory '/build/fish/src/fish-3.1.2/build'
[2020-05-24T11:27:39.476Z] [ 23%] Built target pofiles_2
[2020-05-24T11:27:39.476Z] [ 23%] Built target pofiles_5
[2020-05-24T11:27:39.476Z] [ 23%] Built target fish_test_helper
[2020-05-24T11:27:39.476Z] [ 23%] Built target pofiles_7
[2020-05-24T11:27:39.476Z] [ 24%] Building CXX object CMakeFiles/fishlib.dir/src/builtin_exit.cpp.o
[2020-05-24T11:27:39.476Z] /usr/bin/c++  -DBINDIR=L\"/usr/bin\" -DCMAKE_BINARY_DIR=\"/build/fish/src/fish-3.1.2/build\" -DCMAKE_SOURCE_DIR=\"/build/fish/src/fish-3.1.2\" -DDATADIR=L\"/usr/share\" -DDOCDIR=L\"/usr/share/doc/fish\" -DLOCALEDIR=\"/usr/share/locale\" -DPREFIX=L\"/usr\" -DSYSCONFDIR=L\"/etc\" -D_REENTRANT -D_UNICODE=1 -I/build/fish/src/fish-3.1.2/build  -D_FORTIFY_SOURCE=2 -march=x86-64 -mtune=generic -O2 -pipe -fno-plt -D_FORTIFY_SOURCE=2 -Wall -Wextra -Wno-implicit-fallthrough -Wno-comment -Wno-address -Wno-strict-aliasing -Wno-redundant-move    -fno-exceptions -pthread -std=gnu++11 -o CMakeFiles/fishlib.dir/src/builtin_exit.cpp.o -c /build/fish/src/fish-3.1.2/src/builtin_exit.cpp
[2020-05-24T11:27:39.476Z] [ 25%] Building CXX object CMakeFiles/fishlib.dir/src/builtin_fg.cpp.o
[2020-05-24T11:27:39.476Z] /usr/bin/c++  -DBINDIR=L\"/usr/bin\" -DCMAKE_BINARY_DIR=\"/build/fish/src/fish-3.1.2/build\" -DCMAKE_SOURCE_DIR=\"/build/fish/src/fish-3.1.2\" -DDATADIR=L\"/usr/share\" -DDOCDIR=L\"/usr/share/doc/fish\" -DLOCALEDIR=\"/usr/share/locale\" -DPREFIX=L\"/usr\" -DSYSCONFDIR=L\"/etc\" -D_REENTRANT -D_UNICODE=1 -I/build/fish/src/fish-3.1.2/build  -D_FORTIFY_SOURCE=2 -march=x86-64 -mtune=generic -O2 -pipe -fno-plt -D_FORTIFY_SOURCE=2 -Wall -Wextra -Wno-implicit-fallthrough -Wno-comment -Wno-address -Wno-strict-aliasing -Wno-redundant-move    -fno-exceptions -pthread -std=gnu++11 -o CMakeFiles/fishlib.dir/src/builtin_fg.cpp.o -c /build/fish/src/fish-3.1.2/src/builtin_fg.cpp
[2020-05-24T11:27:39.476Z] [ 26%] Building CXX object CMakeFiles/fishlib.dir/src/builtin_functions.cpp.o
[2020-05-24T11:27:39.476Z] /usr/bin/c++  -DBINDIR=L\"/usr/bin\" -DCMAKE_BINARY_DIR=\"/build/fish/src/fish-3.1.2/build\" -DCMAKE_SOURCE_DIR=\"/build/fish/src/fish-3.1.2\" -DDATADIR=L\"/usr/share\" -DDOCDIR=L\"/usr/share/doc/fish\" -DLOCALEDIR=\"/usr/share/locale\" -DPREFIX=L\"/usr\" -DSYSCONFDIR=L\"/etc\" -D_REENTRANT -D_UNICODE=1 -I/build/fish/src/fish-3.1.2/build  -D_FORTIFY_SOURCE=2 -march=x86-64 -mtune=generic -O2 -pipe -fno-plt -D_FORTIFY_SOURCE=2 -Wall -Wextra -Wno-implicit-fallthrough -Wno-comment -Wno-address -Wno-strict-aliasing -Wno-redundant-move    -fno-exceptions -pthread -std=gnu++11 -o CMakeFiles/fishlib.dir/src/builtin_functions.cpp.o -c /build/fish/src/fish-3.1.2/src/builtin_functions.cpp
[2020-05-24T11:27:39.476Z] [ 27%] Building CXX object CMakeFiles/fishlib.dir/src/builtin_function.cpp.o
[2020-05-24T11:27:39.476Z] /usr/bin/c++  -DBINDIR=L\"/usr/bin\" -DCMAKE_BINARY_DIR=\"/build/fish/src/fish-3.1.2/build\" -DCMAKE_SOURCE_DIR=\"/build/fish/src/fish-3.1.2\" -DDATADIR=L\"/usr/share\" -DDOCDIR=L\"/usr/share/doc/fish\" -DLOCALEDIR=\"/usr/share/locale\" -DPREFIX=L\"/usr\" -DSYSCONFDIR=L\"/etc\" -D_REENTRANT -D_UNICODE=1 -I/build/fish/src/fish-3.1.2/build  -D_FORTIFY_SOURCE=2 -march=x86-64 -mtune=generic -O2 -pipe -fno-plt -D_FORTIFY_SOURCE=2 -Wall -Wextra -Wno-implicit-fallthrough -Wno-comment -Wno-address -Wno-strict-aliasing -Wno-redundant-move    -fno-exceptions -pthread -std=gnu++11 -o CMakeFiles/fishlib.dir/src/builtin_function.cpp.o -c /build/fish/src/fish-3.1.2/src/builtin_function.cpp
[2020-05-24T11:27:39.476Z] make[2]: Leaving directory '/build/fish/src/fish-3.1.2/build'
[2020-05-24T11:27:39.476Z] make[2]: Leaving directory '/build/fish/src/fish-3.1.2/build'
[2020-05-24T11:27:39.476Z] [ 27%] Built target pofiles_6
[2020-05-24T11:27:39.476Z] [ 27%] Built target pofiles_1
[2020-05-24T11:27:39.476Z] make[2]: Leaving directory '/build/fish/src/fish-3.1.2/build'
[2020-05-24T11:27:39.476Z] [ 28%] Building CXX object CMakeFiles/fishlib.dir/src/builtin_argparse.cpp.o
[2020-05-24T11:27:39.476Z] /usr/bin/c++  -DBINDIR=L\"/usr/bin\" -DCMAKE_BINARY_DIR=\"/build/fish/src/fish-3.1.2/build\" -DCMAKE_SOURCE_DIR=\"/build/fish/src/fish-3.1.2\" -DDATADIR=L\"/usr/share\" -DDOCDIR=L\"/usr/share/doc/fish\" -DLOCALEDIR=\"/usr/share/locale\" -DPREFIX=L\"/usr\" -DSYSCONFDIR=L\"/etc\" -D_REENTRANT -D_UNICODE=1 -I/build/fish/src/fish-3.1.2/build  -D_FORTIFY_SOURCE=2 -march=x86-64 -mtune=generic -O2 -pipe -fno-plt -D_FORTIFY_SOURCE=2 -Wall -Wextra -Wno-implicit-fallthrough -Wno-comment -Wno-address -Wno-strict-aliasing -Wno-redundant-move    -fno-exceptions -pthread -std=gnu++11 -o CMakeFiles/fishlib.dir/src/builtin_argparse.cpp.o -c /build/fish/src/fish-3.1.2/src/builtin_argparse.cpp
[2020-05-24T11:27:39.476Z] [ 28%] Building CXX object CMakeFiles/fishlib.dir/src/builtin_history.cpp.o
[2020-05-24T11:27:39.476Z] /usr/bin/c++  -DBINDIR=L\"/usr/bin\" -DCMAKE_BINARY_DIR=\"/build/fish/src/fish-3.1.2/build\" -DCMAKE_SOURCE_DIR=\"/build/fish/src/fish-3.1.2\" -DDATADIR=L\"/usr/share\" -DDOCDIR=L\"/usr/share/doc/fish\" -DLOCALEDIR=\"/usr/share/locale\" -DPREFIX=L\"/usr\" -DSYSCONFDIR=L\"/etc\" -D_REENTRANT -D_UNICODE=1 -I/build/fish/src/fish-3.1.2/build  -D_FORTIFY_SOURCE=2 -march=x86-64 -mtune=generic -O2 -pipe -fno-plt -D_FORTIFY_SOURCE=2 -Wall -Wextra -Wno-implicit-fallthrough -Wno-comment -Wno-address -Wno-strict-aliasing -Wno-redundant-move    -fno-exceptions -pthread -std=gnu++11 -o CMakeFiles/fishlib.dir/src/builtin_history.cpp.o -c /build/fish/src/fish-3.1.2/src/builtin_history.cpp
[2020-05-24T11:27:39.476Z] [ 28%] Built target pofiles_4
[2020-05-24T11:27:39.476Z] make[2]: Leaving directory '/build/fish/src/fish-3.1.2/build'
[2020-05-24T11:27:39.476Z] make[2]: Leaving directory '/build/fish/src/fish-3.1.2/build'
[2020-05-24T11:27:39.476Z] [ 28%] Built target pofiles_9
[2020-05-24T11:27:39.476Z] [ 29%] Building CXX object CMakeFiles/fishlib.dir/src/builtin_jobs.cpp.o
[2020-05-24T11:27:39.476Z] /usr/bin/c++  -DBINDIR=L\"/usr/bin\" -DCMAKE_BINARY_DIR=\"/build/fish/src/fish-3.1.2/build\" -DCMAKE_SOURCE_DIR=\"/build/fish/src/fish-3.1.2\" -DDATADIR=L\"/usr/share\" -DDOCDIR=L\"/usr/share/doc/fish\" -DLOCALEDIR=\"/usr/share/locale\" -DPREFIX=L\"/usr\" -DSYSCONFDIR=L\"/etc\" -D_REENTRANT -D_UNICODE=1 -I/build/fish/src/fish-3.1.2/build  -D_FORTIFY_SOURCE=2 -march=x86-64 -mtune=generic -O2 -pipe -fno-plt -D_FORTIFY_SOURCE=2 -Wall -Wextra -Wno-implicit-fallthrough -Wno-comment -Wno-address -Wno-strict-aliasing -Wno-redundant-move    -fno-exceptions -pthread -std=gnu++11 -o CMakeFiles/fishlib.dir/src/builtin_jobs.cpp.o -c /build/fish/src/fish-3.1.2/src/builtin_jobs.cpp
[2020-05-24T11:27:39.476Z] [ 29%] Built target pofiles_8
[2020-05-24T11:27:39.476Z] [ 30%] Building CXX object CMakeFiles/fishlib.dir/src/builtin_math.cpp.o
[2020-05-24T11:27:39.476Z] /usr/bin/c++  -DBINDIR=L\"/usr/bin\" -DCMAKE_BINARY_DIR=\"/build/fish/src/fish-3.1.2/build\" -DCMAKE_SOURCE_DIR=\"/build/fish/src/fish-3.1.2\" -DDATADIR=L\"/usr/share\" -DDOCDIR=L\"/usr/share/doc/fish\" -DLOCALEDIR=\"/usr/share/locale\" -DPREFIX=L\"/usr\" -DSYSCONFDIR=L\"/etc\" -D_REENTRANT -D_UNICODE=1 -I/build/fish/src/fish-3.1.2/build  -D_FORTIFY_SOURCE=2 -march=x86-64 -mtune=generic -O2 -pipe -fno-plt -D_FORTIFY_SOURCE=2 -Wall -Wextra -Wno-implicit-fallthrough -Wno-comment -Wno-address -Wno-strict-aliasing -Wno-redundant-move    -fno-exceptions -pthread -std=gnu++11 -o CMakeFiles/fishlib.dir/src/builtin_math.cpp.o -c /build/fish/src/fish-3.1.2/src/builtin_math.cpp
[2020-05-24T11:27:39.476Z] [ 31%] Building CXX object CMakeFiles/fishlib.dir/src/builtin_printf.cpp.o
[2020-05-24T11:27:39.476Z] /usr/bin/c++  -DBINDIR=L\"/usr/bin\" -DCMAKE_BINARY_DIR=\"/build/fish/src/fish-3.1.2/build\" -DCMAKE_SOURCE_DIR=\"/build/fish/src/fish-3.1.2\" -DDATADIR=L\"/usr/share\" -DDOCDIR=L\"/usr/share/doc/fish\" -DLOCALEDIR=\"/usr/share/locale\" -DPREFIX=L\"/usr\" -DSYSCONFDIR=L\"/etc\" -D_REENTRANT -D_UNICODE=1 -I/build/fish/src/fish-3.1.2/build  -D_FORTIFY_SOURCE=2 -march=x86-64 -mtune=generic -O2 -pipe -fno-plt -D_FORTIFY_SOURCE=2 -Wall -Wextra -Wno-implicit-fallthrough -Wno-comment -Wno-address -Wno-strict-aliasing -Wno-redundant-move    -fno-exceptions -pthread -std=gnu++11 -o CMakeFiles/fishlib.dir/src/builtin_printf.cpp.o -c /build/fish/src/fish-3.1.2/src/builtin_printf.cpp
[2020-05-24T11:27:39.476Z] make[2]: Leaving directory '/build/fish/src/fish-3.1.2/build'
[2020-05-24T11:27:39.476Z] [ 31%] Built target pofiles_3
[2020-05-24T11:27:39.476Z] [ 32%] Building CXX object CMakeFiles/fishlib.dir/src/builtin_pwd.cpp.o
[2020-05-24T11:27:39.476Z] /usr/bin/c++  -DBINDIR=L\"/usr/bin\" -DCMAKE_BINARY_DIR=\"/build/fish/src/fish-3.1.2/build\" -DCMAKE_SOURCE_DIR=\"/build/fish/src/fish-3.1.2\" -DDATADIR=L\"/usr/share\" -DDOCDIR=L\"/usr/share/doc/fish\" -DLOCALEDIR=\"/usr/share/locale\" -DPREFIX=L\"/usr\" -DSYSCONFDIR=L\"/etc\" -D_REENTRANT -D_UNICODE=1 -I/build/fish/src/fish-3.1.2/build  -D_FORTIFY_SOURCE=2 -march=x86-64 -mtune=generic -O2 -pipe -fno-plt -D_FORTIFY_SOURCE=2 -Wall -Wextra -Wno-implicit-fallthrough -Wno-comment -Wno-address -Wno-strict-aliasing -Wno-redundant-move    -fno-exceptions -pthread -std=gnu++11 -o CMakeFiles/fishlib.dir/src/builtin_pwd.cpp.o -c /build/fish/src/fish-3.1.2/src/builtin_pwd.cpp
[2020-05-24T11:27:40.829Z] [ 33%] Building CXX object CMakeFiles/fishlib.dir/src/builtin_random.cpp.o
[2020-05-24T11:27:40.829Z] /usr/bin/c++  -DBINDIR=L\"/usr/bin\" -DCMAKE_BINARY_DIR=\"/build/fish/src/fish-3.1.2/build\" -DCMAKE_SOURCE_DIR=\"/build/fish/src/fish-3.1.2\" -DDATADIR=L\"/usr/share\" -DDOCDIR=L\"/usr/share/doc/fish\" -DLOCALEDIR=\"/usr/share/locale\" -DPREFIX=L\"/usr\" -DSYSCONFDIR=L\"/etc\" -D_REENTRANT -D_UNICODE=1 -I/build/fish/src/fish-3.1.2/build  -D_FORTIFY_SOURCE=2 -march=x86-64 -mtune=generic -O2 -pipe -fno-plt -D_FORTIFY_SOURCE=2 -Wall -Wextra -Wno-implicit-fallthrough -Wno-comment -Wno-address -Wno-strict-aliasing -Wno-redundant-move    -fno-exceptions -pthread -std=gnu++11 -o CMakeFiles/fishlib.dir/src/builtin_random.cpp.o -c /build/fish/src/fish-3.1.2/src/builtin_random.cpp
[2020-05-24T11:27:41.079Z] [ 34%] Building CXX object CMakeFiles/fishlib.dir/src/builtin_read.cpp.o
[2020-05-24T11:27:41.079Z] /usr/bin/c++  -DBINDIR=L\"/usr/bin\" -DCMAKE_BINARY_DIR=\"/build/fish/src/fish-3.1.2/build\" -DCMAKE_SOURCE_DIR=\"/build/fish/src/fish-3.1.2\" -DDATADIR=L\"/usr/share\" -DDOCDIR=L\"/usr/share/doc/fish\" -DLOCALEDIR=\"/usr/share/locale\" -DPREFIX=L\"/usr\" -DSYSCONFDIR=L\"/etc\" -D_REENTRANT -D_UNICODE=1 -I/build/fish/src/fish-3.1.2/build  -D_FORTIFY_SOURCE=2 -march=x86-64 -mtune=generic -O2 -pipe -fno-plt -D_FORTIFY_SOURCE=2 -Wall -Wextra -Wno-implicit-fallthrough -Wno-comment -Wno-address -Wno-strict-aliasing -Wno-redundant-move    -fno-exceptions -pthread -std=gnu++11 -o CMakeFiles/fishlib.dir/src/builtin_read.cpp.o -c /build/fish/src/fish-3.1.2/src/builtin_read.cpp
[2020-05-24T11:27:41.079Z] [ 34%] Building CXX object CMakeFiles/fishlib.dir/src/builtin_realpath.cpp.o
[2020-05-24T11:27:41.079Z] /usr/bin/c++  -DBINDIR=L\"/usr/bin\" -DCMAKE_BINARY_DIR=\"/build/fish/src/fish-3.1.2/build\" -DCMAKE_SOURCE_DIR=\"/build/fish/src/fish-3.1.2\" -DDATADIR=L\"/usr/share\" -DDOCDIR=L\"/usr/share/doc/fish\" -DLOCALEDIR=\"/usr/share/locale\" -DPREFIX=L\"/usr\" -DSYSCONFDIR=L\"/etc\" -D_REENTRANT -D_UNICODE=1 -I/build/fish/src/fish-3.1.2/build  -D_FORTIFY_SOURCE=2 -march=x86-64 -mtune=generic -O2 -pipe -fno-plt -D_FORTIFY_SOURCE=2 -Wall -Wextra -Wno-implicit-fallthrough -Wno-comment -Wno-address -Wno-strict-aliasing -Wno-redundant-move    -fno-exceptions -pthread -std=gnu++11 -o CMakeFiles/fishlib.dir/src/builtin_realpath.cpp.o -c /build/fish/src/fish-3.1.2/src/builtin_realpath.cpp
[2020-05-24T11:27:41.079Z] [ 35%] Building CXX object CMakeFiles/fishlib.dir/src/builtin_return.cpp.o
[2020-05-24T11:27:41.079Z] /usr/bin/c++  -DBINDIR=L\"/usr/bin\" -DCMAKE_BINARY_DIR=\"/build/fish/src/fish-3.1.2/build\" -DCMAKE_SOURCE_DIR=\"/build/fish/src/fish-3.1.2\" -DDATADIR=L\"/usr/share\" -DDOCDIR=L\"/usr/share/doc/fish\" -DLOCALEDIR=\"/usr/share/locale\" -DPREFIX=L\"/usr\" -DSYSCONFDIR=L\"/etc\" -D_REENTRANT -D_UNICODE=1 -I/build/fish/src/fish-3.1.2/build  -D_FORTIFY_SOURCE=2 -march=x86-64 -mtune=generic -O2 -pipe -fno-plt -D_FORTIFY_SOURCE=2 -Wall -Wextra -Wno-implicit-fallthrough -Wno-comment -Wno-address -Wno-strict-aliasing -Wno-redundant-move    -fno-exceptions -pthread -std=gnu++11 -o CMakeFiles/fishlib.dir/src/builtin_return.cpp.o -c /build/fish/src/fish-3.1.2/src/builtin_return.cpp
[2020-05-24T11:27:41.079Z] [ 36%] Building CXX object CMakeFiles/fishlib.dir/src/builtin_set.cpp.o
[2020-05-24T11:27:41.079Z] /usr/bin/c++  -DBINDIR=L\"/usr/bin\" -DCMAKE_BINARY_DIR=\"/build/fish/src/fish-3.1.2/build\" -DCMAKE_SOURCE_DIR=\"/build/fish/src/fish-3.1.2\" -DDATADIR=L\"/usr/share\" -DDOCDIR=L\"/usr/share/doc/fish\" -DLOCALEDIR=\"/usr/share/locale\" -DPREFIX=L\"/usr\" -DSYSCONFDIR=L\"/etc\" -D_REENTRANT -D_UNICODE=1 -I/build/fish/src/fish-3.1.2/build  -D_FORTIFY_SOURCE=2 -march=x86-64 -mtune=generic -O2 -pipe -fno-plt -D_FORTIFY_SOURCE=2 -Wall -Wextra -Wno-implicit-fallthrough -Wno-comment -Wno-address -Wno-strict-aliasing -Wno-redundant-move    -fno-exceptions -pthread -std=gnu++11 -o CMakeFiles/fishlib.dir/src/builtin_set.cpp.o -c /build/fish/src/fish-3.1.2/src/builtin_set.cpp
[2020-05-24T11:27:41.330Z] [ 37%] Building CXX object CMakeFiles/fishlib.dir/src/builtin_set_color.cpp.o
[2020-05-24T11:27:41.330Z] /usr/bin/c++  -DBINDIR=L\"/usr/bin\" -DCMAKE_BINARY_DIR=\"/build/fish/src/fish-3.1.2/build\" -DCMAKE_SOURCE_DIR=\"/build/fish/src/fish-3.1.2\" -DDATADIR=L\"/usr/share\" -DDOCDIR=L\"/usr/share/doc/fish\" -DLOCALEDIR=\"/usr/share/locale\" -DPREFIX=L\"/usr\" -DSYSCONFDIR=L\"/etc\" -D_REENTRANT -D_UNICODE=1 -I/build/fish/src/fish-3.1.2/build  -D_FORTIFY_SOURCE=2 -march=x86-64 -mtune=generic -O2 -pipe -fno-plt -D_FORTIFY_SOURCE=2 -Wall -Wextra -Wno-implicit-fallthrough -Wno-comment -Wno-address -Wno-strict-aliasing -Wno-redundant-move    -fno-exceptions -pthread -std=gnu++11 -o CMakeFiles/fishlib.dir/src/builtin_set_color.cpp.o -c /build/fish/src/fish-3.1.2/src/builtin_set_color.cpp
[2020-05-24T11:27:41.330Z] [ 38%] Building CXX object CMakeFiles/fishlib.dir/src/builtin_source.cpp.o
[2020-05-24T11:27:41.330Z] /usr/bin/c++  -DBINDIR=L\"/usr/bin\" -DCMAKE_BINARY_DIR=\"/build/fish/src/fish-3.1.2/build\" -DCMAKE_SOURCE_DIR=\"/build/fish/src/fish-3.1.2\" -DDATADIR=L\"/usr/share\" -DDOCDIR=L\"/usr/share/doc/fish\" -DLOCALEDIR=\"/usr/share/locale\" -DPREFIX=L\"/usr\" -DSYSCONFDIR=L\"/etc\" -D_REENTRANT -D_UNICODE=1 -I/build/fish/src/fish-3.1.2/build  -D_FORTIFY_SOURCE=2 -march=x86-64 -mtune=generic -O2 -pipe -fno-plt -D_FORTIFY_SOURCE=2 -Wall -Wextra -Wno-implicit-fallthrough -Wno-comment -Wno-address -Wno-strict-aliasing -Wno-redundant-move    -fno-exceptions -pthread -std=gnu++11 -o CMakeFiles/fishlib.dir/src/builtin_source.cpp.o -c /build/fish/src/fish-3.1.2/src/builtin_source.cpp
[2020-05-24T11:27:41.330Z] [ 39%] Building CXX object CMakeFiles/fishlib.dir/src/builtin_status.cpp.o
[2020-05-24T11:27:41.330Z] /usr/bin/c++  -DBINDIR=L\"/usr/bin\" -DCMAKE_BINARY_DIR=\"/build/fish/src/fish-3.1.2/build\" -DCMAKE_SOURCE_DIR=\"/build/fish/src/fish-3.1.2\" -DDATADIR=L\"/usr/share\" -DDOCDIR=L\"/usr/share/doc/fish\" -DLOCALEDIR=\"/usr/share/locale\" -DPREFIX=L\"/usr\" -DSYSCONFDIR=L\"/etc\" -D_REENTRANT -D_UNICODE=1 -I/build/fish/src/fish-3.1.2/build  -D_FORTIFY_SOURCE=2 -march=x86-64 -mtune=generic -O2 -pipe -fno-plt -D_FORTIFY_SOURCE=2 -Wall -Wextra -Wno-implicit-fallthrough -Wno-comment -Wno-address -Wno-strict-aliasing -Wno-redundant-move    -fno-exceptions -pthread -std=gnu++11 -o CMakeFiles/fishlib.dir/src/builtin_status.cpp.o -c /build/fish/src/fish-3.1.2/src/builtin_status.cpp
[2020-05-24T11:27:41.330Z] [ 40%] Building CXX object CMakeFiles/fishlib.dir/src/builtin_string.cpp.o
[2020-05-24T11:27:41.330Z] /usr/bin/c++  -DBINDIR=L\"/usr/bin\" -DCMAKE_BINARY_DIR=\"/build/fish/src/fish-3.1.2/build\" -DCMAKE_SOURCE_DIR=\"/build/fish/src/fish-3.1.2\" -DDATADIR=L\"/usr/share\" -DDOCDIR=L\"/usr/share/doc/fish\" -DLOCALEDIR=\"/usr/share/locale\" -DPREFIX=L\"/usr\" -DSYSCONFDIR=L\"/etc\" -D_REENTRANT -D_UNICODE=1 -I/build/fish/src/fish-3.1.2/build  -D_FORTIFY_SOURCE=2 -march=x86-64 -mtune=generic -O2 -pipe -fno-plt -D_FORTIFY_SOURCE=2 -Wall -Wextra -Wno-implicit-fallthrough -Wno-comment -Wno-address -Wno-strict-aliasing -Wno-redundant-move    -fno-exceptions -pthread -std=gnu++11 -o CMakeFiles/fishlib.dir/src/builtin_string.cpp.o -c /build/fish/src/fish-3.1.2/src/builtin_string.cpp
[2020-05-24T11:27:41.580Z] [ 40%] Building CXX object CMakeFiles/fishlib.dir/src/builtin_test.cpp.o
[2020-05-24T11:27:41.580Z] /usr/bin/c++  -DBINDIR=L\"/usr/bin\" -DCMAKE_BINARY_DIR=\"/build/fish/src/fish-3.1.2/build\" -DCMAKE_SOURCE_DIR=\"/build/fish/src/fish-3.1.2\" -DDATADIR=L\"/usr/share\" -DDOCDIR=L\"/usr/share/doc/fish\" -DLOCALEDIR=\"/usr/share/locale\" -DPREFIX=L\"/usr\" -DSYSCONFDIR=L\"/etc\" -D_REENTRANT -D_UNICODE=1 -I/build/fish/src/fish-3.1.2/build  -D_FORTIFY_SOURCE=2 -march=x86-64 -mtune=generic -O2 -pipe -fno-plt -D_FORTIFY_SOURCE=2 -Wall -Wextra -Wno-implicit-fallthrough -Wno-comment -Wno-address -Wno-strict-aliasing -Wno-redundant-move    -fno-exceptions -pthread -std=gnu++11 -o CMakeFiles/fishlib.dir/src/builtin_test.cpp.o -c /build/fish/src/fish-3.1.2/src/builtin_test.cpp
[2020-05-24T11:27:41.580Z] [ 41%] Building CXX object CMakeFiles/fishlib.dir/src/builtin_ulimit.cpp.o
[2020-05-24T11:27:41.580Z] /usr/bin/c++  -DBINDIR=L\"/usr/bin\" -DCMAKE_BINARY_DIR=\"/build/fish/src/fish-3.1.2/build\" -DCMAKE_SOURCE_DIR=\"/build/fish/src/fish-3.1.2\" -DDATADIR=L\"/usr/share\" -DDOCDIR=L\"/usr/share/doc/fish\" -DLOCALEDIR=\"/usr/share/locale\" -DPREFIX=L\"/usr\" -DSYSCONFDIR=L\"/etc\" -D_REENTRANT -D_UNICODE=1 -I/build/fish/src/fish-3.1.2/build  -D_FORTIFY_SOURCE=2 -march=x86-64 -mtune=generic -O2 -pipe -fno-plt -D_FORTIFY_SOURCE=2 -Wall -Wextra -Wno-implicit-fallthrough -Wno-comment -Wno-address -Wno-strict-aliasing -Wno-redundant-move    -fno-exceptions -pthread -std=gnu++11 -o CMakeFiles/fishlib.dir/src/builtin_ulimit.cpp.o -c /build/fish/src/fish-3.1.2/src/builtin_ulimit.cpp
[2020-05-24T11:27:41.831Z] [ 42%] Building CXX object CMakeFiles/fishlib.dir/src/builtin_wait.cpp.o
[2020-05-24T11:27:41.831Z] /usr/bin/c++  -DBINDIR=L\"/usr/bin\" -DCMAKE_BINARY_DIR=\"/build/fish/src/fish-3.1.2/build\" -DCMAKE_SOURCE_DIR=\"/build/fish/src/fish-3.1.2\" -DDATADIR=L\"/usr/share\" -DDOCDIR=L\"/usr/share/doc/fish\" -DLOCALEDIR=\"/usr/share/locale\" -DPREFIX=L\"/usr\" -DSYSCONFDIR=L\"/etc\" -D_REENTRANT -D_UNICODE=1 -I/build/fish/src/fish-3.1.2/build  -D_FORTIFY_SOURCE=2 -march=x86-64 -mtune=generic -O2 -pipe -fno-plt -D_FORTIFY_SOURCE=2 -Wall -Wextra -Wno-implicit-fallthrough -Wno-comment -Wno-address -Wno-strict-aliasing -Wno-redundant-move    -fno-exceptions -pthread -std=gnu++11 -o CMakeFiles/fishlib.dir/src/builtin_wait.cpp.o -c /build/fish/src/fish-3.1.2/src/builtin_wait.cpp
[2020-05-24T11:27:41.831Z] [ 43%] Building CXX object CMakeFiles/fishlib.dir/src/builtin_eval.cpp.o
[2020-05-24T11:27:41.831Z] /usr/bin/c++  -DBINDIR=L\"/usr/bin\" -DCMAKE_BINARY_DIR=\"/build/fish/src/fish-3.1.2/build\" -DCMAKE_SOURCE_DIR=\"/build/fish/src/fish-3.1.2\" -DDATADIR=L\"/usr/share\" -DDOCDIR=L\"/usr/share/doc/fish\" -DLOCALEDIR=\"/usr/share/locale\" -DPREFIX=L\"/usr\" -DSYSCONFDIR=L\"/etc\" -D_REENTRANT -D_UNICODE=1 -I/build/fish/src/fish-3.1.2/build  -D_FORTIFY_SOURCE=2 -march=x86-64 -mtune=generic -O2 -pipe -fno-plt -D_FORTIFY_SOURCE=2 -Wall -Wextra -Wno-implicit-fallthrough -Wno-comment -Wno-address -Wno-strict-aliasing -Wno-redundant-move    -fno-exceptions -pthread -std=gnu++11 -o CMakeFiles/fishlib.dir/src/builtin_eval.cpp.o -c /build/fish/src/fish-3.1.2/src/builtin_eval.cpp
[2020-05-24T11:27:41.831Z] [ 44%] Building CXX object CMakeFiles/fishlib.dir/src/color.cpp.o
[2020-05-24T11:27:41.831Z] /usr/bin/c++  -DBINDIR=L\"/usr/bin\" -DCMAKE_BINARY_DIR=\"/build/fish/src/fish-3.1.2/build\" -DCMAKE_SOURCE_DIR=\"/build/fish/src/fish-3.1.2\" -DDATADIR=L\"/usr/share\" -DDOCDIR=L\"/usr/share/doc/fish\" -DLOCALEDIR=\"/usr/share/locale\" -DPREFIX=L\"/usr\" -DSYSCONFDIR=L\"/etc\" -D_REENTRANT -D_UNICODE=1 -I/build/fish/src/fish-3.1.2/build  -D_FORTIFY_SOURCE=2 -march=x86-64 -mtune=generic -O2 -pipe -fno-plt -D_FORTIFY_SOURCE=2 -Wall -Wextra -Wno-implicit-fallthrough -Wno-comment -Wno-address -Wno-strict-aliasing -Wno-redundant-move    -fno-exceptions -pthread -std=gnu++11 -o CMakeFiles/fishlib.dir/src/color.cpp.o -c /build/fish/src/fish-3.1.2/src/color.cpp
[2020-05-24T11:27:41.831Z] [ 45%] Building CXX object CMakeFiles/fishlib.dir/src/common.cpp.o
[2020-05-24T11:27:41.831Z] /usr/bin/c++  -DBINDIR=L\"/usr/bin\" -DCMAKE_BINARY_DIR=\"/build/fish/src/fish-3.1.2/build\" -DCMAKE_SOURCE_DIR=\"/build/fish/src/fish-3.1.2\" -DDATADIR=L\"/usr/share\" -DDOCDIR=L\"/usr/share/doc/fish\" -DLOCALEDIR=\"/usr/share/locale\" -DPREFIX=L\"/usr\" -DSYSCONFDIR=L\"/etc\" -D_REENTRANT -D_UNICODE=1 -I/build/fish/src/fish-3.1.2/build  -D_FORTIFY_SOURCE=2 -march=x86-64 -mtune=generic -O2 -pipe -fno-plt -D_FORTIFY_SOURCE=2 -Wall -Wextra -Wno-implicit-fallthrough -Wno-comment -Wno-address -Wno-strict-aliasing -Wno-redundant-move    -fno-exceptions -pthread -std=gnu++11 -o CMakeFiles/fishlib.dir/src/common.cpp.o -c /build/fish/src/fish-3.1.2/src/common.cpp
[2020-05-24T11:27:42.081Z] [ 46%] Building CXX object CMakeFiles/fishlib.dir/src/complete.cpp.o
[2020-05-24T11:27:42.081Z] /usr/bin/c++  -DBINDIR=L\"/usr/bin\" -DCMAKE_BINARY_DIR=\"/build/fish/src/fish-3.1.2/build\" -DCMAKE_SOURCE_DIR=\"/build/fish/src/fish-3.1.2\" -DDATADIR=L\"/usr/share\" -DDOCDIR=L\"/usr/share/doc/fish\" -DLOCALEDIR=\"/usr/share/locale\" -DPREFIX=L\"/usr\" -DSYSCONFDIR=L\"/etc\" -D_REENTRANT -D_UNICODE=1 -I/build/fish/src/fish-3.1.2/build  -D_FORTIFY_SOURCE=2 -march=x86-64 -mtune=generic -O2 -pipe -fno-plt -D_FORTIFY_SOURCE=2 -Wall -Wextra -Wno-implicit-fallthrough -Wno-comment -Wno-address -Wno-strict-aliasing -Wno-redundant-move    -fno-exceptions -pthread -std=gnu++11 -o CMakeFiles/fishlib.dir/src/complete.cpp.o -c /build/fish/src/fish-3.1.2/src/complete.cpp
[2020-05-24T11:27:42.081Z] [ 46%] Building CXX object CMakeFiles/fishlib.dir/src/env.cpp.o
[2020-05-24T11:27:42.081Z] /usr/bin/c++  -DBINDIR=L\"/usr/bin\" -DCMAKE_BINARY_DIR=\"/build/fish/src/fish-3.1.2/build\" -DCMAKE_SOURCE_DIR=\"/build/fish/src/fish-3.1.2\" -DDATADIR=L\"/usr/share\" -DDOCDIR=L\"/usr/share/doc/fish\" -DLOCALEDIR=\"/usr/share/locale\" -DPREFIX=L\"/usr\" -DSYSCONFDIR=L\"/etc\" -D_REENTRANT -D_UNICODE=1 -I/build/fish/src/fish-3.1.2/build  -D_FORTIFY_SOURCE=2 -march=x86-64 -mtune=generic -O2 -pipe -fno-plt -D_FORTIFY_SOURCE=2 -Wall -Wextra -Wno-implicit-fallthrough -Wno-comment -Wno-address -Wno-strict-aliasing -Wno-redundant-move    -fno-exceptions -pthread -std=gnu++11 -o CMakeFiles/fishlib.dir/src/env.cpp.o -c /build/fish/src/fish-3.1.2/src/env.cpp
[2020-05-24T11:27:42.081Z] [ 47%] Building CXX object CMakeFiles/fishlib.dir/src/env_dispatch.cpp.o
[2020-05-24T11:27:42.082Z] /usr/bin/c++  -DBINDIR=L\"/usr/bin\" -DCMAKE_BINARY_DIR=\"/build/fish/src/fish-3.1.2/build\" -DCMAKE_SOURCE_DIR=\"/build/fish/src/fish-3.1.2\" -DDATADIR=L\"/usr/share\" -DDOCDIR=L\"/usr/share/doc/fish\" -DLOCALEDIR=\"/usr/share/locale\" -DPREFIX=L\"/usr\" -DSYSCONFDIR=L\"/etc\" -D_REENTRANT -D_UNICODE=1 -I/build/fish/src/fish-3.1.2/build  -D_FORTIFY_SOURCE=2 -march=x86-64 -mtune=generic -O2 -pipe -fno-plt -D_FORTIFY_SOURCE=2 -Wall -Wextra -Wno-implicit-fallthrough -Wno-comment -Wno-address -Wno-strict-aliasing -Wno-redundant-move    -fno-exceptions -pthread -std=gnu++11 -o CMakeFiles/fishlib.dir/src/env_dispatch.cpp.o -c /build/fish/src/fish-3.1.2/src/env_dispatch.cpp
[2020-05-24T11:27:42.082Z] [ 48%] Building CXX object CMakeFiles/fishlib.dir/src/env_universal_common.cpp.o
[2020-05-24T11:27:42.082Z] /usr/bin/c++  -DBINDIR=L\"/usr/bin\" -DCMAKE_BINARY_DIR=\"/build/fish/src/fish-3.1.2/build\" -DCMAKE_SOURCE_DIR=\"/build/fish/src/fish-3.1.2\" -DDATADIR=L\"/usr/share\" -DDOCDIR=L\"/usr/share/doc/fish\" -DLOCALEDIR=\"/usr/share/locale\" -DPREFIX=L\"/usr\" -DSYSCONFDIR=L\"/etc\" -D_REENTRANT -D_UNICODE=1 -I/build/fish/src/fish-3.1.2/build  -D_FORTIFY_SOURCE=2 -march=x86-64 -mtune=generic -O2 -pipe -fno-plt -D_FORTIFY_SOURCE=2 -Wall -Wextra -Wno-implicit-fallthrough -Wno-comment -Wno-address -Wno-strict-aliasing -Wno-redundant-move    -fno-exceptions -pthread -std=gnu++11 -o CMakeFiles/fishlib.dir/src/env_universal_common.cpp.o -c /build/fish/src/fish-3.1.2/src/env_universal_common.cpp
[2020-05-24T11:27:42.332Z] [ 49%] Building CXX object CMakeFiles/fishlib.dir/src/event.cpp.o
[2020-05-24T11:27:42.332Z] /usr/bin/c++  -DBINDIR=L\"/usr/bin\" -DCMAKE_BINARY_DIR=\"/build/fish/src/fish-3.1.2/build\" -DCMAKE_SOURCE_DIR=\"/build/fish/src/fish-3.1.2\" -DDATADIR=L\"/usr/share\" -DDOCDIR=L\"/usr/share/doc/fish\" -DLOCALEDIR=\"/usr/share/locale\" -DPREFIX=L\"/usr\" -DSYSCONFDIR=L\"/etc\" -D_REENTRANT -D_UNICODE=1 -I/build/fish/src/fish-3.1.2/build  -D_FORTIFY_SOURCE=2 -march=x86-64 -mtune=generic -O2 -pipe -fno-plt -D_FORTIFY_SOURCE=2 -Wall -Wextra -Wno-implicit-fallthrough -Wno-comment -Wno-address -Wno-strict-aliasing -Wno-redundant-move    -fno-exceptions -pthread -std=gnu++11 -o CMakeFiles/fishlib.dir/src/event.cpp.o -c /build/fish/src/fish-3.1.2/src/event.cpp
[2020-05-24T11:27:42.332Z] [ 50%] Building CXX object CMakeFiles/fishlib.dir/src/exec.cpp.o
[2020-05-24T11:27:42.332Z] /usr/bin/c++  -DBINDIR=L\"/usr/bin\" -DCMAKE_BINARY_DIR=\"/build/fish/src/fish-3.1.2/build\" -DCMAKE_SOURCE_DIR=\"/build/fish/src/fish-3.1.2\" -DDATADIR=L\"/usr/share\" -DDOCDIR=L\"/usr/share/doc/fish\" -DLOCALEDIR=\"/usr/share/locale\" -DPREFIX=L\"/usr\" -DSYSCONFDIR=L\"/etc\" -D_REENTRANT -D_UNICODE=1 -I/build/fish/src/fish-3.1.2/build  -D_FORTIFY_SOURCE=2 -march=x86-64 -mtune=generic -O2 -pipe -fno-plt -D_FORTIFY_SOURCE=2 -Wall -Wextra -Wno-implicit-fallthrough -Wno-comment -Wno-address -Wno-strict-aliasing -Wno-redundant-move    -fno-exceptions -pthread -std=gnu++11 -o CMakeFiles/fishlib.dir/src/exec.cpp.o -c /build/fish/src/fish-3.1.2/src/exec.cpp
[2020-05-24T11:27:42.332Z] [ 51%] Building CXX object CMakeFiles/fishlib.dir/src/expand.cpp.o
[2020-05-24T11:27:42.332Z] /usr/bin/c++  -DBINDIR=L\"/usr/bin\" -DCMAKE_BINARY_DIR=\"/build/fish/src/fish-3.1.2/build\" -DCMAKE_SOURCE_DIR=\"/build/fish/src/fish-3.1.2\" -DDATADIR=L\"/usr/share\" -DDOCDIR=L\"/usr/share/doc/fish\" -DLOCALEDIR=\"/usr/share/locale\" -DPREFIX=L\"/usr\" -DSYSCONFDIR=L\"/etc\" -D_REENTRANT -D_UNICODE=1 -I/build/fish/src/fish-3.1.2/build  -D_FORTIFY_SOURCE=2 -march=x86-64 -mtune=generic -O2 -pipe -fno-plt -D_FORTIFY_SOURCE=2 -Wall -Wextra -Wno-implicit-fallthrough -Wno-comment -Wno-address -Wno-strict-aliasing -Wno-redundant-move    -fno-exceptions -pthread -std=gnu++11 -o CMakeFiles/fishlib.dir/src/expand.cpp.o -c /build/fish/src/fish-3.1.2/src/expand.cpp
[2020-05-24T11:27:42.583Z] [ 51%] Building CXX object CMakeFiles/fishlib.dir/src/fallback.cpp.o
[2020-05-24T11:27:42.583Z] /usr/bin/c++  -DBINDIR=L\"/usr/bin\" -DCMAKE_BINARY_DIR=\"/build/fish/src/fish-3.1.2/build\" -DCMAKE_SOURCE_DIR=\"/build/fish/src/fish-3.1.2\" -DDATADIR=L\"/usr/share\" -DDOCDIR=L\"/usr/share/doc/fish\" -DLOCALEDIR=\"/usr/share/locale\" -DPREFIX=L\"/usr\" -DSYSCONFDIR=L\"/etc\" -D_REENTRANT -D_UNICODE=1 -I/build/fish/src/fish-3.1.2/build  -D_FORTIFY_SOURCE=2 -march=x86-64 -mtune=generic -O2 -pipe -fno-plt -D_FORTIFY_SOURCE=2 -Wall -Wextra -Wno-implicit-fallthrough -Wno-comment -Wno-address -Wno-strict-aliasing -Wno-redundant-move    -fno-exceptions -pthread -std=gnu++11 -o CMakeFiles/fishlib.dir/src/fallback.cpp.o -c /build/fish/src/fish-3.1.2/src/fallback.cpp
[2020-05-24T11:27:42.583Z] [ 52%] Building CXX object CMakeFiles/fishlib.dir/src/fish_version.cpp.o
[2020-05-24T11:27:42.583Z] /usr/bin/c++  -DBINDIR=L\"/usr/bin\" -DCMAKE_BINARY_DIR=\"/build/fish/src/fish-3.1.2/build\" -DCMAKE_SOURCE_DIR=\"/build/fish/src/fish-3.1.2\" -DDATADIR=L\"/usr/share\" -DDOCDIR=L\"/usr/share/doc/fish\" -DLOCALEDIR=\"/usr/share/locale\" -DPREFIX=L\"/usr\" -DSYSCONFDIR=L\"/etc\" -D_REENTRANT -D_UNICODE=1 -I/build/fish/src/fish-3.1.2/build  -D_FORTIFY_SOURCE=2 -march=x86-64 -mtune=generic -O2 -pipe -fno-plt -D_FORTIFY_SOURCE=2 -Wall -Wextra -Wno-implicit-fallthrough -Wno-comment -Wno-address -Wno-strict-aliasing -Wno-redundant-move    -fno-exceptions -pthread -std=gnu++11 -o CMakeFiles/fishlib.dir/src/fish_version.cpp.o -c /build/fish/src/fish-3.1.2/src/fish_version.cpp
[2020-05-24T11:27:42.833Z] [ 54%] Building CXX object CMakeFiles/fishlib.dir/src/highlight.cpp.o
[2020-05-24T11:27:42.833Z] [ 54%] Building CXX object CMakeFiles/fishlib.dir/src/function.cpp.o
[2020-05-24T11:27:42.833Z] /usr/bin/c++  -DBINDIR=L\"/usr/bin\" -DCMAKE_BINARY_DIR=\"/build/fish/src/fish-3.1.2/build\" -DCMAKE_SOURCE_DIR=\"/build/fish/src/fish-3.1.2\" -DDATADIR=L\"/usr/share\" -DDOCDIR=L\"/usr/share/doc/fish\" -DLOCALEDIR=\"/usr/share/locale\" -DPREFIX=L\"/usr\" -DSYSCONFDIR=L\"/etc\" -D_REENTRANT -D_UNICODE=1 -I/build/fish/src/fish-3.1.2/build  -D_FORTIFY_SOURCE=2 -march=x86-64 -mtune=generic -O2 -pipe -fno-plt -D_FORTIFY_SOURCE=2 -Wall -Wextra -Wno-implicit-fallthrough -Wno-comment -Wno-address -Wno-strict-aliasing -Wno-redundant-move    -fno-exceptions -pthread -std=gnu++11 -o CMakeFiles/fishlib.dir/src/function.cpp.o -c /build/fish/src/fish-3.1.2/src/function.cpp
[2020-05-24T11:27:42.833Z] /usr/bin/c++  -DBINDIR=L\"/usr/bin\" -DCMAKE_BINARY_DIR=\"/build/fish/src/fish-3.1.2/build\" -DCMAKE_SOURCE_DIR=\"/build/fish/src/fish-3.1.2\" -DDATADIR=L\"/usr/share\" -DDOCDIR=L\"/usr/share/doc/fish\" -DLOCALEDIR=\"/usr/share/locale\" -DPREFIX=L\"/usr\" -DSYSCONFDIR=L\"/etc\" -D_REENTRANT -D_UNICODE=1 -I/build/fish/src/fish-3.1.2/build  -D_FORTIFY_SOURCE=2 -march=x86-64 -mtune=generic -O2 -pipe -fno-plt -D_FORTIFY_SOURCE=2 -Wall -Wextra -Wno-implicit-fallthrough -Wno-comment -Wno-address -Wno-strict-aliasing -Wno-redundant-move    -fno-exceptions -pthread -std=gnu++11 -o CMakeFiles/fishlib.dir/src/highlight.cpp.o -c /build/fish/src/fish-3.1.2/src/highlight.cpp
[2020-05-24T11:27:43.083Z] [ 55%] Building CXX object CMakeFiles/fishlib.dir/src/history.cpp.o
[2020-05-24T11:27:43.084Z] /usr/bin/c++  -DBINDIR=L\"/usr/bin\" -DCMAKE_BINARY_DIR=\"/build/fish/src/fish-3.1.2/build\" -DCMAKE_SOURCE_DIR=\"/build/fish/src/fish-3.1.2\" -DDATADIR=L\"/usr/share\" -DDOCDIR=L\"/usr/share/doc/fish\" -DLOCALEDIR=\"/usr/share/locale\" -DPREFIX=L\"/usr\" -DSYSCONFDIR=L\"/etc\" -D_REENTRANT -D_UNICODE=1 -I/build/fish/src/fish-3.1.2/build  -D_FORTIFY_SOURCE=2 -march=x86-64 -mtune=generic -O2 -pipe -fno-plt -D_FORTIFY_SOURCE=2 -Wall -Wextra -Wno-implicit-fallthrough -Wno-comment -Wno-address -Wno-strict-aliasing -Wno-redundant-move    -fno-exceptions -pthread -std=gnu++11 -o CMakeFiles/fishlib.dir/src/history.cpp.o -c /build/fish/src/fish-3.1.2/src/history.cpp
[2020-05-24T11:27:43.084Z] [ 56%] Building CXX object CMakeFiles/fishlib.dir/src/history_file.cpp.o
[2020-05-24T11:27:43.084Z] /usr/bin/c++  -DBINDIR=L\"/usr/bin\" -DCMAKE_BINARY_DIR=\"/build/fish/src/fish-3.1.2/build\" -DCMAKE_SOURCE_DIR=\"/build/fish/src/fish-3.1.2\" -DDATADIR=L\"/usr/share\" -DDOCDIR=L\"/usr/share/doc/fish\" -DLOCALEDIR=\"/usr/share/locale\" -DPREFIX=L\"/usr\" -DSYSCONFDIR=L\"/etc\" -D_REENTRANT -D_UNICODE=1 -I/build/fish/src/fish-3.1.2/build  -D_FORTIFY_SOURCE=2 -march=x86-64 -mtune=generic -O2 -pipe -fno-plt -D_FORTIFY_SOURCE=2 -Wall -Wextra -Wno-implicit-fallthrough -Wno-comment -Wno-address -Wno-strict-aliasing -Wno-redundant-move    -fno-exceptions -pthread -std=gnu++11 -o CMakeFiles/fishlib.dir/src/history_file.cpp.o -c /build/fish/src/fish-3.1.2/src/history_file.cpp
[2020-05-24T11:27:43.334Z] [ 57%] Building CXX object CMakeFiles/fishlib.dir/src/input.cpp.o
[2020-05-24T11:27:43.334Z] /usr/bin/c++  -DBINDIR=L\"/usr/bin\" -DCMAKE_BINARY_DIR=\"/build/fish/src/fish-3.1.2/build\" -DCMAKE_SOURCE_DIR=\"/build/fish/src/fish-3.1.2\" -DDATADIR=L\"/usr/share\" -DDOCDIR=L\"/usr/share/doc/fish\" -DLOCALEDIR=\"/usr/share/locale\" -DPREFIX=L\"/usr\" -DSYSCONFDIR=L\"/etc\" -D_REENTRANT -D_UNICODE=1 -I/build/fish/src/fish-3.1.2/build  -D_FORTIFY_SOURCE=2 -march=x86-64 -mtune=generic -O2 -pipe -fno-plt -D_FORTIFY_SOURCE=2 -Wall -Wextra -Wno-implicit-fallthrough -Wno-comment -Wno-address -Wno-strict-aliasing -Wno-redundant-move    -fno-exceptions -pthread -std=gnu++11 -o CMakeFiles/fishlib.dir/src/input.cpp.o -c /build/fish/src/fish-3.1.2/src/input.cpp
[2020-05-24T11:27:43.584Z] [ 57%] Building CXX object CMakeFiles/fishlib.dir/src/input_common.cpp.o
[2020-05-24T11:27:43.584Z] /usr/bin/c++  -DBINDIR=L\"/usr/bin\" -DCMAKE_BINARY_DIR=\"/build/fish/src/fish-3.1.2/build\" -DCMAKE_SOURCE_DIR=\"/build/fish/src/fish-3.1.2\" -DDATADIR=L\"/usr/share\" -DDOCDIR=L\"/usr/share/doc/fish\" -DLOCALEDIR=\"/usr/share/locale\" -DPREFIX=L\"/usr\" -DSYSCONFDIR=L\"/etc\" -D_REENTRANT -D_UNICODE=1 -I/build/fish/src/fish-3.1.2/build  -D_FORTIFY_SOURCE=2 -march=x86-64 -mtune=generic -O2 -pipe -fno-plt -D_FORTIFY_SOURCE=2 -Wall -Wextra -Wno-implicit-fallthrough -Wno-comment -Wno-address -Wno-strict-aliasing -Wno-redundant-move    -fno-exceptions -pthread -std=gnu++11 -o CMakeFiles/fishlib.dir/src/input_common.cpp.o -c /build/fish/src/fish-3.1.2/src/input_common.cpp
[2020-05-24T11:27:43.584Z] [ 58%] Building CXX object CMakeFiles/fishlib.dir/src/intern.cpp.o
[2020-05-24T11:27:43.584Z] /usr/bin/c++  -DBINDIR=L\"/usr/bin\" -DCMAKE_BINARY_DIR=\"/build/fish/src/fish-3.1.2/build\" -DCMAKE_SOURCE_DIR=\"/build/fish/src/fish-3.1.2\" -DDATADIR=L\"/usr/share\" -DDOCDIR=L\"/usr/share/doc/fish\" -DLOCALEDIR=\"/usr/share/locale\" -DPREFIX=L\"/usr\" -DSYSCONFDIR=L\"/etc\" -D_REENTRANT -D_UNICODE=1 -I/build/fish/src/fish-3.1.2/build  -D_FORTIFY_SOURCE=2 -march=x86-64 -mtune=generic -O2 -pipe -fno-plt -D_FORTIFY_SOURCE=2 -Wall -Wextra -Wno-implicit-fallthrough -Wno-comment -Wno-address -Wno-strict-aliasing -Wno-redundant-move    -fno-exceptions -pthread -std=gnu++11 -o CMakeFiles/fishlib.dir/src/intern.cpp.o -c /build/fish/src/fish-3.1.2/src/intern.cpp
[2020-05-24T11:27:43.584Z] [ 59%] Building CXX object CMakeFiles/fishlib.dir/src/io.cpp.o
[2020-05-24T11:27:43.584Z] /usr/bin/c++  -DBINDIR=L\"/usr/bin\" -DCMAKE_BINARY_DIR=\"/build/fish/src/fish-3.1.2/build\" -DCMAKE_SOURCE_DIR=\"/build/fish/src/fish-3.1.2\" -DDATADIR=L\"/usr/share\" -DDOCDIR=L\"/usr/share/doc/fish\" -DLOCALEDIR=\"/usr/share/locale\" -DPREFIX=L\"/usr\" -DSYSCONFDIR=L\"/etc\" -D_REENTRANT -D_UNICODE=1 -I/build/fish/src/fish-3.1.2/build  -D_FORTIFY_SOURCE=2 -march=x86-64 -mtune=generic -O2 -pipe -fno-plt -D_FORTIFY_SOURCE=2 -Wall -Wextra -Wno-implicit-fallthrough -Wno-comment -Wno-address -Wno-strict-aliasing -Wno-redundant-move    -fno-exceptions -pthread -std=gnu++11 -o CMakeFiles/fishlib.dir/src/io.cpp.o -c /build/fish/src/fish-3.1.2/src/io.cpp
[2020-05-24T11:27:44.135Z] [ 60%] Building CXX object CMakeFiles/fishlib.dir/src/iothread.cpp.o
[2020-05-24T11:27:44.135Z] /usr/bin/c++  -DBINDIR=L\"/usr/bin\" -DCMAKE_BINARY_DIR=\"/build/fish/src/fish-3.1.2/build\" -DCMAKE_SOURCE_DIR=\"/build/fish/src/fish-3.1.2\" -DDATADIR=L\"/usr/share\" -DDOCDIR=L\"/usr/share/doc/fish\" -DLOCALEDIR=\"/usr/share/locale\" -DPREFIX=L\"/usr\" -DSYSCONFDIR=L\"/etc\" -D_REENTRANT -D_UNICODE=1 -I/build/fish/src/fish-3.1.2/build  -D_FORTIFY_SOURCE=2 -march=x86-64 -mtune=generic -O2 -pipe -fno-plt -D_FORTIFY_SOURCE=2 -Wall -Wextra -Wno-implicit-fallthrough -Wno-comment -Wno-address -Wno-strict-aliasing -Wno-redundant-move    -fno-exceptions -pthread -std=gnu++11 -o CMakeFiles/fishlib.dir/src/iothread.cpp.o -c /build/fish/src/fish-3.1.2/src/iothread.cpp
[2020-05-24T11:27:44.135Z] [ 61%] Building CXX object CMakeFiles/fishlib.dir/src/kill.cpp.o
[2020-05-24T11:27:44.135Z] /usr/bin/c++  -DBINDIR=L\"/usr/bin\" -DCMAKE_BINARY_DIR=\"/build/fish/src/fish-3.1.2/build\" -DCMAKE_SOURCE_DIR=\"/build/fish/src/fish-3.1.2\" -DDATADIR=L\"/usr/share\" -DDOCDIR=L\"/usr/share/doc/fish\" -DLOCALEDIR=\"/usr/share/locale\" -DPREFIX=L\"/usr\" -DSYSCONFDIR=L\"/etc\" -D_REENTRANT -D_UNICODE=1 -I/build/fish/src/fish-3.1.2/build  -D_FORTIFY_SOURCE=2 -march=x86-64 -mtune=generic -O2 -pipe -fno-plt -D_FORTIFY_SOURCE=2 -Wall -Wextra -Wno-implicit-fallthrough -Wno-comment -Wno-address -Wno-strict-aliasing -Wno-redundant-move    -fno-exceptions -pthread -std=gnu++11 -o CMakeFiles/fishlib.dir/src/kill.cpp.o -c /build/fish/src/fish-3.1.2/src/kill.cpp
[2020-05-24T11:27:44.385Z] [ 62%] Building CXX object CMakeFiles/fishlib.dir/src/output.cpp.o
[2020-05-24T11:27:44.385Z] /usr/bin/c++  -DBINDIR=L\"/usr/bin\" -DCMAKE_BINARY_DIR=\"/build/fish/src/fish-3.1.2/build\" -DCMAKE_SOURCE_DIR=\"/build/fish/src/fish-3.1.2\" -DDATADIR=L\"/usr/share\" -DDOCDIR=L\"/usr/share/doc/fish\" -DLOCALEDIR=\"/usr/share/locale\" -DPREFIX=L\"/usr\" -DSYSCONFDIR=L\"/etc\" -D_REENTRANT -D_UNICODE=1 -I/build/fish/src/fish-3.1.2/build  -D_FORTIFY_SOURCE=2 -march=x86-64 -mtune=generic -O2 -pipe -fno-plt -D_FORTIFY_SOURCE=2 -Wall -Wextra -Wno-implicit-fallthrough -Wno-comment -Wno-address -Wno-strict-aliasing -Wno-redundant-move    -fno-exceptions -pthread -std=gnu++11 -o CMakeFiles/fishlib.dir/src/output.cpp.o -c /build/fish/src/fish-3.1.2/src/output.cpp
[2020-05-24T11:27:44.385Z] [ 63%] Building CXX object CMakeFiles/fishlib.dir/src/pager.cpp.o
[2020-05-24T11:27:44.385Z] /usr/bin/c++  -DBINDIR=L\"/usr/bin\" -DCMAKE_BINARY_DIR=\"/build/fish/src/fish-3.1.2/build\" -DCMAKE_SOURCE_DIR=\"/build/fish/src/fish-3.1.2\" -DDATADIR=L\"/usr/share\" -DDOCDIR=L\"/usr/share/doc/fish\" -DLOCALEDIR=\"/usr/share/locale\" -DPREFIX=L\"/usr\" -DSYSCONFDIR=L\"/etc\" -D_REENTRANT -D_UNICODE=1 -I/build/fish/src/fish-3.1.2/build  -D_FORTIFY_SOURCE=2 -march=x86-64 -mtune=generic -O2 -pipe -fno-plt -D_FORTIFY_SOURCE=2 -Wall -Wextra -Wno-implicit-fallthrough -Wno-comment -Wno-address -Wno-strict-aliasing -Wno-redundant-move    -fno-exceptions -pthread -std=gnu++11 -o CMakeFiles/fishlib.dir/src/pager.cpp.o -c /build/fish/src/fish-3.1.2/src/pager.cpp
[2020-05-24T11:27:44.636Z] [ 63%] Building CXX object CMakeFiles/fishlib.dir/src/parse_execution.cpp.o
[2020-05-24T11:27:44.636Z] /usr/bin/c++  -DBINDIR=L\"/usr/bin\" -DCMAKE_BINARY_DIR=\"/build/fish/src/fish-3.1.2/build\" -DCMAKE_SOURCE_DIR=\"/build/fish/src/fish-3.1.2\" -DDATADIR=L\"/usr/share\" -DDOCDIR=L\"/usr/share/doc/fish\" -DLOCALEDIR=\"/usr/share/locale\" -DPREFIX=L\"/usr\" -DSYSCONFDIR=L\"/etc\" -D_REENTRANT -D_UNICODE=1 -I/build/fish/src/fish-3.1.2/build  -D_FORTIFY_SOURCE=2 -march=x86-64 -mtune=generic -O2 -pipe -fno-plt -D_FORTIFY_SOURCE=2 -Wall -Wextra -Wno-implicit-fallthrough -Wno-comment -Wno-address -Wno-strict-aliasing -Wno-redundant-move    -fno-exceptions -pthread -std=gnu++11 -o CMakeFiles/fishlib.dir/src/parse_execution.cpp.o -c /build/fish/src/fish-3.1.2/src/parse_execution.cpp
[2020-05-24T11:27:44.636Z] [ 64%] Building CXX object CMakeFiles/fishlib.dir/src/parse_productions.cpp.o
[2020-05-24T11:27:44.636Z] /usr/bin/c++  -DBINDIR=L\"/usr/bin\" -DCMAKE_BINARY_DIR=\"/build/fish/src/fish-3.1.2/build\" -DCMAKE_SOURCE_DIR=\"/build/fish/src/fish-3.1.2\" -DDATADIR=L\"/usr/share\" -DDOCDIR=L\"/usr/share/doc/fish\" -DLOCALEDIR=\"/usr/share/locale\" -DPREFIX=L\"/usr\" -DSYSCONFDIR=L\"/etc\" -D_REENTRANT -D_UNICODE=1 -I/build/fish/src/fish-3.1.2/build  -D_FORTIFY_SOURCE=2 -march=x86-64 -mtune=generic -O2 -pipe -fno-plt -D_FORTIFY_SOURCE=2 -Wall -Wextra -Wno-implicit-fallthrough -Wno-comment -Wno-address -Wno-strict-aliasing -Wno-redundant-move    -fno-exceptions -pthread -std=gnu++11 -o CMakeFiles/fishlib.dir/src/parse_productions.cpp.o -c /build/fish/src/fish-3.1.2/src/parse_productions.cpp
[2020-05-24T11:27:44.886Z] [ 65%] Building CXX object CMakeFiles/fishlib.dir/src/parse_tree.cpp.o
[2020-05-24T11:27:44.886Z] /usr/bin/c++  -DBINDIR=L\"/usr/bin\" -DCMAKE_BINARY_DIR=\"/build/fish/src/fish-3.1.2/build\" -DCMAKE_SOURCE_DIR=\"/build/fish/src/fish-3.1.2\" -DDATADIR=L\"/usr/share\" -DDOCDIR=L\"/usr/share/doc/fish\" -DLOCALEDIR=\"/usr/share/locale\" -DPREFIX=L\"/usr\" -DSYSCONFDIR=L\"/etc\" -D_REENTRANT -D_UNICODE=1 -I/build/fish/src/fish-3.1.2/build  -D_FORTIFY_SOURCE=2 -march=x86-64 -mtune=generic -O2 -pipe -fno-plt -D_FORTIFY_SOURCE=2 -Wall -Wextra -Wno-implicit-fallthrough -Wno-comment -Wno-address -Wno-strict-aliasing -Wno-redundant-move    -fno-exceptions -pthread -std=gnu++11 -o CMakeFiles/fishlib.dir/src/parse_tree.cpp.o -c /build/fish/src/fish-3.1.2/src/parse_tree.cpp
[2020-05-24T11:27:44.886Z] [ 66%] Building CXX object CMakeFiles/fishlib.dir/src/parse_util.cpp.o
[2020-05-24T11:27:44.886Z] [ 67%] Building CXX object CMakeFiles/fishlib.dir/src/parser.cpp.o
[2020-05-24T11:27:44.886Z] /usr/bin/c++  -DBINDIR=L\"/usr/bin\" -DCMAKE_BINARY_DIR=\"/build/fish/src/fish-3.1.2/build\" -DCMAKE_SOURCE_DIR=\"/build/fish/src/fish-3.1.2\" -DDATADIR=L\"/usr/share\" -DDOCDIR=L\"/usr/share/doc/fish\" -DLOCALEDIR=\"/usr/share/locale\" -DPREFIX=L\"/usr\" -DSYSCONFDIR=L\"/etc\" -D_REENTRANT -D_UNICODE=1 -I/build/fish/src/fish-3.1.2/build  -D_FORTIFY_SOURCE=2 -march=x86-64 -mtune=generic -O2 -pipe -fno-plt -D_FORTIFY_SOURCE=2 -Wall -Wextra -Wno-implicit-fallthrough -Wno-comment -Wno-address -Wno-strict-aliasing -Wno-redundant-move    -fno-exceptions -pthread -std=gnu++11 -o CMakeFiles/fishlib.dir/src/parse_util.cpp.o -c /build/fish/src/fish-3.1.2/src/parse_util.cpp
[2020-05-24T11:27:44.886Z] /usr/bin/c++  -DBINDIR=L\"/usr/bin\" -DCMAKE_BINARY_DIR=\"/build/fish/src/fish-3.1.2/build\" -DCMAKE_SOURCE_DIR=\"/build/fish/src/fish-3.1.2\" -DDATADIR=L\"/usr/share\" -DDOCDIR=L\"/usr/share/doc/fish\" -DLOCALEDIR=\"/usr/share/locale\" -DPREFIX=L\"/usr\" -DSYSCONFDIR=L\"/etc\" -D_REENTRANT -D_UNICODE=1 -I/build/fish/src/fish-3.1.2/build  -D_FORTIFY_SOURCE=2 -march=x86-64 -mtune=generic -O2 -pipe -fno-plt -D_FORTIFY_SOURCE=2 -Wall -Wextra -Wno-implicit-fallthrough -Wno-comment -Wno-address -Wno-strict-aliasing -Wno-redundant-move    -fno-exceptions -pthread -std=gnu++11 -o CMakeFiles/fishlib.dir/src/parser.cpp.o -c /build/fish/src/fish-3.1.2/src/parser.cpp
[2020-05-24T11:27:45.137Z] [ 68%] Building CXX object CMakeFiles/fishlib.dir/src/parser_keywords.cpp.o
[2020-05-24T11:27:45.137Z] /usr/bin/c++  -DBINDIR=L\"/usr/bin\" -DCMAKE_BINARY_DIR=\"/build/fish/src/fish-3.1.2/build\" -DCMAKE_SOURCE_DIR=\"/build/fish/src/fish-3.1.2\" -DDATADIR=L\"/usr/share\" -DDOCDIR=L\"/usr/share/doc/fish\" -DLOCALEDIR=\"/usr/share/locale\" -DPREFIX=L\"/usr\" -DSYSCONFDIR=L\"/etc\" -D_REENTRANT -D_UNICODE=1 -I/build/fish/src/fish-3.1.2/build  -D_FORTIFY_SOURCE=2 -march=x86-64 -mtune=generic -O2 -pipe -fno-plt -D_FORTIFY_SOURCE=2 -Wall -Wextra -Wno-implicit-fallthrough -Wno-comment -Wno-address -Wno-strict-aliasing -Wno-redundant-move    -fno-exceptions -pthread -std=gnu++11 -o CMakeFiles/fishlib.dir/src/parser_keywords.cpp.o -c /build/fish/src/fish-3.1.2/src/parser_keywords.cpp
[2020-05-24T11:27:45.387Z] [ 69%] Building CXX object CMakeFiles/fishlib.dir/src/path.cpp.o
[2020-05-24T11:27:45.387Z] /usr/bin/c++  -DBINDIR=L\"/usr/bin\" -DCMAKE_BINARY_DIR=\"/build/fish/src/fish-3.1.2/build\" -DCMAKE_SOURCE_DIR=\"/build/fish/src/fish-3.1.2\" -DDATADIR=L\"/usr/share\" -DDOCDIR=L\"/usr/share/doc/fish\" -DLOCALEDIR=\"/usr/share/locale\" -DPREFIX=L\"/usr\" -DSYSCONFDIR=L\"/etc\" -D_REENTRANT -D_UNICODE=1 -I/build/fish/src/fish-3.1.2/build  -D_FORTIFY_SOURCE=2 -march=x86-64 -mtune=generic -O2 -pipe -fno-plt -D_FORTIFY_SOURCE=2 -Wall -Wextra -Wno-implicit-fallthrough -Wno-comment -Wno-address -Wno-strict-aliasing -Wno-redundant-move    -fno-exceptions -pthread -std=gnu++11 -o CMakeFiles/fishlib.dir/src/path.cpp.o -c /build/fish/src/fish-3.1.2/src/path.cpp
[2020-05-24T11:27:45.387Z] [ 69%] Building CXX object CMakeFiles/fishlib.dir/src/postfork.cpp.o
[2020-05-24T11:27:45.387Z] /usr/bin/c++  -DBINDIR=L\"/usr/bin\" -DCMAKE_BINARY_DIR=\"/build/fish/src/fish-3.1.2/build\" -DCMAKE_SOURCE_DIR=\"/build/fish/src/fish-3.1.2\" -DDATADIR=L\"/usr/share\" -DDOCDIR=L\"/usr/share/doc/fish\" -DLOCALEDIR=\"/usr/share/locale\" -DPREFIX=L\"/usr\" -DSYSCONFDIR=L\"/etc\" -D_REENTRANT -D_UNICODE=1 -I/build/fish/src/fish-3.1.2/build  -D_FORTIFY_SOURCE=2 -march=x86-64 -mtune=generic -O2 -pipe -fno-plt -D_FORTIFY_SOURCE=2 -Wall -Wextra -Wno-implicit-fallthrough -Wno-comment -Wno-address -Wno-strict-aliasing -Wno-redundant-move    -fno-exceptions -pthread -std=gnu++11 -o CMakeFiles/fishlib.dir/src/postfork.cpp.o -c /build/fish/src/fish-3.1.2/src/postfork.cpp
[2020-05-24T11:27:45.637Z] [ 70%] Building CXX object CMakeFiles/fishlib.dir/src/proc.cpp.o
[2020-05-24T11:27:45.637Z] [ 71%] Building CXX object CMakeFiles/fishlib.dir/src/reader.cpp.o
[2020-05-24T11:27:45.637Z] /usr/bin/c++  -DBINDIR=L\"/usr/bin\" -DCMAKE_BINARY_DIR=\"/build/fish/src/fish-3.1.2/build\" -DCMAKE_SOURCE_DIR=\"/build/fish/src/fish-3.1.2\" -DDATADIR=L\"/usr/share\" -DDOCDIR=L\"/usr/share/doc/fish\" -DLOCALEDIR=\"/usr/share/locale\" -DPREFIX=L\"/usr\" -DSYSCONFDIR=L\"/etc\" -D_REENTRANT -D_UNICODE=1 -I/build/fish/src/fish-3.1.2/build  -D_FORTIFY_SOURCE=2 -march=x86-64 -mtune=generic -O2 -pipe -fno-plt -D_FORTIFY_SOURCE=2 -Wall -Wextra -Wno-implicit-fallthrough -Wno-comment -Wno-address -Wno-strict-aliasing -Wno-redundant-move    -fno-exceptions -pthread -std=gnu++11 -o CMakeFiles/fishlib.dir/src/proc.cpp.o -c /build/fish/src/fish-3.1.2/src/proc.cpp
[2020-05-24T11:27:45.637Z] /usr/bin/c++  -DBINDIR=L\"/usr/bin\" -DCMAKE_BINARY_DIR=\"/build/fish/src/fish-3.1.2/build\" -DCMAKE_SOURCE_DIR=\"/build/fish/src/fish-3.1.2\" -DDATADIR=L\"/usr/share\" -DDOCDIR=L\"/usr/share/doc/fish\" -DLOCALEDIR=\"/usr/share/locale\" -DPREFIX=L\"/usr\" -DSYSCONFDIR=L\"/etc\" -D_REENTRANT -D_UNICODE=1 -I/build/fish/src/fish-3.1.2/build  -D_FORTIFY_SOURCE=2 -march=x86-64 -mtune=generic -O2 -pipe -fno-plt -D_FORTIFY_SOURCE=2 -Wall -Wextra -Wno-implicit-fallthrough -Wno-comment -Wno-address -Wno-strict-aliasing -Wno-redundant-move    -fno-exceptions -pthread -std=gnu++11 -o CMakeFiles/fishlib.dir/src/reader.cpp.o -c /build/fish/src/fish-3.1.2/src/reader.cpp
[2020-05-24T11:27:45.637Z] [ 72%] Building CXX object CMakeFiles/fishlib.dir/src/sanity.cpp.o
[2020-05-24T11:27:45.638Z] /usr/bin/c++  -DBINDIR=L\"/usr/bin\" -DCMAKE_BINARY_DIR=\"/build/fish/src/fish-3.1.2/build\" -DCMAKE_SOURCE_DIR=\"/build/fish/src/fish-3.1.2\" -DDATADIR=L\"/usr/share\" -DDOCDIR=L\"/usr/share/doc/fish\" -DLOCALEDIR=\"/usr/share/locale\" -DPREFIX=L\"/usr\" -DSYSCONFDIR=L\"/etc\" -D_REENTRANT -D_UNICODE=1 -I/build/fish/src/fish-3.1.2/build  -D_FORTIFY_SOURCE=2 -march=x86-64 -mtune=generic -O2 -pipe -fno-plt -D_FORTIFY_SOURCE=2 -Wall -Wextra -Wno-implicit-fallthrough -Wno-comment -Wno-address -Wno-strict-aliasing -Wno-redundant-move    -fno-exceptions -pthread -std=gnu++11 -o CMakeFiles/fishlib.dir/src/sanity.cpp.o -c /build/fish/src/fish-3.1.2/src/sanity.cpp
[2020-05-24T11:27:45.888Z] [ 73%] Building CXX object CMakeFiles/fishlib.dir/src/screen.cpp.o
[2020-05-24T11:27:45.888Z] /usr/bin/c++  -DBINDIR=L\"/usr/bin\" -DCMAKE_BINARY_DIR=\"/build/fish/src/fish-3.1.2/build\" -DCMAKE_SOURCE_DIR=\"/build/fish/src/fish-3.1.2\" -DDATADIR=L\"/usr/share\" -DDOCDIR=L\"/usr/share/doc/fish\" -DLOCALEDIR=\"/usr/share/locale\" -DPREFIX=L\"/usr\" -DSYSCONFDIR=L\"/etc\" -D_REENTRANT -D_UNICODE=1 -I/build/fish/src/fish-3.1.2/build  -D_FORTIFY_SOURCE=2 -march=x86-64 -mtune=generic -O2 -pipe -fno-plt -D_FORTIFY_SOURCE=2 -Wall -Wextra -Wno-implicit-fallthrough -Wno-comment -Wno-address -Wno-strict-aliasing -Wno-redundant-move    -fno-exceptions -pthread -std=gnu++11 -o CMakeFiles/fishlib.dir/src/screen.cpp.o -c /build/fish/src/fish-3.1.2/src/screen.cpp
[2020-05-24T11:27:45.888Z] [ 74%] Building CXX object CMakeFiles/fishlib.dir/src/signal.cpp.o
[2020-05-24T11:27:45.888Z] /usr/bin/c++  -DBINDIR=L\"/usr/bin\" -DCMAKE_BINARY_DIR=\"/build/fish/src/fish-3.1.2/build\" -DCMAKE_SOURCE_DIR=\"/build/fish/src/fish-3.1.2\" -DDATADIR=L\"/usr/share\" -DDOCDIR=L\"/usr/share/doc/fish\" -DLOCALEDIR=\"/usr/share/locale\" -DPREFIX=L\"/usr\" -DSYSCONFDIR=L\"/etc\" -D_REENTRANT -D_UNICODE=1 -I/build/fish/src/fish-3.1.2/build  -D_FORTIFY_SOURCE=2 -march=x86-64 -mtune=generic -O2 -pipe -fno-plt -D_FORTIFY_SOURCE=2 -Wall -Wextra -Wno-implicit-fallthrough -Wno-comment -Wno-address -Wno-strict-aliasing -Wno-redundant-move    -fno-exceptions -pthread -std=gnu++11 -o CMakeFiles/fishlib.dir/src/signal.cpp.o -c /build/fish/src/fish-3.1.2/src/signal.cpp
[2020-05-24T11:27:46.138Z] [ 75%] Building CXX object CMakeFiles/fishlib.dir/src/tinyexpr.cpp.o
[2020-05-24T11:27:46.138Z] /usr/bin/c++  -DBINDIR=L\"/usr/bin\" -DCMAKE_BINARY_DIR=\"/build/fish/src/fish-3.1.2/build\" -DCMAKE_SOURCE_DIR=\"/build/fish/src/fish-3.1.2\" -DDATADIR=L\"/usr/share\" -DDOCDIR=L\"/usr/share/doc/fish\" -DLOCALEDIR=\"/usr/share/locale\" -DPREFIX=L\"/usr\" -DSYSCONFDIR=L\"/etc\" -D_REENTRANT -D_UNICODE=1 -I/build/fish/src/fish-3.1.2/build  -D_FORTIFY_SOURCE=2 -march=x86-64 -mtune=generic -O2 -pipe -fno-plt -D_FORTIFY_SOURCE=2 -Wall -Wextra -Wno-implicit-fallthrough -Wno-comment -Wno-address -Wno-strict-aliasing -Wno-redundant-move    -fno-exceptions -pthread -std=gnu++11 -o CMakeFiles/fishlib.dir/src/tinyexpr.cpp.o -c /build/fish/src/fish-3.1.2/src/tinyexpr.cpp
[2020-05-24T11:27:46.389Z] [ 75%] Building CXX object CMakeFiles/fishlib.dir/src/tnode.cpp.o
[2020-05-24T11:27:46.389Z] /usr/bin/c++  -DBINDIR=L\"/usr/bin\" -DCMAKE_BINARY_DIR=\"/build/fish/src/fish-3.1.2/build\" -DCMAKE_SOURCE_DIR=\"/build/fish/src/fish-3.1.2\" -DDATADIR=L\"/usr/share\" -DDOCDIR=L\"/usr/share/doc/fish\" -DLOCALEDIR=\"/usr/share/locale\" -DPREFIX=L\"/usr\" -DSYSCONFDIR=L\"/etc\" -D_REENTRANT -D_UNICODE=1 -I/build/fish/src/fish-3.1.2/build  -D_FORTIFY_SOURCE=2 -march=x86-64 -mtune=generic -O2 -pipe -fno-plt -D_FORTIFY_SOURCE=2 -Wall -Wextra -Wno-implicit-fallthrough -Wno-comment -Wno-address -Wno-strict-aliasing -Wno-redundant-move    -fno-exceptions -pthread -std=gnu++11 -o CMakeFiles/fishlib.dir/src/tnode.cpp.o -c /build/fish/src/fish-3.1.2/src/tnode.cpp
[2020-05-24T11:27:46.639Z] [ 76%] Building CXX object CMakeFiles/fishlib.dir/src/tokenizer.cpp.o
[2020-05-24T11:27:46.639Z] /usr/bin/c++  -DBINDIR=L\"/usr/bin\" -DCMAKE_BINARY_DIR=\"/build/fish/src/fish-3.1.2/build\" -DCMAKE_SOURCE_DIR=\"/build/fish/src/fish-3.1.2\" -DDATADIR=L\"/usr/share\" -DDOCDIR=L\"/usr/share/doc/fish\" -DLOCALEDIR=\"/usr/share/locale\" -DPREFIX=L\"/usr\" -DSYSCONFDIR=L\"/etc\" -D_REENTRANT -D_UNICODE=1 -I/build/fish/src/fish-3.1.2/build  -D_FORTIFY_SOURCE=2 -march=x86-64 -mtune=generic -O2 -pipe -fno-plt -D_FORTIFY_SOURCE=2 -Wall -Wextra -Wno-implicit-fallthrough -Wno-comment -Wno-address -Wno-strict-aliasing -Wno-redundant-move    -fno-exceptions -pthread -std=gnu++11 -o CMakeFiles/fishlib.dir/src/tokenizer.cpp.o -c /build/fish/src/fish-3.1.2/src/tokenizer.cpp
[2020-05-24T11:27:46.639Z] [ 77%] Building CXX object CMakeFiles/fishlib.dir/src/utf8.cpp.o
[2020-05-24T11:27:46.639Z] /usr/bin/c++  -DBINDIR=L\"/usr/bin\" -DCMAKE_BINARY_DIR=\"/build/fish/src/fish-3.1.2/build\" -DCMAKE_SOURCE_DIR=\"/build/fish/src/fish-3.1.2\" -DDATADIR=L\"/usr/share\" -DDOCDIR=L\"/usr/share/doc/fish\" -DLOCALEDIR=\"/usr/share/locale\" -DPREFIX=L\"/usr\" -DSYSCONFDIR=L\"/etc\" -D_REENTRANT -D_UNICODE=1 -I/build/fish/src/fish-3.1.2/build  -D_FORTIFY_SOURCE=2 -march=x86-64 -mtune=generic -O2 -pipe -fno-plt -D_FORTIFY_SOURCE=2 -Wall -Wextra -Wno-implicit-fallthrough -Wno-comment -Wno-address -Wno-strict-aliasing -Wno-redundant-move    -fno-exceptions -pthread -std=gnu++11 -o CMakeFiles/fishlib.dir/src/utf8.cpp.o -c /build/fish/src/fish-3.1.2/src/utf8.cpp
[2020-05-24T11:27:47.190Z] [ 78%] Building CXX object CMakeFiles/fishlib.dir/src/util.cpp.o
[2020-05-24T11:27:47.190Z] /usr/bin/c++  -DBINDIR=L\"/usr/bin\" -DCMAKE_BINARY_DIR=\"/build/fish/src/fish-3.1.2/build\" -DCMAKE_SOURCE_DIR=\"/build/fish/src/fish-3.1.2\" -DDATADIR=L\"/usr/share\" -DDOCDIR=L\"/usr/share/doc/fish\" -DLOCALEDIR=\"/usr/share/locale\" -DPREFIX=L\"/usr\" -DSYSCONFDIR=L\"/etc\" -D_REENTRANT -D_UNICODE=1 -I/build/fish/src/fish-3.1.2/build  -D_FORTIFY_SOURCE=2 -march=x86-64 -mtune=generic -O2 -pipe -fno-plt -D_FORTIFY_SOURCE=2 -Wall -Wextra -Wno-implicit-fallthrough -Wno-comment -Wno-address -Wno-strict-aliasing -Wno-redundant-move    -fno-exceptions -pthread -std=gnu++11 -o CMakeFiles/fishlib.dir/src/util.cpp.o -c /build/fish/src/fish-3.1.2/src/util.cpp
[2020-05-24T11:27:47.190Z] [ 79%] Building CXX object CMakeFiles/fishlib.dir/src/wcstringutil.cpp.o
[2020-05-24T11:27:47.190Z] /usr/bin/c++  -DBINDIR=L\"/usr/bin\" -DCMAKE_BINARY_DIR=\"/build/fish/src/fish-3.1.2/build\" -DCMAKE_SOURCE_DIR=\"/build/fish/src/fish-3.1.2\" -DDATADIR=L\"/usr/share\" -DDOCDIR=L\"/usr/share/doc/fish\" -DLOCALEDIR=\"/usr/share/locale\" -DPREFIX=L\"/usr\" -DSYSCONFDIR=L\"/etc\" -D_REENTRANT -D_UNICODE=1 -I/build/fish/src/fish-3.1.2/build  -D_FORTIFY_SOURCE=2 -march=x86-64 -mtune=generic -O2 -pipe -fno-plt -D_FORTIFY_SOURCE=2 -Wall -Wextra -Wno-implicit-fallthrough -Wno-comment -Wno-address -Wno-strict-aliasing -Wno-redundant-move    -fno-exceptions -pthread -std=gnu++11 -o CMakeFiles/fishlib.dir/src/wcstringutil.cpp.o -c /build/fish/src/fish-3.1.2/src/wcstringutil.cpp
[2020-05-24T11:27:47.440Z] [ 80%] Building CXX object CMakeFiles/fishlib.dir/src/wgetopt.cpp.o
[2020-05-24T11:27:47.440Z] /usr/bin/c++  -DBINDIR=L\"/usr/bin\" -DCMAKE_BINARY_DIR=\"/build/fish/src/fish-3.1.2/build\" -DCMAKE_SOURCE_DIR=\"/build/fish/src/fish-3.1.2\" -DDATADIR=L\"/usr/share\" -DDOCDIR=L\"/usr/share/doc/fish\" -DLOCALEDIR=\"/usr/share/locale\" -DPREFIX=L\"/usr\" -DSYSCONFDIR=L\"/etc\" -D_REENTRANT -D_UNICODE=1 -I/build/fish/src/fish-3.1.2/build  -D_FORTIFY_SOURCE=2 -march=x86-64 -mtune=generic -O2 -pipe -fno-plt -D_FORTIFY_SOURCE=2 -Wall -Wextra -Wno-implicit-fallthrough -Wno-comment -Wno-address -Wno-strict-aliasing -Wno-redundant-move    -fno-exceptions -pthread -std=gnu++11 -o CMakeFiles/fishlib.dir/src/wgetopt.cpp.o -c /build/fish/src/fish-3.1.2/src/wgetopt.cpp
[2020-05-24T11:27:47.690Z] [ 80%] Building CXX object CMakeFiles/fishlib.dir/src/wutil.cpp.o
[2020-05-24T11:27:47.690Z] /usr/bin/c++  -DBINDIR=L\"/usr/bin\" -DCMAKE_BINARY_DIR=\"/build/fish/src/fish-3.1.2/build\" -DCMAKE_SOURCE_DIR=\"/build/fish/src/fish-3.1.2\" -DDATADIR=L\"/usr/share\" -DDOCDIR=L\"/usr/share/doc/fish\" -DLOCALEDIR=\"/usr/share/locale\" -DPREFIX=L\"/usr\" -DSYSCONFDIR=L\"/etc\" -D_REENTRANT -D_UNICODE=1 -I/build/fish/src/fish-3.1.2/build  -D_FORTIFY_SOURCE=2 -march=x86-64 -mtune=generic -O2 -pipe -fno-plt -D_FORTIFY_SOURCE=2 -Wall -Wextra -Wno-implicit-fallthrough -Wno-comment -Wno-address -Wno-strict-aliasing -Wno-redundant-move    -fno-exceptions -pthread -std=gnu++11 -o CMakeFiles/fishlib.dir/src/wutil.cpp.o -c /build/fish/src/fish-3.1.2/src/wutil.cpp
[2020-05-24T11:27:47.690Z] [ 81%] Building CXX object CMakeFiles/fishlib.dir/src/wildcard.cpp.o
[2020-05-24T11:27:47.690Z] /usr/bin/c++  -DBINDIR=L\"/usr/bin\" -DCMAKE_BINARY_DIR=\"/build/fish/src/fish-3.1.2/build\" -DCMAKE_SOURCE_DIR=\"/build/fish/src/fish-3.1.2\" -DDATADIR=L\"/usr/share\" -DDOCDIR=L\"/usr/share/doc/fish\" -DLOCALEDIR=\"/usr/share/locale\" -DPREFIX=L\"/usr\" -DSYSCONFDIR=L\"/etc\" -D_REENTRANT -D_UNICODE=1 -I/build/fish/src/fish-3.1.2/build  -D_FORTIFY_SOURCE=2 -march=x86-64 -mtune=generic -O2 -pipe -fno-plt -D_FORTIFY_SOURCE=2 -Wall -Wextra -Wno-implicit-fallthrough -Wno-comment -Wno-address -Wno-strict-aliasing -Wno-redundant-move    -fno-exceptions -pthread -std=gnu++11 -o CMakeFiles/fishlib.dir/src/wildcard.cpp.o -c /build/fish/src/fish-3.1.2/src/wildcard.cpp
[2020-05-24T11:27:47.690Z] [ 82%] Building CXX object CMakeFiles/fishlib.dir/src/future_feature_flags.cpp.o
[2020-05-24T11:27:47.691Z] /usr/bin/c++  -DBINDIR=L\"/usr/bin\" -DCMAKE_BINARY_DIR=\"/build/fish/src/fish-3.1.2/build\" -DCMAKE_SOURCE_DIR=\"/build/fish/src/fish-3.1.2\" -DDATADIR=L\"/usr/share\" -DDOCDIR=L\"/usr/share/doc/fish\" -DLOCALEDIR=\"/usr/share/locale\" -DPREFIX=L\"/usr\" -DSYSCONFDIR=L\"/etc\" -D_REENTRANT -D_UNICODE=1 -I/build/fish/src/fish-3.1.2/build  -D_FORTIFY_SOURCE=2 -march=x86-64 -mtune=generic -O2 -pipe -fno-plt -D_FORTIFY_SOURCE=2 -Wall -Wextra -Wno-implicit-fallthrough -Wno-comment -Wno-address -Wno-strict-aliasing -Wno-redundant-move    -fno-exceptions -pthread -std=gnu++11 -o CMakeFiles/fishlib.dir/src/future_feature_flags.cpp.o -c /build/fish/src/fish-3.1.2/src/future_feature_flags.cpp
[2020-05-24T11:27:47.691Z] [ 83%] Building CXX object CMakeFiles/fishlib.dir/src/redirection.cpp.o
[2020-05-24T11:27:47.691Z] /usr/bin/c++  -DBINDIR=L\"/usr/bin\" -DCMAKE_BINARY_DIR=\"/build/fish/src/fish-3.1.2/build\" -DCMAKE_SOURCE_DIR=\"/build/fish/src/fish-3.1.2\" -DDATADIR=L\"/usr/share\" -DDOCDIR=L\"/usr/share/doc/fish\" -DLOCALEDIR=\"/usr/share/locale\" -DPREFIX=L\"/usr\" -DSYSCONFDIR=L\"/etc\" -D_REENTRANT -D_UNICODE=1 -I/build/fish/src/fish-3.1.2/build  -D_FORTIFY_SOURCE=2 -march=x86-64 -mtune=generic -O2 -pipe -fno-plt -D_FORTIFY_SOURCE=2 -Wall -Wextra -Wno-implicit-fallthrough -Wno-comment -Wno-address -Wno-strict-aliasing -Wno-redundant-move    -fno-exceptions -pthread -std=gnu++11 -o CMakeFiles/fishlib.dir/src/redirection.cpp.o -c /build/fish/src/fish-3.1.2/src/redirection.cpp
[2020-05-24T11:27:47.691Z] [ 84%] Building CXX object CMakeFiles/fishlib.dir/src/topic_monitor.cpp.o
[2020-05-24T11:27:47.691Z] /usr/bin/c++  -DBINDIR=L\"/usr/bin\" -DCMAKE_BINARY_DIR=\"/build/fish/src/fish-3.1.2/build\" -DCMAKE_SOURCE_DIR=\"/build/fish/src/fish-3.1.2\" -DDATADIR=L\"/usr/share\" -DDOCDIR=L\"/usr/share/doc/fish\" -DLOCALEDIR=\"/usr/share/locale\" -DPREFIX=L\"/usr\" -DSYSCONFDIR=L\"/etc\" -D_REENTRANT -D_UNICODE=1 -I/build/fish/src/fish-3.1.2/build  -D_FORTIFY_SOURCE=2 -march=x86-64 -mtune=generic -O2 -pipe -fno-plt -D_FORTIFY_SOURCE=2 -Wall -Wextra -Wno-implicit-fallthrough -Wno-comment -Wno-address -Wno-strict-aliasing -Wno-redundant-move    -fno-exceptions -pthread -std=gnu++11 -o CMakeFiles/fishlib.dir/src/topic_monitor.cpp.o -c /build/fish/src/fish-3.1.2/src/topic_monitor.cpp
[2020-05-24T11:27:47.691Z] [ 85%] Building CXX object CMakeFiles/fishlib.dir/src/flog.cpp.o
[2020-05-24T11:27:47.691Z] /usr/bin/c++  -DBINDIR=L\"/usr/bin\" -DCMAKE_BINARY_DIR=\"/build/fish/src/fish-3.1.2/build\" -DCMAKE_SOURCE_DIR=\"/build/fish/src/fish-3.1.2\" -DDATADIR=L\"/usr/share\" -DDOCDIR=L\"/usr/share/doc/fish\" -DLOCALEDIR=\"/usr/share/locale\" -DPREFIX=L\"/usr\" -DSYSCONFDIR=L\"/etc\" -D_REENTRANT -D_UNICODE=1 -I/build/fish/src/fish-3.1.2/build  -D_FORTIFY_SOURCE=2 -march=x86-64 -mtune=generic -O2 -pipe -fno-plt -D_FORTIFY_SOURCE=2 -Wall -Wextra -Wno-implicit-fallthrough -Wno-comment -Wno-address -Wno-strict-aliasing -Wno-redundant-move    -fno-exceptions -pthread -std=gnu++11 -o CMakeFiles/fishlib.dir/src/flog.cpp.o -c /build/fish/src/fish-3.1.2/src/flog.cpp
[2020-05-24T11:27:47.941Z] [ 86%] Building CXX object CMakeFiles/fishlib.dir/src/trace.cpp.o
[2020-05-24T11:27:47.941Z] /usr/bin/c++  -DBINDIR=L\"/usr/bin\" -DCMAKE_BINARY_DIR=\"/build/fish/src/fish-3.1.2/build\" -DCMAKE_SOURCE_DIR=\"/build/fish/src/fish-3.1.2\" -DDATADIR=L\"/usr/share\" -DDOCDIR=L\"/usr/share/doc/fish\" -DLOCALEDIR=\"/usr/share/locale\" -DPREFIX=L\"/usr\" -DSYSCONFDIR=L\"/etc\" -D_REENTRANT -D_UNICODE=1 -I/build/fish/src/fish-3.1.2/build  -D_FORTIFY_SOURCE=2 -march=x86-64 -mtune=generic -O2 -pipe -fno-plt -D_FORTIFY_SOURCE=2 -Wall -Wextra -Wno-implicit-fallthrough -Wno-comment -Wno-address -Wno-strict-aliasing -Wno-redundant-move    -fno-exceptions -pthread -std=gnu++11 -o CMakeFiles/fishlib.dir/src/trace.cpp.o -c /build/fish/src/fish-3.1.2/src/trace.cpp
[2020-05-24T11:27:47.941Z] [ 87%] Building CXX object CMakeFiles/fishlib.dir/src/timer.cpp.o
[2020-05-24T11:27:47.941Z] /usr/bin/c++  -DBINDIR=L\"/usr/bin\" -DCMAKE_BINARY_DIR=\"/build/fish/src/fish-3.1.2/build\" -DCMAKE_SOURCE_DIR=\"/build/fish/src/fish-3.1.2\" -DDATADIR=L\"/usr/share\" -DDOCDIR=L\"/usr/share/doc/fish\" -DLOCALEDIR=\"/usr/share/locale\" -DPREFIX=L\"/usr\" -DSYSCONFDIR=L\"/etc\" -D_REENTRANT -D_UNICODE=1 -I/build/fish/src/fish-3.1.2/build  -D_FORTIFY_SOURCE=2 -march=x86-64 -mtune=generic -O2 -pipe -fno-plt -D_FORTIFY_SOURCE=2 -Wall -Wextra -Wno-implicit-fallthrough -Wno-comment -Wno-address -Wno-strict-aliasing -Wno-redundant-move    -fno-exceptions -pthread -std=gnu++11 -o CMakeFiles/fishlib.dir/src/timer.cpp.o -c /build/fish/src/fish-3.1.2/src/timer.cpp
[2020-05-24T11:27:47.941Z] [ 87%] Building CXX object CMakeFiles/fishlib.dir/src/null_terminated_array.cpp.o
[2020-05-24T11:27:47.941Z] /usr/bin/c++  -DBINDIR=L\"/usr/bin\" -DCMAKE_BINARY_DIR=\"/build/fish/src/fish-3.1.2/build\" -DCMAKE_SOURCE_DIR=\"/build/fish/src/fish-3.1.2\" -DDATADIR=L\"/usr/share\" -DDOCDIR=L\"/usr/share/doc/fish\" -DLOCALEDIR=\"/usr/share/locale\" -DPREFIX=L\"/usr\" -DSYSCONFDIR=L\"/etc\" -D_REENTRANT -D_UNICODE=1 -I/build/fish/src/fish-3.1.2/build  -D_FORTIFY_SOURCE=2 -march=x86-64 -mtune=generic -O2 -pipe -fno-plt -D_FORTIFY_SOURCE=2 -Wall -Wextra -Wno-implicit-fallthrough -Wno-comment -Wno-address -Wno-strict-aliasing -Wno-redundant-move    -fno-exceptions -pthread -std=gnu++11 -o CMakeFiles/fishlib.dir/src/null_terminated_array.cpp.o -c /build/fish/src/fish-3.1.2/src/null_terminated_array.cpp
[2020-05-24T11:27:47.941Z] [ 88%] Building CXX object CMakeFiles/fishlib.dir/src/operation_context.cpp.o
[2020-05-24T11:27:47.941Z] /usr/bin/c++  -DBINDIR=L\"/usr/bin\" -DCMAKE_BINARY_DIR=\"/build/fish/src/fish-3.1.2/build\" -DCMAKE_SOURCE_DIR=\"/build/fish/src/fish-3.1.2\" -DDATADIR=L\"/usr/share\" -DDOCDIR=L\"/usr/share/doc/fish\" -DLOCALEDIR=\"/usr/share/locale\" -DPREFIX=L\"/usr\" -DSYSCONFDIR=L\"/etc\" -D_REENTRANT -D_UNICODE=1 -I/build/fish/src/fish-3.1.2/build  -D_FORTIFY_SOURCE=2 -march=x86-64 -mtune=generic -O2 -pipe -fno-plt -D_FORTIFY_SOURCE=2 -Wall -Wextra -Wno-implicit-fallthrough -Wno-comment -Wno-address -Wno-strict-aliasing -Wno-redundant-move    -fno-exceptions -pthread -std=gnu++11 -o CMakeFiles/fishlib.dir/src/operation_context.cpp.o -c /build/fish/src/fish-3.1.2/src/operation_context.cpp
[2020-05-24T11:27:52.063Z] [ 89%] Linking CXX static library libfishlib.a
[2020-05-24T11:27:52.063Z] /usr/bin/cmake -P CMakeFiles/fishlib.dir/cmake_clean_target.cmake
[2020-05-24T11:27:52.063Z] /usr/bin/cmake -E cmake_link_script CMakeFiles/fishlib.dir/link.txt --verbose=1
[2020-05-24T11:27:52.064Z] /usr/bin/ar qc libfishlib.a  CMakeFiles/fishlib.dir/src/autoload.cpp.o CMakeFiles/fishlib.dir/src/builtin.cpp.o CMakeFiles/fishlib.dir/src/builtin_bg.cpp.o CMakeFiles/fishlib.dir/src/builtin_bind.cpp.o CMakeFiles/fishlib.dir/src/builtin_block.cpp.o CMakeFiles/fishlib.dir/src/builtin_builtin.cpp.o CMakeFiles/fishlib.dir/src/builtin_cd.cpp.o CMakeFiles/fishlib.dir/src/builtin_command.cpp.o CMakeFiles/fishlib.dir/src/builtin_commandline.cpp.o CMakeFiles/fishlib.dir/src/builtin_complete.cpp.o CMakeFiles/fishlib.dir/src/builtin_contains.cpp.o CMakeFiles/fishlib.dir/src/builtin_disown.cpp.o CMakeFiles/fishlib.dir/src/builtin_echo.cpp.o CMakeFiles/fishlib.dir/src/builtin_emit.cpp.o CMakeFiles/fishlib.dir/src/builtin_exit.cpp.o CMakeFiles/fishlib.dir/src/builtin_fg.cpp.o CMakeFiles/fishlib.dir/src/builtin_function.cpp.o CMakeFiles/fishlib.dir/src/builtin_functions.cpp.o CMakeFiles/fishlib.dir/src/builtin_argparse.cpp.o CMakeFiles/fishlib.dir/src/builtin_history.cpp.o CMakeFiles/fishlib.dir/src/builtin_jobs.cpp.o CMakeFiles/fishlib.dir/src/builtin_math.cpp.o CMakeFiles/fishlib.dir/src/builtin_printf.cpp.o CMakeFiles/fishlib.dir/src/builtin_pwd.cpp.o CMakeFiles/fishlib.dir/src/builtin_random.cpp.o CMakeFiles/fishlib.dir/src/builtin_read.cpp.o CMakeFiles/fishlib.dir/src/builtin_realpath.cpp.o CMakeFiles/fishlib.dir/src/builtin_return.cpp.o CMakeFiles/fishlib.dir/src/builtin_set.cpp.o CMakeFiles/fishlib.dir/src/builtin_set_color.cpp.o CMakeFiles/fishlib.dir/src/builtin_source.cpp.o CMakeFiles/fishlib.dir/src/builtin_status.cpp.o CMakeFiles/fishlib.dir/src/builtin_string.cpp.o CMakeFiles/fishlib.dir/src/builtin_test.cpp.o CMakeFiles/fishlib.dir/src/builtin_ulimit.cpp.o CMakeFiles/fishlib.dir/src/builtin_wait.cpp.o CMakeFiles/fishlib.dir/src/builtin_eval.cpp.o CMakeFiles/fishlib.dir/src/color.cpp.o CMakeFiles/fishlib.dir/src/common.cpp.o CMakeFiles/fishlib.dir/src/complete.cpp.o CMakeFiles/fishlib.dir/src/env.cpp.o CMakeFiles/fishlib.dir/src/env_dispatch.cpp.o CMakeFiles/fishlib.dir/src/env_universal_common.cpp.o CMakeFiles/fishlib.dir/src/event.cpp.o CMakeFiles/fishlib.dir/src/exec.cpp.o CMakeFiles/fishlib.dir/src/expand.cpp.o CMakeFiles/fishlib.dir/src/fallback.cpp.o CMakeFiles/fishlib.dir/src/fish_version.cpp.o CMakeFiles/fishlib.dir/src/function.cpp.o CMakeFiles/fishlib.dir/src/highlight.cpp.o CMakeFiles/fishlib.dir/src/history.cpp.o CMakeFiles/fishlib.dir/src/history_file.cpp.o CMakeFiles/fishlib.dir/src/input.cpp.o CMakeFiles/fishlib.dir/src/input_common.cpp.o CMakeFiles/fishlib.dir/src/intern.cpp.o CMakeFiles/fishlib.dir/src/io.cpp.o CMakeFiles/fishlib.dir/src/iothread.cpp.o CMakeFiles/fishlib.dir/src/kill.cpp.o CMakeFiles/fishlib.dir/src/output.cpp.o CMakeFiles/fishlib.dir/src/pager.cpp.o CMakeFiles/fishlib.dir/src/parse_execution.cpp.o CMakeFiles/fishlib.dir/src/parse_productions.cpp.o CMakeFiles/fishlib.dir/src/parse_tree.cpp.o CMakeFiles/fishlib.dir/src/parse_util.cpp.o CMakeFiles/fishlib.dir/src/parser.cpp.o CMakeFiles/fishlib.dir/src/parser_keywords.cpp.o CMakeFiles/fishlib.dir/src/path.cpp.o CMakeFiles/fishlib.dir/src/postfork.cpp.o CMakeFiles/fishlib.dir/src/proc.cpp.o CMakeFiles/fishlib.dir/src/reader.cpp.o CMakeFiles/fishlib.dir/src/sanity.cpp.o CMakeFiles/fishlib.dir/src/screen.cpp.o CMakeFiles/fishlib.dir/src/signal.cpp.o CMakeFiles/fishlib.dir/src/tinyexpr.cpp.o CMakeFiles/fishlib.dir/src/tnode.cpp.o CMakeFiles/fishlib.dir/src/tokenizer.cpp.o CMakeFiles/fishlib.dir/src/utf8.cpp.o CMakeFiles/fishlib.dir/src/util.cpp.o CMakeFiles/fishlib.dir/src/wcstringutil.cpp.o CMakeFiles/fishlib.dir/src/wgetopt.cpp.o CMakeFiles/fishlib.dir/src/wildcard.cpp.o CMakeFiles/fishlib.dir/src/wutil.cpp.o CMakeFiles/fishlib.dir/src/future_feature_flags.cpp.o CMakeFiles/fishlib.dir/src/redirection.cpp.o CMakeFiles/fishlib.dir/src/topic_monitor.cpp.o CMakeFiles/fishlib.dir/src/flog.cpp.o CMakeFiles/fishlib.dir/src/trace.cpp.o CMakeFiles/fishlib.dir/src/timer.cpp.o CMakeFiles/fishlib.dir/src/null_terminated_array.cpp.o CMakeFiles/fishlib.dir/src/operation_context.cpp.o
[2020-05-24T11:27:52.064Z] /usr/bin/ranlib libfishlib.a
[2020-05-24T11:27:52.064Z] make[2]: Leaving directory '/build/fish/src/fish-3.1.2/build'
[2020-05-24T11:27:52.064Z] [ 90%] Built target fishlib
[2020-05-24T11:27:52.064Z] make  -f CMakeFiles/fish.dir/build.make CMakeFiles/fish.dir/depend
[2020-05-24T11:27:52.064Z] make  -f CMakeFiles/fish_key_reader.dir/build.make CMakeFiles/fish_key_reader.dir/depend
[2020-05-24T11:27:52.064Z] make  -f CMakeFiles/fish_indent.dir/build.make CMakeFiles/fish_indent.dir/depend
[2020-05-24T11:27:52.064Z] make[2]: Entering directory '/build/fish/src/fish-3.1.2/build'
[2020-05-24T11:27:52.064Z] cd /build/fish/src/fish-3.1.2/build && /usr/bin/cmake -E cmake_depends "Unix Makefiles" /build/fish/src/fish-3.1.2 /build/fish/src/fish-3.1.2 /build/fish/src/fish-3.1.2/build /build/fish/src/fish-3.1.2/build /build/fish/src/fish-3.1.2/build/CMakeFiles/fish.dir/DependInfo.cmake --color=
[2020-05-24T11:27:52.064Z] make[2]: Entering directory '/build/fish/src/fish-3.1.2/build'
[2020-05-24T11:27:52.064Z] cd /build/fish/src/fish-3.1.2/build && /usr/bin/cmake -E cmake_depends "Unix Makefiles" /build/fish/src/fish-3.1.2 /build/fish/src/fish-3.1.2 /build/fish/src/fish-3.1.2/build /build/fish/src/fish-3.1.2/build /build/fish/src/fish-3.1.2/build/CMakeFiles/fish_key_reader.dir/DependInfo.cmake --color=
[2020-05-24T11:27:52.064Z] make[2]: Entering directory '/build/fish/src/fish-3.1.2/build'
[2020-05-24T11:27:52.064Z] cd /build/fish/src/fish-3.1.2/build && /usr/bin/cmake -E cmake_depends "Unix Makefiles" /build/fish/src/fish-3.1.2 /build/fish/src/fish-3.1.2 /build/fish/src/fish-3.1.2/build /build/fish/src/fish-3.1.2/build /build/fish/src/fish-3.1.2/build/CMakeFiles/fish_indent.dir/DependInfo.cmake --color=
[2020-05-24T11:27:52.064Z] Dependee "/build/fish/src/fish-3.1.2/build/CMakeFiles/fish_indent.dir/DependInfo.cmake" is newer than depender "/build/fish/src/fish-3.1.2/build/CMakeFiles/fish_indent.dir/depend.internal".
[2020-05-24T11:27:52.064Z] Dependee "/build/fish/src/fish-3.1.2/build/CMakeFiles/CMakeDirectoryInformation.cmake" is newer than depender "/build/fish/src/fish-3.1.2/build/CMakeFiles/fish_indent.dir/depend.internal".
[2020-05-24T11:27:52.064Z] Dependee "/build/fish/src/fish-3.1.2/build/CMakeFiles/fish.dir/DependInfo.cmake" is newer than depender "/build/fish/src/fish-3.1.2/build/CMakeFiles/fish.dir/depend.internal".
[2020-05-24T11:27:52.064Z] Dependee "/build/fish/src/fish-3.1.2/build/CMakeFiles/fish_key_reader.dir/DependInfo.cmake" is newer than depender "/build/fish/src/fish-3.1.2/build/CMakeFiles/fish_key_reader.dir/depend.internal".
[2020-05-24T11:27:52.064Z] Dependee "/build/fish/src/fish-3.1.2/build/CMakeFiles/CMakeDirectoryInformation.cmake" is newer than depender "/build/fish/src/fish-3.1.2/build/CMakeFiles/fish_key_reader.dir/depend.internal".
[2020-05-24T11:27:52.064Z] Dependee "/build/fish/src/fish-3.1.2/build/CMakeFiles/CMakeDirectoryInformation.cmake" is newer than depender "/build/fish/src/fish-3.1.2/build/CMakeFiles/fish.dir/depend.internal".
[2020-05-24T11:27:52.064Z] Scanning dependencies of target fish_indent
[2020-05-24T11:27:52.064Z] make[2]: Leaving directory '/build/fish/src/fish-3.1.2/build'
[2020-05-24T11:27:52.064Z] make  -f CMakeFiles/fish_indent.dir/build.make CMakeFiles/fish_indent.dir/build
[2020-05-24T11:27:52.064Z] make[2]: Entering directory '/build/fish/src/fish-3.1.2/build'
[2020-05-24T11:27:52.064Z] Scanning dependencies of target fish_key_reader
[2020-05-24T11:27:52.064Z] Scanning dependencies of target fish
[2020-05-24T11:27:52.064Z] make[2]: Leaving directory '/build/fish/src/fish-3.1.2/build'
[2020-05-24T11:27:52.064Z] make[2]: Leaving directory '/build/fish/src/fish-3.1.2/build'
[2020-05-24T11:27:52.064Z] make  -f CMakeFiles/fish_key_reader.dir/build.make CMakeFiles/fish_key_reader.dir/build
[2020-05-24T11:27:52.064Z] make  -f CMakeFiles/fish.dir/build.make CMakeFiles/fish.dir/build
[2020-05-24T11:27:52.064Z] make[2]: Entering directory '/build/fish/src/fish-3.1.2/build'
[2020-05-24T11:27:52.064Z] make[2]: Entering directory '/build/fish/src/fish-3.1.2/build'
[2020-05-24T11:27:52.064Z] [ 91%] Building CXX object CMakeFiles/fish_indent.dir/src/print_help.cpp.o
[2020-05-24T11:27:52.064Z] /usr/bin/c++  -DBINDIR=L\"/usr/bin\" -DCMAKE_BINARY_DIR=\"/build/fish/src/fish-3.1.2/build\" -DCMAKE_SOURCE_DIR=\"/build/fish/src/fish-3.1.2\" -DDATADIR=L\"/usr/share\" -DDOCDIR=L\"/usr/share/doc/fish\" -DLOCALEDIR=\"/usr/share/locale\" -DPREFIX=L\"/usr\" -DSYSCONFDIR=L\"/etc\" -D_REENTRANT -D_UNICODE=1 -I/build/fish/src/fish-3.1.2/build  -D_FORTIFY_SOURCE=2 -march=x86-64 -mtune=generic -O2 -pipe -fno-plt -D_FORTIFY_SOURCE=2 -Wall -Wextra -Wno-implicit-fallthrough -Wno-comment -Wno-address -Wno-strict-aliasing -Wno-redundant-move    -fno-exceptions -pthread -std=gnu++11 -o CMakeFiles/fish_indent.dir/src/print_help.cpp.o -c /build/fish/src/fish-3.1.2/src/print_help.cpp
[2020-05-24T11:27:52.064Z] [ 92%] Building CXX object CMakeFiles/fish_indent.dir/src/fish_indent.cpp.o
[2020-05-24T11:27:52.064Z] /usr/bin/c++  -DBINDIR=L\"/usr/bin\" -DCMAKE_BINARY_DIR=\"/build/fish/src/fish-3.1.2/build\" -DCMAKE_SOURCE_DIR=\"/build/fish/src/fish-3.1.2\" -DDATADIR=L\"/usr/share\" -DDOCDIR=L\"/usr/share/doc/fish\" -DLOCALEDIR=\"/usr/share/locale\" -DPREFIX=L\"/usr\" -DSYSCONFDIR=L\"/etc\" -D_REENTRANT -D_UNICODE=1 -I/build/fish/src/fish-3.1.2/build  -D_FORTIFY_SOURCE=2 -march=x86-64 -mtune=generic -O2 -pipe -fno-plt -D_FORTIFY_SOURCE=2 -Wall -Wextra -Wno-implicit-fallthrough -Wno-comment -Wno-address -Wno-strict-aliasing -Wno-redundant-move    -fno-exceptions -pthread -std=gnu++11 -o CMakeFiles/fish_indent.dir/src/fish_indent.cpp.o -c /build/fish/src/fish-3.1.2/src/fish_indent.cpp
[2020-05-24T11:27:52.064Z] [ 94%] Building CXX object CMakeFiles/fish_key_reader.dir/src/fish_key_reader.cpp.o
[2020-05-24T11:27:52.064Z] [ 94%] Building CXX object CMakeFiles/fish.dir/src/fish.cpp.o
[2020-05-24T11:27:52.064Z] /usr/bin/c++  -DBINDIR=L\"/usr/bin\" -DCMAKE_BINARY_DIR=\"/build/fish/src/fish-3.1.2/build\" -DCMAKE_SOURCE_DIR=\"/build/fish/src/fish-3.1.2\" -DDATADIR=L\"/usr/share\" -DDOCDIR=L\"/usr/share/doc/fish\" -DLOCALEDIR=\"/usr/share/locale\" -DPREFIX=L\"/usr\" -DSYSCONFDIR=L\"/etc\" -D_REENTRANT -D_UNICODE=1 -I/build/fish/src/fish-3.1.2/build  -D_FORTIFY_SOURCE=2 -march=x86-64 -mtune=generic -O2 -pipe -fno-plt -D_FORTIFY_SOURCE=2 -Wall -Wextra -Wno-implicit-fallthrough -Wno-comment -Wno-address -Wno-strict-aliasing -Wno-redundant-move    -fno-exceptions -pthread -std=gnu++11 -o CMakeFiles/fish_key_reader.dir/src/fish_key_reader.cpp.o -c /build/fish/src/fish-3.1.2/src/fish_key_reader.cpp
[2020-05-24T11:27:52.065Z] /usr/bin/c++  -DBINDIR=L\"/usr/bin\" -DCMAKE_BINARY_DIR=\"/build/fish/src/fish-3.1.2/build\" -DCMAKE_SOURCE_DIR=\"/build/fish/src/fish-3.1.2\" -DDATADIR=L\"/usr/share\" -DDOCDIR=L\"/usr/share/doc/fish\" -DLOCALEDIR=\"/usr/share/locale\" -DPREFIX=L\"/usr\" -DSYSCONFDIR=L\"/etc\" -D_REENTRANT -D_UNICODE=1 -I/build/fish/src/fish-3.1.2/build  -D_FORTIFY_SOURCE=2 -march=x86-64 -mtune=generic -O2 -pipe -fno-plt -D_FORTIFY_SOURCE=2 -Wall -Wextra -Wno-implicit-fallthrough -Wno-comment -Wno-address -Wno-strict-aliasing -Wno-redundant-move    -fno-exceptions -pthread -std=gnu++11 -o CMakeFiles/fish.dir/src/fish.cpp.o -c /build/fish/src/fish-3.1.2/src/fish.cpp
[2020-05-24T11:27:52.065Z] [ 95%] Building CXX object CMakeFiles/fish_key_reader.dir/src/print_help.cpp.o
[2020-05-24T11:27:52.065Z] /usr/bin/c++  -DBINDIR=L\"/usr/bin\" -DCMAKE_BINARY_DIR=\"/build/fish/src/fish-3.1.2/build\" -DCMAKE_SOURCE_DIR=\"/build/fish/src/fish-3.1.2\" -DDATADIR=L\"/usr/share\" -DDOCDIR=L\"/usr/share/doc/fish\" -DLOCALEDIR=\"/usr/share/locale\" -DPREFIX=L\"/usr\" -DSYSCONFDIR=L\"/etc\" -D_REENTRANT -D_UNICODE=1 -I/build/fish/src/fish-3.1.2/build  -D_FORTIFY_SOURCE=2 -march=x86-64 -mtune=generic -O2 -pipe -fno-plt -D_FORTIFY_SOURCE=2 -Wall -Wextra -Wno-implicit-fallthrough -Wno-comment -Wno-address -Wno-strict-aliasing -Wno-redundant-move    -fno-exceptions -pthread -std=gnu++11 -o CMakeFiles/fish_key_reader.dir/src/print_help.cpp.o -c /build/fish/src/fish-3.1.2/src/print_help.cpp
[2020-05-24T11:27:53.408Z] [ 95%] Linking CXX executable fish_indent
[2020-05-24T11:27:53.408Z] /usr/bin/cmake -E cmake_link_script CMakeFiles/fish_indent.dir/link.txt --verbose=1
[2020-05-24T11:27:53.408Z] /usr/bin/c++  -D_FORTIFY_SOURCE=2 -march=x86-64 -mtune=generic -O2 -pipe -fno-plt -D_FORTIFY_SOURCE=2 -Wall -Wextra -Wno-implicit-fallthrough -Wno-comment -Wno-address -Wno-strict-aliasing -Wno-redundant-move   -Wl,-O1,--sort-common,--as-needed,-z,relro,-z,now -fuse-ld=gold -rdynamic CMakeFiles/fish_indent.dir/src/fish_indent.cpp.o CMakeFiles/fish_indent.dir/src/print_help.cpp.o  -o fish_indent  libfishlib.a -lcurses -pthread -ldl -lpcre2-32 
[2020-05-24T11:27:53.408Z] make[2]: Leaving directory '/build/fish/src/fish-3.1.2/build'
[2020-05-24T11:27:53.408Z] [ 95%] Built target fish_indent
[2020-05-24T11:27:53.408Z] make  -f CMakeFiles/sphinx-docs.dir/build.make CMakeFiles/sphinx-docs.dir/depend
[2020-05-24T11:27:53.408Z] make  -f CMakeFiles/sphinx-manpages.dir/build.make CMakeFiles/sphinx-manpages.dir/depend
[2020-05-24T11:27:53.408Z] make[2]: Entering directory '/build/fish/src/fish-3.1.2/build'
[2020-05-24T11:27:53.408Z] cd /build/fish/src/fish-3.1.2/build && /usr/bin/cmake -E cmake_depends "Unix Makefiles" /build/fish/src/fish-3.1.2 /build/fish/src/fish-3.1.2 /build/fish/src/fish-3.1.2/build /build/fish/src/fish-3.1.2/build /build/fish/src/fish-3.1.2/build/CMakeFiles/sphinx-docs.dir/DependInfo.cmake --color=
[2020-05-24T11:27:53.408Z] make[2]: Entering directory '/build/fish/src/fish-3.1.2/build'
[2020-05-24T11:27:53.408Z] cd /build/fish/src/fish-3.1.2/build && /usr/bin/cmake -E cmake_depends "Unix Makefiles" /build/fish/src/fish-3.1.2 /build/fish/src/fish-3.1.2 /build/fish/src/fish-3.1.2/build /build/fish/src/fish-3.1.2/build /build/fish/src/fish-3.1.2/build/CMakeFiles/sphinx-manpages.dir/DependInfo.cmake --color=
[2020-05-24T11:27:53.408Z] Dependee "/build/fish/src/fish-3.1.2/build/CMakeFiles/sphinx-manpages.dir/DependInfo.cmake" is newer than depender "/build/fish/src/fish-3.1.2/build/CMakeFiles/sphinx-manpages.dir/depend.internal".
[2020-05-24T11:27:53.408Z] Dependee "/build/fish/src/fish-3.1.2/build/CMakeFiles/CMakeDirectoryInformation.cmake" is newer than depender "/build/fish/src/fish-3.1.2/build/CMakeFiles/sphinx-manpages.dir/depend.internal".
[2020-05-24T11:27:53.408Z] Scanning dependencies of target sphinx-manpages
[2020-05-24T11:27:53.408Z] make[2]: Leaving directory '/build/fish/src/fish-3.1.2/build'
[2020-05-24T11:27:53.408Z] make  -f CMakeFiles/sphinx-manpages.dir/build.make CMakeFiles/sphinx-manpages.dir/build
[2020-05-24T11:27:53.408Z] Dependee "/build/fish/src/fish-3.1.2/build/CMakeFiles/sphinx-docs.dir/DependInfo.cmake" is newer than depender "/build/fish/src/fish-3.1.2/build/CMakeFiles/sphinx-docs.dir/depend.internal".
[2020-05-24T11:27:53.408Z] Dependee "/build/fish/src/fish-3.1.2/build/CMakeFiles/CMakeDirectoryInformation.cmake" is newer than depender "/build/fish/src/fish-3.1.2/build/CMakeFiles/sphinx-docs.dir/depend.internal".
[2020-05-24T11:27:53.408Z] Scanning dependencies of target sphinx-docs
[2020-05-24T11:27:53.408Z] make[2]: Leaving directory '/build/fish/src/fish-3.1.2/build'
[2020-05-24T11:27:53.408Z] make  -f CMakeFiles/sphinx-docs.dir/build.make CMakeFiles/sphinx-docs.dir/build
[2020-05-24T11:27:53.408Z] make[2]: Entering directory '/build/fish/src/fish-3.1.2/build'
[2020-05-24T11:27:53.408Z] make[2]: Entering directory '/build/fish/src/fish-3.1.2/build'
[2020-05-24T11:27:53.408Z] [ 96%] Building man pages with Sphinx
[2020-05-24T11:27:53.408Z] [ 97%] Building HTML documentation with Sphinx
[2020-05-24T11:27:53.408Z] env PATH="/build/fish/src/fish-3.1.2/build:$PATH" /usr/bin/sphinx-build -q -b man -c /build/fish/src/fish-3.1.2/sphinx_doc_src -d /build/fish/src/fish-3.1.2/build/user_doc/doctrees /build/fish/src/fish-3.1.2/sphinx_doc_src /build/fish/src/fish-3.1.2/build/user_doc/man/man1
[2020-05-24T11:27:53.408Z] mkdir -p /build/fish/src/fish-3.1.2/build/user_doc/html/_static/
[2020-05-24T11:27:53.408Z] /usr/bin/cmake -E copy_if_different /build/fish/src/fish-3.1.2/sphinx_doc_src/_static/pygments.css /build/fish/src/fish-3.1.2/build/user_doc/html/_static/
[2020-05-24T11:27:53.408Z] /usr/bin/cmake -E copy_if_different /build/fish/src/fish-3.1.2/sphinx_doc_src/_static/custom.css /build/fish/src/fish-3.1.2/build/user_doc/html/_static/
[2020-05-24T11:27:53.408Z] env PATH="/build/fish/src/fish-3.1.2/build:$PATH" /usr/bin/sphinx-build -q -b html -c /build/fish/src/fish-3.1.2/sphinx_doc_src -d /build/fish/src/fish-3.1.2/build/user_doc/doctrees /build/fish/src/fish-3.1.2/sphinx_doc_src /build/fish/src/fish-3.1.2/build/user_doc/html
[2020-05-24T11:27:53.408Z] [ 98%] Linking CXX executable fish_key_reader
[2020-05-24T11:27:53.408Z] /usr/bin/cmake -E cmake_link_script CMakeFiles/fish_key_reader.dir/link.txt --verbose=1
[2020-05-24T11:27:53.408Z] /usr/bin/c++  -D_FORTIFY_SOURCE=2 -march=x86-64 -mtune=generic -O2 -pipe -fno-plt -D_FORTIFY_SOURCE=2 -Wall -Wextra -Wno-implicit-fallthrough -Wno-comment -Wno-address -Wno-strict-aliasing -Wno-redundant-move   -Wl,-O1,--sort-common,--as-needed,-z,relro,-z,now -fuse-ld=gold -rdynamic CMakeFiles/fish_key_reader.dir/src/fish_key_reader.cpp.o CMakeFiles/fish_key_reader.dir/src/print_help.cpp.o  -o fish_key_reader  libfishlib.a -lcurses -pthread -ldl -lpcre2-32 
[2020-05-24T11:27:53.408Z] make[2]: Leaving directory '/build/fish/src/fish-3.1.2/build'
[2020-05-24T11:27:53.408Z] [ 98%] Built target fish_key_reader
[2020-05-24T11:27:53.659Z] [100%] Linking CXX executable fish
[2020-05-24T11:27:53.659Z] /usr/bin/cmake -E cmake_link_script CMakeFiles/fish.dir/link.txt --verbose=1
[2020-05-24T11:27:53.659Z] /usr/bin/c++  -D_FORTIFY_SOURCE=2 -march=x86-64 -mtune=generic -O2 -pipe -fno-plt -D_FORTIFY_SOURCE=2 -Wall -Wextra -Wno-implicit-fallthrough -Wno-comment -Wno-address -Wno-strict-aliasing -Wno-redundant-move   -Wl,-O1,--sort-common,--as-needed,-z,relro,-z,now -fuse-ld=gold -rdynamic CMakeFiles/fish.dir/src/fish.cpp.o  -o fish  libfishlib.a -lcurses -pthread -ldl -lpcre2-32 
[2020-05-24T11:27:53.659Z] make[2]: Leaving directory '/build/fish/src/fish-3.1.2/build'
[2020-05-24T11:27:53.659Z] [100%] Built target fish
[2020-05-24T11:27:56.887Z] make[2]: Leaving directory '/build/fish/src/fish-3.1.2/build'
[2020-05-24T11:27:56.887Z] [100%] Built target sphinx-manpages
[2020-05-24T11:28:18.684Z] make[2]: Leaving directory '/build/fish/src/fish-3.1.2/build'
[2020-05-24T11:28:18.684Z] [100%] Built target sphinx-docs
[2020-05-24T11:28:18.684Z] make  -f CMakeFiles/doc.dir/build.make CMakeFiles/doc.dir/depend
[2020-05-24T11:28:18.684Z] make[2]: Entering directory '/build/fish/src/fish-3.1.2/build'
[2020-05-24T11:28:18.684Z] cd /build/fish/src/fish-3.1.2/build && /usr/bin/cmake -E cmake_depends "Unix Makefiles" /build/fish/src/fish-3.1.2 /build/fish/src/fish-3.1.2 /build/fish/src/fish-3.1.2/build /build/fish/src/fish-3.1.2/build /build/fish/src/fish-3.1.2/build/CMakeFiles/doc.dir/DependInfo.cmake --color=
[2020-05-24T11:28:18.684Z] Dependee "/build/fish/src/fish-3.1.2/build/CMakeFiles/doc.dir/DependInfo.cmake" is newer than depender "/build/fish/src/fish-3.1.2/build/CMakeFiles/doc.dir/depend.internal".
[2020-05-24T11:28:18.684Z] Dependee "/build/fish/src/fish-3.1.2/build/CMakeFiles/CMakeDirectoryInformation.cmake" is newer than depender "/build/fish/src/fish-3.1.2/build/CMakeFiles/doc.dir/depend.internal".
[2020-05-24T11:28:18.684Z] Scanning dependencies of target doc
[2020-05-24T11:28:18.684Z] make[2]: Leaving directory '/build/fish/src/fish-3.1.2/build'
[2020-05-24T11:28:18.684Z] make  -f CMakeFiles/doc.dir/build.make CMakeFiles/doc.dir/build
[2020-05-24T11:28:18.684Z] make[2]: Entering directory '/build/fish/src/fish-3.1.2/build'
[2020-05-24T11:28:18.684Z] make[2]: Nothing to be done for 'CMakeFiles/doc.dir/build'.
[2020-05-24T11:28:18.684Z] make[2]: Leaving directory '/build/fish/src/fish-3.1.2/build'
[2020-05-24T11:28:18.684Z] [100%] Built target doc
[2020-05-24T11:28:18.684Z] make[1]: Leaving directory '/build/fish/src/fish-3.1.2/build'
[2020-05-24T11:28:18.685Z] /usr/bin/cmake -E cmake_progress_start /build/fish/src/fish-3.1.2/build/CMakeFiles 0
[2020-05-24T11:28:18.685Z] make: Leaving directory '/build/fish/src/fish-3.1.2/build'
[2020-05-24T11:28:18.685Z] ==> Starting check()...
[2020-05-24T11:28:18.685Z] make: Entering directory '/build/fish/src/fish-3.1.2/build'
[2020-05-24T11:28:18.685Z] make[1]: Entering directory '/build/fish/src/fish-3.1.2/build'
[2020-05-24T11:28:18.685Z] make[2]: Entering directory '/build/fish/src/fish-3.1.2/build'
[2020-05-24T11:28:18.685Z] make[3]: Entering directory '/build/fish/src/fish-3.1.2/build'
[2020-05-24T11:28:18.685Z] make[3]: Entering directory '/build/fish/src/fish-3.1.2/build'
[2020-05-24T11:28:18.685Z] make[3]: Entering directory '/build/fish/src/fish-3.1.2/build'
[2020-05-24T11:28:18.685Z] make[3]: Entering directory '/build/fish/src/fish-3.1.2/build'
[2020-05-24T11:28:18.685Z] Scanning dependencies of target symlink_functions
[2020-05-24T11:28:18.685Z] make[3]: Leaving directory '/build/fish/src/fish-3.1.2/build'
[2020-05-24T11:28:18.685Z] make[3]: Entering directory '/build/fish/src/fish-3.1.2/build'
[2020-05-24T11:28:18.685Z] Scanning dependencies of target tests_dir
[2020-05-24T11:28:18.685Z] make[3]: Leaving directory '/build/fish/src/fish-3.1.2/build'
[2020-05-24T11:28:18.685Z] make[3]: Leaving directory '/build/fish/src/fish-3.1.2/build'
[2020-05-24T11:28:18.685Z] make[3]: Leaving directory '/build/fish/src/fish-3.1.2/build'
[2020-05-24T11:28:18.685Z] make[3]: Leaving directory '/build/fish/src/fish-3.1.2/build'
[2020-05-24T11:28:18.685Z] make[3]: Entering directory '/build/fish/src/fish-3.1.2/build'
[2020-05-24T11:28:18.685Z] make[3]: Entering directory '/build/fish/src/fish-3.1.2/build'
[2020-05-24T11:28:18.685Z] [  0%] Built target symlink_functions
[2020-05-24T11:28:18.685Z] Copying test files to binary dir
[2020-05-24T11:28:18.685Z] [  2%] Built target fish_test_helper
[2020-05-24T11:28:18.685Z] make[3]: Leaving directory '/build/fish/src/fish-3.1.2/build'
[2020-05-24T11:28:18.685Z] [  2%] Built target CHECK-FISH-BUILD-VERSION-FILE
[2020-05-24T11:28:18.685Z] make[3]: Leaving directory '/build/fish/src/fish-3.1.2/build'
[2020-05-24T11:28:18.685Z] make[3]: Entering directory '/build/fish/src/fish-3.1.2/build'
[2020-05-24T11:28:18.685Z] [  2%] Built target tests_dir
[2020-05-24T11:28:18.685Z] make[3]: Leaving directory '/build/fish/src/fish-3.1.2/build'
[2020-05-24T11:28:18.685Z] [ 96%] Built target fishlib
[2020-05-24T11:28:18.685Z] make[3]: Entering directory '/build/fish/src/fish-3.1.2/build'
[2020-05-24T11:28:18.685Z] make[3]: Entering directory '/build/fish/src/fish-3.1.2/build'
[2020-05-24T11:28:18.685Z] make[3]: Leaving directory '/build/fish/src/fish-3.1.2/build'
[2020-05-24T11:28:18.685Z] Scanning dependencies of target fish_tests
[2020-05-24T11:28:18.685Z] make[3]: Leaving directory '/build/fish/src/fish-3.1.2/build'
[2020-05-24T11:28:18.685Z] make[3]: Entering directory '/build/fish/src/fish-3.1.2/build'
[2020-05-24T11:28:18.685Z] [ 98%] Built target fish
[2020-05-24T11:28:18.685Z] make[3]: Entering directory '/build/fish/src/fish-3.1.2/build'
[2020-05-24T11:28:18.685Z] [100%] Building CXX object CMakeFiles/fish_tests.dir/src/fish_tests.cpp.o
[2020-05-24T11:28:18.685Z] Scanning dependencies of target tests_buildroot_target
[2020-05-24T11:28:18.685Z] make[3]: Leaving directory '/build/fish/src/fish-3.1.2/build'
[2020-05-24T11:28:18.685Z] make[3]: Entering directory '/build/fish/src/fish-3.1.2/build'
[2020-05-24T11:28:18.685Z] make[4]: Entering directory '/build/fish/src/fish-3.1.2/build'
[2020-05-24T11:28:18.685Z] make[5]: Entering directory '/build/fish/src/fish-3.1.2/build'
[2020-05-24T11:28:18.685Z] make[6]: Entering directory '/build/fish/src/fish-3.1.2/build'
[2020-05-24T11:28:18.685Z] make[6]: Entering directory '/build/fish/src/fish-3.1.2/build'
[2020-05-24T11:28:18.685Z] make[6]: Entering directory '/build/fish/src/fish-3.1.2/build'
[2020-05-24T11:28:18.685Z] make[6]: Entering directory '/build/fish/src/fish-3.1.2/build'
[2020-05-24T11:28:18.685Z] make[6]: Entering directory '/build/fish/src/fish-3.1.2/build'
[2020-05-24T11:28:18.685Z] make[6]: Entering directory '/build/fish/src/fish-3.1.2/build'
[2020-05-24T11:28:18.685Z] make[6]: Entering directory '/build/fish/src/fish-3.1.2/build'
[2020-05-24T11:28:18.685Z] make[6]: Entering directory '/build/fish/src/fish-3.1.2/build'
[2020-05-24T11:28:18.685Z] make[6]: Entering directory '/build/fish/src/fish-3.1.2/build'
[2020-05-24T11:28:18.685Z] make[6]: Entering directory '/build/fish/src/fish-3.1.2/build'
[2020-05-24T11:28:18.685Z] make[6]: Entering directory '/build/fish/src/fish-3.1.2/build'
[2020-05-24T11:28:18.685Z] make[6]: Leaving directory '/build/fish/src/fish-3.1.2/build'
[2020-05-24T11:28:18.685Z] make[6]: Leaving directory '/build/fish/src/fish-3.1.2/build'
[2020-05-24T11:28:18.685Z] make[6]: Leaving directory '/build/fish/src/fish-3.1.2/build'
[2020-05-24T11:28:18.685Z] make[6]: Leaving directory '/build/fish/src/fish-3.1.2/build'
[2020-05-24T11:28:18.685Z] make[6]: Leaving directory '/build/fish/src/fish-3.1.2/build'
[2020-05-24T11:28:18.685Z] make[6]: Entering directory '/build/fish/src/fish-3.1.2/build'
[2020-05-24T11:28:18.685Z] make[6]: Leaving directory '/build/fish/src/fish-3.1.2/build'
[2020-05-24T11:28:18.685Z] make[6]: Leaving directory '/build/fish/src/fish-3.1.2/build'
[2020-05-24T11:28:18.685Z] make[6]: Leaving directory '/build/fish/src/fish-3.1.2/build'
[2020-05-24T11:28:18.685Z] make[6]: Leaving directory '/build/fish/src/fish-3.1.2/build'
[2020-05-24T11:28:18.685Z] make[6]: Leaving directory '/build/fish/src/fish-3.1.2/build'
[2020-05-24T11:28:18.685Z] make[6]: Leaving directory '/build/fish/src/fish-3.1.2/build'
[2020-05-24T11:28:18.685Z] [  1%] Built target pofiles_2
[2020-05-24T11:28:18.685Z] [  2%] Built target pofiles_9
[2020-05-24T11:28:18.685Z] [  2%] Built target pofiles_5
[2020-05-24T11:28:18.685Z] [  3%] Built target pofiles_8
[2020-05-24T11:28:18.685Z] [  4%] Built target pofiles_3
[2020-05-24T11:28:18.685Z] [  5%] Built target pofiles_7
[2020-05-24T11:28:18.685Z] [  6%] Built target pofiles_4
[2020-05-24T11:28:18.685Z] [  7%] Built target pofiles_1
[2020-05-24T11:28:18.685Z] [  8%] Built target pofiles_6
[2020-05-24T11:28:18.685Z] [ 10%] Built target fish_test_helper
[2020-05-24T11:28:18.685Z] make[6]: Leaving directory '/build/fish/src/fish-3.1.2/build'
[2020-05-24T11:28:18.685Z] [ 10%] Built target CHECK-FISH-BUILD-VERSION-FILE
[2020-05-24T11:28:18.685Z] make[6]: Entering directory '/build/fish/src/fish-3.1.2/build'
[2020-05-24T11:28:18.685Z] make[6]: Entering directory '/build/fish/src/fish-3.1.2/build'
[2020-05-24T11:28:18.685Z] make[6]: Leaving directory '/build/fish/src/fish-3.1.2/build'
[2020-05-24T11:28:18.685Z] make[6]: Leaving directory '/build/fish/src/fish-3.1.2/build'
[2020-05-24T11:28:18.685Z] [ 11%] Built target build_fish_pc
[2020-05-24T11:28:18.685Z] [ 90%] Built target fishlib
[2020-05-24T11:28:18.685Z] make[6]: Entering directory '/build/fish/src/fish-3.1.2/build'
[2020-05-24T11:28:18.685Z] make[6]: Entering directory '/build/fish/src/fish-3.1.2/build'
[2020-05-24T11:28:18.685Z] make[6]: Entering directory '/build/fish/src/fish-3.1.2/build'
[2020-05-24T11:28:18.685Z] make[6]: Leaving directory '/build/fish/src/fish-3.1.2/build'
[2020-05-24T11:28:18.685Z] make[6]: Leaving directory '/build/fish/src/fish-3.1.2/build'
[2020-05-24T11:28:18.685Z] make[6]: Leaving directory '/build/fish/src/fish-3.1.2/build'
[2020-05-24T11:28:18.685Z] [ 92%] Built target fish
[2020-05-24T11:28:18.685Z] [ 94%] Built target fish_indent
[2020-05-24T11:28:18.685Z] [ 97%] Built target fish_key_reader
[2020-05-24T11:28:18.685Z] make[6]: Entering directory '/build/fish/src/fish-3.1.2/build'
[2020-05-24T11:28:18.685Z] make[6]: Entering directory '/build/fish/src/fish-3.1.2/build'
[2020-05-24T11:28:18.685Z] make[6]: Leaving directory '/build/fish/src/fish-3.1.2/build'
[2020-05-24T11:28:18.685Z] make[6]: Leaving directory '/build/fish/src/fish-3.1.2/build'
[2020-05-24T11:28:18.685Z] make[6]: Entering directory '/build/fish/src/fish-3.1.2/build'
[2020-05-24T11:28:18.685Z] make[6]: Entering directory '/build/fish/src/fish-3.1.2/build'
[2020-05-24T11:28:18.685Z] [ 98%] Building HTML documentation with Sphinx
[2020-05-24T11:28:18.685Z] [100%] Building man pages with Sphinx
[2020-05-24T11:28:18.685Z] make[6]: Leaving directory '/build/fish/src/fish-3.1.2/build'
[2020-05-24T11:28:18.685Z] [100%] Built target sphinx-docs
[2020-05-24T11:28:20.029Z] make[6]: Leaving directory '/build/fish/src/fish-3.1.2/build'
[2020-05-24T11:28:20.029Z] [100%] Built target sphinx-manpages
[2020-05-24T11:28:20.029Z] make[6]: Entering directory '/build/fish/src/fish-3.1.2/build'
[2020-05-24T11:28:20.029Z] make[6]: Leaving directory '/build/fish/src/fish-3.1.2/build'
[2020-05-24T11:28:20.029Z] [100%] Built target doc
[2020-05-24T11:28:20.029Z] make[5]: Leaving directory '/build/fish/src/fish-3.1.2/build'
[2020-05-24T11:28:20.029Z] Install the project...
[2020-05-24T11:28:20.029Z] -- Install configuration: "None"
[2020-05-24T11:28:20.279Z] /build/fish/src/fish-3.1.2/src/fish_tests.cpp: In function ‘void test_universal()’:
[2020-05-24T11:28:20.279Z] /build/fish/src/fish-3.1.2/src/fish_tests.cpp:3239:17: warning: ignoring return value of ‘int system(const char*)’ declared with attribute ‘warn_unused_result’ [-Wunused-result]
[2020-05-24T11:28:20.279Z]  3239 |     (void)system("rm -Rf test/fish_uvars_test/");
[2020-05-24T11:28:20.279Z]       |           ~~~~~~^~~~~~~~~~~~~~~~~~~~~~~~~~~~~~~~
[2020-05-24T11:28:20.279Z] /build/fish/src/fish-3.1.2/src/fish_tests.cpp: In function ‘void test_universal_callbacks()’:
[2020-05-24T11:28:20.279Z] /build/fish/src/fish-3.1.2/src/fish_tests.cpp:3360:17: warning: ignoring return value of ‘int system(const char*)’ declared with attribute ‘warn_unused_result’ [-Wunused-result]
[2020-05-24T11:28:20.279Z]  3360 |     (void)system("rm -Rf test/fish_uvars_test/");
[2020-05-24T11:28:20.279Z]       |           ~~~~~~^~~~~~~~~~~~~~~~~~~~~~~~~~~~~~~~
[2020-05-24T11:28:20.279Z] /build/fish/src/fish-3.1.2/src/fish_tests.cpp: In function ‘void test_universal_ok_to_save()’:
[2020-05-24T11:28:20.279Z] /build/fish/src/fish-3.1.2/src/fish_tests.cpp:3409:17: warning: ignoring return value of ‘int system(const char*)’ declared with attribute ‘warn_unused_result’ [-Wunused-result]
[2020-05-24T11:28:20.279Z]  3409 |     (void)system("rm -Rf test/fish_uvars_test/");
[2020-05-24T11:28:20.279Z]       |           ~~~~~~^~~~~~~~~~~~~~~~~~~~~~~~~~~~~~~~
[2020-05-24T11:28:20.279Z] make[4]: Leaving directory '/build/fish/src/fish-3.1.2/build'
[2020-05-24T11:28:20.279Z] make[3]: Leaving directory '/build/fish/src/fish-3.1.2/build'
[2020-05-24T11:28:20.279Z] Built target tests_buildroot_target
[2020-05-24T11:28:20.279Z] make[3]: Entering directory '/build/fish/src/fish-3.1.2/build'
[2020-05-24T11:28:20.279Z] Scanning dependencies of target test_prep
[2020-05-24T11:28:20.279Z] make[3]: Leaving directory '/build/fish/src/fish-3.1.2/build'
[2020-05-24T11:28:20.279Z] make[3]: Entering directory '/build/fish/src/fish-3.1.2/build'
[2020-05-24T11:28:20.279Z] make[3]: Leaving directory '/build/fish/src/fish-3.1.2/build'
[2020-05-24T11:28:20.279Z] Built target test_prep
[2020-05-24T11:28:30.154Z] Linking CXX executable fish_tests
[2020-05-24T11:28:30.404Z] make[3]: Leaving directory '/build/fish/src/fish-3.1.2/build'
[2020-05-24T11:28:30.404Z] Built target fish_tests
[2020-05-24T11:28:30.404Z] make[3]: Entering directory '/build/fish/src/fish-3.1.2/build'
[2020-05-24T11:28:30.404Z] Scanning dependencies of target serial_test_low_level
[2020-05-24T11:28:30.404Z] make[3]: Leaving directory '/build/fish/src/fish-3.1.2/build'
[2020-05-24T11:28:30.404Z] make[3]: Entering directory '/build/fish/src/fish-3.1.2/build'
[2020-05-24T11:28:30.404Z] 0 / 5...done (2)
[2020-05-24T11:28:30.405Z] 1 / 5...done (21)
[2020-05-24T11:28:30.405Z] 2 / 5...done (401)
[2020-05-24T11:28:30.405Z] 3 / 5...done (8001)
[2020-05-24T11:28:30.955Z] 4 / 5...done (160001)
[2020-05-24T11:28:32.816Z] tcgetattr: Inappropriate ioctl for device
[2020-05-24T11:28:33.367Z] tcgetattr: Inappropriate ioctl for device
[2020-05-24T11:28:34.277Z] tcgetattr: Inappropriate ioctl for device
[2020-05-24T11:28:34.828Z] tcgetattr: Inappropriate ioctl for device
[2020-05-24T11:28:35.738Z] tcgetattr: Inappropriate ioctl for device
[2020-05-24T11:28:36.289Z] tcgetattr: Inappropriate ioctl for device
[2020-05-24T11:28:46.163Z] /build/fish/src/fish-3.1.2/build/test/temp
[2020-05-24T11:28:46.413Z] Testing low-level functionality
[2020-05-24T11:28:46.413Z] Testing utility functions
[2020-05-24T11:28:46.413Z] Testing wcstring_tok
[2020-05-24T11:28:46.414Z] Testing str_to_num
[2020-05-24T11:28:46.414Z] Testing enum set
[2020-05-24T11:28:46.414Z] Testing enum array
[2020-05-24T11:28:46.414Z] Testing syntax highlighting
[2020-05-24T11:28:46.414Z] Testing parser two-token lookahead
[2020-05-24T11:28:46.414Z] Fuzzing parser (node size: 20)
[2020-05-24T11:28:46.414Z] All fuzzed in 0.595420 seconds!
[2020-05-24T11:28:46.414Z] Testing parser correctness
[2020-05-24T11:28:46.414Z] Parse tests complete
[2020-05-24T11:28:46.414Z] Testing new parser ad hoc tests
[2020-05-24T11:28:46.414Z] Testing new parser error reporting
[2020-05-24T11:28:46.414Z] Testing error messages
[2020-05-24T11:28:46.414Z] Testing escaping and unescaping
[2020-05-24T11:28:46.414Z] Testing escaping with quotes
[2020-05-24T11:28:46.414Z] Testing formatting functions
[2020-05-24T11:28:46.414Z] Testing wide/narrow string conversion
[2020-05-24T11:28:46.414Z] Testing convert_nulls
[2020-05-24T11:28:46.414Z] Testing tokenizer
[2020-05-24T11:28:46.414Z] Test correct tokenization
[2020-05-24T11:28:46.414Z] Testing iothreads
[2020-05-24T11:28:46.414Z]     (804.33 msec, with max of 1024 threads)
[2020-05-24T11:28:46.414Z] Testing pthreads
[2020-05-24T11:28:46.414Z] Testing parser
[2020-05-24T11:28:46.414Z] Testing block nesting
[2020-05-24T11:28:46.414Z] Testing detection of invalid use of builtin commands
[2020-05-24T11:28:46.414Z] Testing basic evaluation
[2020-05-24T11:28:46.414Z] Testing recursion detection
[2020-05-24T11:28:46.414Z] Testing empty function name
[2020-05-24T11:28:46.414Z] Testing eval_args
[2020-05-24T11:28:46.414Z] Testing Ctrl-C cancellation. If this hangs, that's a bug!
[2020-05-24T11:28:46.414Z] Testing indents
[2020-05-24T11:28:46.414Z] Testing utf8
[2020-05-24T11:28:46.414Z] Testing future feature flags
[2020-05-24T11:28:46.414Z] Testing escape_sequences
[2020-05-24T11:28:46.414Z] Testing escaping strings as pcre2 literals
[2020-05-24T11:28:46.414Z] Testing LRU cache
[2020-05-24T11:28:46.414Z] Testing parameter expansion
[2020-05-24T11:28:46.414Z] Testing fuzzy string matching
[2020-05-24T11:28:46.414Z] Testing ifind
[2020-05-24T11:28:46.414Z] Testing ifind with fuzzy logic
[2020-05-24T11:28:46.414Z] Testing abbreviations
[2020-05-24T11:28:46.414Z] Testing test builtin
[2020-05-24T11:28:46.414Z] Testing fish_wcstod
[2020-05-24T11:28:46.414Z] Testing path functions
[2020-05-24T11:28:46.414Z] Testing pager navigation
[2020-05-24T11:28:46.414Z] Testing pager layout
[2020-05-24T11:28:46.414Z] Testing word motion
[2020-05-24T11:28:46.414Z] Testing is_potential_path
[2020-05-24T11:28:46.414Z] Testing colors
[2020-05-24T11:28:46.414Z] Testing complete
[2020-05-24T11:28:46.414Z] Testing autoload
[2020-05-24T11:28:46.414Z] Testing input
[2020-05-24T11:28:46.414Z] Testing fd_set
[2020-05-24T11:28:46.414Z] Testing line iterator
[2020-05-24T11:28:46.414Z] Testing universal variables
[2020-05-24T11:28:46.414Z] Testing universal variable output
[2020-05-24T11:28:46.414Z] Testing universal variable parsing
[2020-05-24T11:28:46.414Z] Testing universal variable legacy parsing
[2020-05-24T11:28:46.414Z] Testing universal callbacks
[2020-05-24T11:28:46.414Z] Testing universal format detection
[2020-05-24T11:28:46.414Z] Testing universal Ok to save
[2020-05-24T11:28:46.414Z] Testing universal notifiers with strategy 2
[2020-05-24T11:28:46.414Z] Testing completion insertions
[2020-05-24T11:28:46.414Z] Testing scenarios that should produce no autosuggestions
[2020-05-24T11:28:46.414Z] Testing autosuggestion combining
[2020-05-24T11:28:46.414Z] Testing history
[2020-05-24T11:28:46.414Z] Testing history merge
[2020-05-24T11:28:46.414Z] Testing history race conditions
[2020-05-24T11:28:46.414Z] Testing history_sample_fish_1_x
[2020-05-24T11:28:46.414Z] Testing history_sample_fish_2_0
[2020-05-24T11:28:46.414Z] Testing bash import
[2020-05-24T11:28:46.414Z] Testing history_sample_corrupt1
[2020-05-24T11:28:46.414Z] Testing builtin_string
[2020-05-24T11:28:46.414Z] Testing illegal command exit code
[2020-05-24T11:28:46.414Z] Testing maybe_t
[2020-05-24T11:28:46.414Z] Testing path normalization
[2020-05-24T11:28:46.414Z] Testing topic monitor
[2020-05-24T11:28:46.414Z] Torture-testing topic monitor
[2020-05-24T11:28:46.414Z] Encountered 0 errors in low-level tests
[2020-05-24T11:28:46.414Z] make[3]: Leaving directory '/build/fish/src/fish-3.1.2/build'
[2020-05-24T11:28:46.414Z] Built target serial_test_low_level
[2020-05-24T11:28:46.414Z] make[3]: Entering directory '/build/fish/src/fish-3.1.2/build'
[2020-05-24T11:28:46.414Z] Scanning dependencies of target serial_test_fishscript
[2020-05-24T11:28:46.414Z] make[3]: Leaving directory '/build/fish/src/fish-3.1.2/build'
[2020-05-24T11:28:46.414Z] make[3]: Entering directory '/build/fish/src/fish-3.1.2/build'
[2020-05-24T11:28:46.665Z] Testing high level script functionality
[2020-05-24T11:28:46.665Z] Testing file __fish_complete_directories.in ... ok (36 ms)
[2020-05-24T11:28:46.665Z] Testing file __fish_contains_opt.in ... ok (28 ms)
[2020-05-24T11:28:46.665Z] Testing file __fish_not_contain_opt.in ... ok (28 ms)
[2020-05-24T11:28:46.915Z] Testing file expansion.in ... ok (120 ms)
[2020-05-24T11:28:46.915Z] Testing file fish_opt.in ... ok (34 ms)
[2020-05-24T11:28:46.915Z] Testing file function.in ... ok (22 ms)
[2020-05-24T11:28:46.915Z] Testing file functions.in ... ok (27 ms)
[2020-05-24T11:28:46.915Z] Testing file history.in ... ok (39 ms)
[2020-05-24T11:28:47.165Z] Testing file indent.in ... ok (150 ms)
[2020-05-24T11:28:49.027Z] Testing file jobs.in ... ok (2025 ms)
[2020-05-24T11:28:49.027Z] Testing file line-continuation.in ... ok (8 ms)
[2020-05-24T11:28:49.277Z] Testing file locale.in ... ok (76 ms)
[2020-05-24T11:28:49.277Z] Testing file parameter_expansion.in ... ok (19 ms)
[2020-05-24T11:28:49.277Z] Testing file pipestatus.in ... ok (111 ms)
[2020-05-24T11:28:49.527Z] Testing file psub.in ... ok (114 ms)
[2020-05-24T11:28:49.528Z] Testing file random.in ... ok (107 ms)
[2020-05-24T11:28:49.778Z] Testing file read.in ... ok (97 ms)
[2020-05-24T11:28:49.778Z] Testing file set.in ... ok (36 ms)
[2020-05-24T11:28:49.778Z] Testing file status.in ... ok (19 ms)
[2020-05-24T11:28:49.778Z] Testing file test1.in ... ok (60 ms)
[2020-05-24T11:28:49.778Z] Testing file test2.in ... ok (17 ms)
[2020-05-24T11:28:49.778Z] Testing file test4.in ... ok (24 ms)
[2020-05-24T11:28:50.028Z] Testing file test5.in ... ok (26 ms)
[2020-05-24T11:28:50.028Z] Testing file test6.in ... ok (151 ms)
[2020-05-24T11:28:50.028Z] Testing file test7.in ... ok (42 ms)
[2020-05-24T11:28:50.279Z] Testing file test8.in ... ok (26 ms)
[2020-05-24T11:28:50.279Z] Testing file test9.in ... ok (125 ms)
[2020-05-24T11:28:50.279Z] Testing file test_builtinbuiltin.in ... ok (17 ms)
[2020-05-24T11:28:50.279Z] Testing file test_cmdsub.in ... ok (21 ms)
[2020-05-24T11:28:50.279Z] Testing file test_exec_fail.in ... ok (18 ms)
[2020-05-24T11:28:50.529Z] Testing file umask.in ... ok (121 ms)
[2020-05-24T11:28:50.529Z] Testing file vars_as_commands.in ... ok (18 ms)
[2020-05-24T11:28:50.529Z] Testing file while.in ... ok (20 ms)
[2020-05-24T11:28:50.529Z] Testing file zero_based_array.in ... ok (17 ms)
[2020-05-24T11:28:51.080Z] Testing file checks/abbr.fish ... ok (329 ms)
[2020-05-24T11:28:51.080Z] Testing file checks/alias.fish ... ok (197 ms)
[2020-05-24T11:28:51.330Z] Testing file checks/andandoror.fish ... ok (103 ms)
[2020-05-24T11:28:51.330Z] Testing file checks/andor.fish ... ok (98 ms)
[2020-05-24T11:28:51.581Z] Testing file checks/argparse.fish ... ok (151 ms)
[2020-05-24T11:28:51.581Z] Testing file checks/bad-option.fish ... ok (85 ms)
[2020-05-24T11:28:51.581Z] Testing file checks/bind.fish ... ok (101 ms)
[2020-05-24T11:28:51.831Z] Testing file checks/braces.fish ... ok (95 ms)
[2020-05-24T11:28:51.831Z] Testing file checks/broken-config.fish ... ok (129 ms)
[2020-05-24T11:28:52.081Z] Testing file checks/caller-observer.fish ... ok (101 ms)
[2020-05-24T11:28:53.425Z] Testing file checks/cd.fish ... ok (1353 ms)
[2020-05-24T11:28:53.425Z] Testing file checks/colon-delimited-var.fish ... ok (82 ms)
[2020-05-24T11:28:53.425Z] Testing file checks/command-1.fish ... ok (96 ms)
[2020-05-24T11:28:53.675Z] Testing file checks/command-2.fish ... ok (96 ms)
[2020-05-24T11:28:53.675Z] Testing file checks/command-vars-persist.fish ... ok (100 ms)
[2020-05-24T11:28:53.925Z] Testing file checks/complete.fish ... ok (155 ms)
[2020-05-24T11:28:53.925Z] Testing file checks/count.fish ... ok (134 ms)
[2020-05-24T11:28:54.176Z] Testing file checks/deep-cmdsub.fish ... ok (159 ms)
[2020-05-24T11:28:54.176Z] Testing file checks/directory-redirect.fish ... ok (96 ms)
[2020-05-24T11:28:55.087Z] Testing file checks/disown-parent.fish ... ok (599 ms)
[2020-05-24T11:28:55.087Z] Testing file checks/empty.fish ... ok (82 ms)
[2020-05-24T11:28:55.087Z] Testing file checks/env.fish ... ok (100 ms)
[2020-05-24T11:28:55.087Z] Testing file checks/eval.fish ... ok (100 ms)
[2020-05-24T11:28:55.337Z] Testing file checks/exit-status-with-closing-stderr.fish ... ok (94 ms)
[2020-05-24T11:28:55.337Z] Testing file checks/expansion.fish ... ok (119 ms)
[2020-05-24T11:28:55.587Z] Testing file checks/fds.fish ... ok (123 ms)
[2020-05-24T11:28:55.587Z] Testing file checks/features-nocaret1.fish ... ok (94 ms)
[2020-05-24T11:28:55.587Z] Testing file checks/features-nocaret2.fish ... ok (96 ms)
[2020-05-24T11:28:55.838Z] Testing file checks/features-nocaret3.fish ... ok (94 ms)
[2020-05-24T11:28:55.838Z] Testing file checks/features-nocaret4.fish ... ok (97 ms)
[2020-05-24T11:28:56.088Z] Testing file checks/features-nocaret5.fish ... ok (106 ms)
[2020-05-24T11:28:56.088Z] Testing file checks/features-qmark1.fish ... ok (100 ms)
[2020-05-24T11:28:56.088Z] Testing file checks/features-qmark2.fish ... ok (90 ms)
[2020-05-24T11:28:56.338Z] Testing file checks/features-string-backslashes-off.fish ... ok (97 ms)
[2020-05-24T11:28:56.338Z] Testing file checks/features-string-backslashes.fish ... ok (96 ms)
[2020-05-24T11:28:56.589Z] Testing file checks/for.fish ... ok (96 ms)
[2020-05-24T11:28:56.589Z] Testing file checks/function-definition.fish ... ok (83 ms)
[2020-05-24T11:28:56.589Z] Testing file checks/function.fish ... ok (88 ms)
[2020-05-24T11:28:56.839Z] Testing file checks/init-command-2.fish ... ok (71 ms)
[2020-05-24T11:28:56.839Z] Testing file checks/init-command-mix-ordering.fish ... ok (95 ms)
[2020-05-24T11:28:56.839Z] Testing file checks/init-command-mix.fish ... ok (97 ms)
[2020-05-24T11:28:57.090Z] Testing file checks/init-command.fish ... ok (96 ms)
[2020-05-24T11:28:57.090Z] Testing file checks/init-unreadable-cwd.fish ... ok (116 ms)
[2020-05-24T11:28:57.340Z] Testing file checks/interactive.fish ... ok (96 ms)
[2020-05-24T11:28:57.340Z] Testing file checks/invocation.fish ... ok (130 ms)
[2020-05-24T11:28:57.590Z] Testing file checks/job-ids.fish ... ok (100 ms)
[2020-05-24T11:28:57.590Z] Testing file checks/line-number.fish ... ok (103 ms)
[2020-05-24T11:28:57.590Z] Testing file checks/login-interactive.fish ... ok (100 ms)
[2020-05-24T11:28:57.841Z] Testing file checks/login.fish ... ok (97 ms)
[2020-05-24T11:28:57.841Z] Testing file checks/math.fish ... ok (104 ms)
[2020-05-24T11:28:58.091Z] Testing file checks/no-login-no-interactive.fish ... ok (79 ms)
[2020-05-24T11:28:58.091Z] Testing file checks/pipeline-pgroup.fish ... ok (110 ms)
[2020-05-24T11:28:58.091Z] Testing file checks/printf.fish ... ok (105 ms)
[2020-05-24T11:28:58.342Z] Testing file checks/rc-returned.fish ... ok (105 ms)
[2020-05-24T11:28:58.342Z] Testing file checks/read.fish ... ok (96 ms)
[2020-05-24T11:28:58.592Z] Testing file checks/realpath.fish ... ok (129 ms)
[2020-05-24T11:28:58.592Z] Testing file checks/redirect.fish ... ok (120 ms)
[2020-05-24T11:28:58.842Z] Testing file checks/self-signal-usr1.fish ... ok (101 ms)
[2020-05-24T11:28:59.393Z] Testing file checks/set.fish ... ok (582 ms)
[2020-05-24T11:28:59.393Z] Testing file checks/setenv.fish ... ok (115 ms)
[2020-05-24T11:28:59.944Z] Testing file checks/sigint.fish ... ok (347 ms)
[2020-05-24T11:28:59.944Z] Testing file checks/signal.fish ... Failure in checks/signal.fish:
[2020-05-24T11:28:59.944Z] 
[2020-05-24T11:28:59.944Z]   The CHECK on line 13 wants:
[2020-05-24T11:28:59.944Z]     129
[2020-05-24T11:28:59.944Z] 
[2020-05-24T11:28:59.944Z]   which failed to match line stdout:3:
[2020-05-24T11:28:59.944Z]     0
[2020-05-24T11:28:59.944Z] 
[2020-05-24T11:28:59.944Z]   when running command:
[2020-05-24T11:28:59.944Z]     ../test/root/bin/fish -C 'set -l fish ../test/root/bin/fish' checks/signal.fish
[2020-05-24T11:28:59.944Z] Testing file checks/stack-overflow.fish ... ok (109 ms)
[2020-05-24T11:29:00.194Z] Testing file checks/string.fish ... ok (134 ms)
[2020-05-24T11:29:00.194Z] Testing file checks/switch.fish ... ok (104 ms)
[2020-05-24T11:29:00.444Z] Testing file checks/test.fish ... ok (96 ms)
[2020-05-24T11:29:00.695Z] Testing file checks/threads.fish ... ok (197 ms)
[2020-05-24T11:29:00.695Z] Testing file checks/time.fish ... ok (127 ms)
[2020-05-24T11:29:00.945Z] Testing file checks/trace.fish ... ok (98 ms)
[2020-05-24T11:29:00.945Z] Testing file checks/variable-assignment.fish ... ok (110 ms)
[2020-05-24T11:29:00.945Z] Testing file checks/version.fish ... ok (85 ms)
[2020-05-24T11:29:01.196Z] Testing file checks/wildcard.fish ... ok (109 ms)
[2020-05-24T11:29:01.196Z] Testing file checks/wraps.fish ... ok (98 ms)
[2020-05-24T11:29:01.196Z] 1 test failed
[2020-05-24T11:29:01.196Z] make[3]: *** [CMakeFiles/serial_test_fishscript.dir/build.make:77: CMakeFiles/serial_test_fishscript] Error 1
[2020-05-24T11:29:01.196Z] make[3]: Leaving directory '/build/fish/src/fish-3.1.2/build'
[2020-05-24T11:29:01.196Z] make[2]: *** [CMakeFiles/Makefile2:1135: CMakeFiles/serial_test_fishscript.dir/all] Error 2
[2020-05-24T11:29:01.196Z] make[2]: Leaving directory '/build/fish/src/fish-3.1.2/build'
[2020-05-24T11:29:01.196Z] make[1]: *** [CMakeFiles/Makefile2:894: CMakeFiles/test.dir/rule] Error 2
[2020-05-24T11:29:01.196Z] make[1]: Leaving directory '/build/fish/src/fish-3.1.2/build'
[2020-05-24T11:29:01.196Z] make: *** [Makefile:535: test] Error 2
[2020-05-24T11:29:01.196Z] make: Leaving directory '/build/fish/src/fish-3.1.2/build'
[2020-05-24T11:29:01.196Z] ==> ERROR: A failure occurred in check().
[2020-05-24T11:29:01.196Z]     Aborting...
[2020-05-24T11:29:02.107Z] ==> ERROR: Build failed, check /build/buildpkg/default-x86_64/jenkins/build
[Pipeline] }
[Pipeline] // dir
Post stage
[Pipeline] emailext
[2020-05-24T11:29:02.231Z] Sending email to: artix-build-failures at artixlinux.org


More information about the artix-build-failures mailing list