[artix-build-failures] [galaxy] Failure: npm

jenkins at artixlinux.org jenkins at artixlinux.org
Wed May 20 17:31:19 CEST 2020


   Failure

   Build: repos/community-any

   Packages:

   [npm-6.14.5-1-any.pkg.tar.zst]

   authorName: alium

   authorEmail: alium at artixlinux.org

   [1]https://orion.artixlinux.org/job/packagesN/job/npm/job/master/17/

References

   1. https://orion.artixlinux.org/job/packagesN/job/npm/job/master/17/
-------------- next part --------------
Push event to branch master
Querying the current revision of branch master...
Current revision of branch master is 795921fc7a902f36363f3ae8b319fb4678841761
Obtained Jenkinsfile from 795921fc7a902f36363f3ae8b319fb4678841761
Running in Durability level: PERFORMANCE_OPTIMIZED
Loading library artix-ci at master
Attempting to resolve master from remote references...
 > git --version # timeout=10
 > git ls-remote -- https://gitea.artixlinux.org/artix/pipeline-libs.git # timeout=10
Found match: refs/heads/master revision 77f77ff85eedb6eb60b64faf8c328ab86dbb479c
Warning: CredentialId "gitea-ci" could not be found.
 > git rev-parse --is-inside-work-tree # timeout=10
Fetching changes from the remote Git repository
 > git config remote.origin.url https://gitea.artixlinux.org/artix/pipeline-libs.git # timeout=10
Fetching without tags
Fetching upstream changes from https://gitea.artixlinux.org/artix/pipeline-libs.git
 > git --version # timeout=10
 > git fetch --no-tags --force --progress -- https://gitea.artixlinux.org/artix/pipeline-libs.git +refs/heads/master:refs/remotes/origin/master # timeout=10
Checking out Revision 77f77ff85eedb6eb60b64faf8c328ab86dbb479c (master)
 > git config core.sparsecheckout # timeout=10
 > git checkout -f 77f77ff85eedb6eb60b64faf8c328ab86dbb479c # timeout=10
Commit message: "Notify: remove fail condition"
[Gitea] Notifying branch build status: PENDING Build started...
[Gitea] Notified
[Pipeline] Start of Pipeline
[Pipeline] node
Running on Jenkins in /build/jenkins/workspace/packagesN_npm_master
[Pipeline] {
[Pipeline] timestamps
[Pipeline] {
[Pipeline] stage
[Pipeline] { (Prepare)
[Pipeline] checkout
[2020-05-20T15:31:01.023Z] Warning: CredentialId "jenkins-ci" could not be found.
[2020-05-20T15:31:01.025Z]  > git rev-parse --is-inside-work-tree # timeout=10
[2020-05-20T15:31:01.030Z] Fetching changes from the remote Git repository
[2020-05-20T15:31:01.030Z]  > git config remote.origin.url https://237b7412742b4068af4173944de150f12959f4d3@gitea.artixlinux.org/packagesN/npm.git # timeout=10
[2020-05-20T15:31:01.040Z] Cleaning workspace
[2020-05-20T15:31:01.040Z]  > git rev-parse --verify HEAD # timeout=10
[2020-05-20T15:31:01.045Z] Resetting working tree
[2020-05-20T15:31:01.045Z]  > git reset --hard # timeout=10
[2020-05-20T15:31:01.052Z]  > git clean -fdx # timeout=10
[2020-05-20T15:31:01.057Z] Fetching without tags
[2020-05-20T15:31:01.057Z] Fetching upstream changes from https://237b7412742b4068af4173944de150f12959f4d3@gitea.artixlinux.org/packagesN/npm.git
[2020-05-20T15:31:01.057Z]  > git --version # timeout=10
[2020-05-20T15:31:01.062Z]  > git fetch --no-tags --force --progress -- https://237b7412742b4068af4173944de150f12959f4d3@gitea.artixlinux.org/packagesN/npm.git +refs/heads/master:refs/remotes/origin/master # timeout=10
[2020-05-20T15:31:01.205Z] Checking out Revision 795921fc7a902f36363f3ae8b319fb4678841761 (master)
[2020-05-20T15:31:01.205Z]  > git config core.sparsecheckout # timeout=10
[2020-05-20T15:31:01.210Z]  > git checkout -f 795921fc7a902f36363f3ae8b319fb4678841761 # timeout=10
[2020-05-20T15:31:01.219Z] Commit message: "[community] 'npm-6.14.5-1' modify"
[2020-05-20T15:31:01.220Z]  > git rev-list --no-walk 5b227ddb36da44282af61abb31b2b42aa84f8dc0 # timeout=10
[2020-05-20T15:31:01.237Z] [Gitea] Notifying branch build status: PENDING Build started...
[2020-05-20T15:31:01.404Z] [Gitea] Notified
[Pipeline] libraryResource
[Pipeline] readYaml
[Pipeline] sh
[2020-05-20T15:31:01.683Z] + git rev-parse @
[Pipeline] sh
[2020-05-20T15:31:01.941Z] + git show -s --format=%an 795921fc7a902f36363f3ae8b319fb4678841761
[Pipeline] sh
[2020-05-20T15:31:02.198Z] + git show -s --format=%ae 795921fc7a902f36363f3ae8b319fb4678841761
[Pipeline] sh
[2020-05-20T15:31:02.456Z] + git show --pretty=format: --name-status 795921fc7a902f36363f3ae8b319fb4678841761
[Pipeline] fileExists
[Pipeline] sh
[2020-05-20T15:31:02.723Z] + pkg2yaml repos/community-any
[Pipeline] readYaml
[Pipeline] }
[Pipeline] // stage
[Pipeline] stage
[Pipeline] { (Build)
[Pipeline] echo
[2020-05-20T15:31:02.835Z] isRebuild: false
[Pipeline] dir
[2020-05-20T15:31:02.840Z] Running in /build/jenkins/workspace/packagesN_npm_master/repos/community-any
[Pipeline] {
[Pipeline] sh
[2020-05-20T15:31:03.101Z] + buildpkg-galaxy
[2020-05-20T15:31:06.330Z] :: Synchronizing package databases...
[2020-05-20T15:31:06.330Z]  system is up to date
[2020-05-20T15:31:06.330Z]  world is up to date
[2020-05-20T15:31:06.330Z] downloading galaxy.db...
[2020-05-20T15:31:06.330Z]  extra is up to date
[2020-05-20T15:31:06.330Z]  community is up to date
[2020-05-20T15:31:06.330Z] :: Starting full system upgrade...
[2020-05-20T15:31:06.330Z]  there is nothing to do
[2020-05-20T15:31:07.241Z] ==> Building in chroot for [default] (x86_64)...
[2020-05-20T15:31:07.792Z] ==> Synchronizing chroot copy [/build/buildpkg/default-x86_64/root] -> [jenkins]...done
[2020-05-20T15:31:08.702Z] ==> Making package: npm 6.14.5-1 (Wed May 20 17:31:08 2020)
[2020-05-20T15:31:08.702Z] ==> Retrieving sources...
[2020-05-20T15:31:08.702Z]   -> Found npm-6.14.5.tar.gz
[2020-05-20T15:31:08.702Z] ==> Validating source files with sha512sums...
[2020-05-20T15:31:08.702Z]     npm-6.14.5.tar.gz ... Passed
[2020-05-20T15:31:12.824Z] ==> Making package: npm 6.14.5-1 (Wed 20 May 2020 03:31:12 PM UTC)
[2020-05-20T15:31:12.824Z] ==> Checking runtime dependencies...
[2020-05-20T15:31:12.824Z] ==> Installing missing dependencies...
[2020-05-20T15:31:13.374Z] resolving dependencies...
[2020-05-20T15:31:13.374Z] looking for conflicting packages...
[2020-05-20T15:31:13.374Z] 
[2020-05-20T15:31:13.374Z] Package (6)      New Version  Net Change
[2020-05-20T15:31:13.374Z] 
[2020-05-20T15:31:13.374Z] world/c-ares     1.16.1-1       0.19 MiB
[2020-05-20T15:31:13.374Z] system/libnsl    1.2.0-2        0.19 MiB
[2020-05-20T15:31:13.374Z] world/libuv      1.38.0-1       0.52 MiB
[2020-05-20T15:31:13.374Z] galaxy/node-gyp  6.1.0-1        6.35 MiB
[2020-05-20T15:31:13.374Z] galaxy/nodejs    14.3.0-1      26.85 MiB
[2020-05-20T15:31:13.374Z] galaxy/semver    7.3.2-1        0.08 MiB
[2020-05-20T15:31:13.374Z] 
[2020-05-20T15:31:13.374Z] Total Installed Size:  34.17 MiB
[2020-05-20T15:31:13.374Z] 
[2020-05-20T15:31:13.374Z] :: Proceed with installation? [Y/n] 
[2020-05-20T15:31:13.374Z] checking keyring...
[2020-05-20T15:31:13.374Z] checking package integrity...
[2020-05-20T15:31:13.625Z] loading package files...
[2020-05-20T15:31:13.625Z] checking for file conflicts...
[2020-05-20T15:31:13.625Z] checking available disk space...
[2020-05-20T15:31:13.625Z] :: Processing package changes...
[2020-05-20T15:31:13.625Z] installing libnsl...
[2020-05-20T15:31:13.625Z] installing libuv...
[2020-05-20T15:31:13.625Z] installing c-ares...
[2020-05-20T15:31:13.625Z] installing nodejs...
[2020-05-20T15:31:13.875Z] Optional dependencies for nodejs
[2020-05-20T15:31:13.875Z]     npm: nodejs package manager
[2020-05-20T15:31:13.875Z] installing semver...
[2020-05-20T15:31:13.875Z] installing node-gyp...
[2020-05-20T15:31:13.875Z] ==> Checking buildtime dependencies...
[2020-05-20T15:31:13.875Z] ==> Installing missing dependencies...
[2020-05-20T15:31:14.426Z] :: There are 2 providers available for libgl:
[2020-05-20T15:31:14.426Z] :: Repository world
[2020-05-20T15:31:14.426Z]    1) libglvnd
[2020-05-20T15:31:14.426Z] :: Repository extra
[2020-05-20T15:31:14.426Z]    2) libglvnd
[2020-05-20T15:31:14.426Z] 
[2020-05-20T15:31:14.426Z] Enter a number (default=1): 
[2020-05-20T15:31:14.426Z] resolving dependencies...
[2020-05-20T15:31:14.426Z] looking for conflicting packages...
[2020-05-20T15:31:14.426Z] warning: dependency cycle detected:
[2020-05-20T15:31:14.426Z] warning: mesa will be installed before its libglvnd dependency
[2020-05-20T15:31:14.426Z] 
[2020-05-20T15:31:14.426Z] Package (26)             New Version     Net Change  Download Size
[2020-05-20T15:31:14.426Z] 
[2020-05-20T15:31:14.426Z] world/libdrm             2.4.101-1         0.92 MiB       0.24 MiB
[2020-05-20T15:31:14.426Z] system/libedit           20191231_3.1-1    0.25 MiB       0.10 MiB
[2020-05-20T15:31:14.426Z] world/libomxil-bellagio  0.9.3-3           0.58 MiB       0.12 MiB
[2020-05-20T15:31:14.426Z] world/libpciaccess       0.16-2            0.06 MiB       0.02 MiB
[2020-05-20T15:31:14.426Z] world/libunwind          1.3.1-2           0.26 MiB       0.11 MiB
[2020-05-20T15:31:14.426Z] world/libx11             1.6.9-7          10.15 MiB       2.07 MiB
[2020-05-20T15:31:14.426Z] world/libxau             1.0.9-3           0.02 MiB       0.01 MiB
[2020-05-20T15:31:14.426Z] world/libxcb             1.14-1            3.73 MiB       0.95 MiB
[2020-05-20T15:31:14.426Z] world/libxdamage         1.1.5-3           0.02 MiB       0.01 MiB
[2020-05-20T15:31:14.426Z] world/libxdmcp           1.1.3-3           0.13 MiB       0.03 MiB
[2020-05-20T15:31:14.426Z] world/libxext            1.3.4-3           0.30 MiB       0.10 MiB
[2020-05-20T15:31:14.426Z] world/libxfixes          5.0.3-4           0.04 MiB       0.01 MiB
[2020-05-20T15:31:14.426Z] world/libxshmfence       1.3-2             0.02 MiB       0.01 MiB
[2020-05-20T15:31:14.426Z] world/libxxf86vm         1.1.4-4           0.03 MiB       0.02 MiB
[2020-05-20T15:31:14.426Z] world/llvm-libs          10.0.0-2         83.94 MiB      21.24 MiB
[2020-05-20T15:31:14.426Z] world/lm_sensors         3.6.0-2           0.47 MiB       0.13 MiB
[2020-05-20T15:31:14.426Z] world/mesa               20.0.7-2         81.48 MiB      11.47 MiB
[2020-05-20T15:31:14.426Z] world/wayland            1.18.0-2          0.73 MiB       0.12 MiB
[2020-05-20T15:31:14.426Z] world/xcb-proto          1.14-1            0.83 MiB       0.10 MiB
[2020-05-20T15:31:14.426Z] world/xorgproto          2020.1-1          1.40 MiB       0.22 MiB
[2020-05-20T15:31:14.426Z] world/libglvnd           1.3.1-1           3.67 MiB       0.30 MiB
[2020-05-20T15:31:14.426Z] world/libxi              1.7.10-3          0.47 MiB       0.14 MiB
[2020-05-20T15:31:14.426Z] galaxy/marked            1.1.0-1           0.22 MiB       0.04 MiB
[2020-05-20T15:31:14.426Z] galaxy/marked-man        0.7.0-3           0.02 MiB       0.01 MiB
[2020-05-20T15:31:14.426Z] system/procps-ng         3.3.16-1          1.34 MiB       0.33 MiB
[2020-05-20T15:31:14.426Z] world/python             3.8.3-1          77.54 MiB               
[2020-05-20T15:31:14.426Z] 
[2020-05-20T15:31:14.426Z] Total Download Size:    37.89 MiB
[2020-05-20T15:31:14.426Z] Total Installed Size:  268.63 MiB
[2020-05-20T15:31:14.426Z] 
[2020-05-20T15:31:14.426Z] :: Proceed with installation? [Y/n] 
[2020-05-20T15:31:14.426Z] :: Retrieving packages...
[2020-05-20T15:31:14.426Z] downloading libedit-20191231_3.1-1-x86_64.pkg.tar.xz...
[2020-05-20T15:31:14.426Z] downloading procps-ng-3.3.16-1-x86_64.pkg.tar.xz...
[2020-05-20T15:31:14.426Z] downloading xcb-proto-1.14-1-any.pkg.tar.xz...
[2020-05-20T15:31:14.426Z] downloading libxdmcp-1.1.3-3-x86_64.pkg.tar.zst...
[2020-05-20T15:31:14.426Z] downloading libxau-1.0.9-3-x86_64.pkg.tar.zst...
[2020-05-20T15:31:14.426Z] downloading libxcb-1.14-1-x86_64.pkg.tar.xz...
[2020-05-20T15:31:14.426Z] downloading xorgproto-2020.1-1-any.pkg.tar.xz...
[2020-05-20T15:31:14.426Z] downloading libx11-1.6.9-7-x86_64.pkg.tar.zst...
[2020-05-20T15:31:14.426Z] downloading libxext-1.3.4-3-x86_64.pkg.tar.zst...
[2020-05-20T15:31:14.426Z] downloading libpciaccess-0.16-2-x86_64.pkg.tar.zst...
[2020-05-20T15:31:14.426Z] downloading libdrm-2.4.101-1-x86_64.pkg.tar.xz...
[2020-05-20T15:31:14.426Z] downloading wayland-1.18.0-2-x86_64.pkg.tar.xz...
[2020-05-20T15:31:14.426Z] downloading libxxf86vm-1.1.4-4-x86_64.pkg.tar.zst...
[2020-05-20T15:31:14.426Z] downloading libxfixes-5.0.3-4-x86_64.pkg.tar.zst...
[2020-05-20T15:31:14.426Z] downloading libxdamage-1.1.5-3-x86_64.pkg.tar.zst...
[2020-05-20T15:31:14.426Z] downloading libxshmfence-1.3-2-x86_64.pkg.tar.xz...
[2020-05-20T15:31:14.426Z] downloading libomxil-bellagio-0.9.3-3-x86_64.pkg.tar.zst...
[2020-05-20T15:31:14.426Z] downloading libunwind-1.3.1-2-x86_64.pkg.tar.zst...
[2020-05-20T15:31:14.426Z] downloading llvm-libs-10.0.0-2-x86_64.pkg.tar.zst...
[2020-05-20T15:31:14.426Z] downloading lm_sensors-3.6.0-2-x86_64.pkg.tar.zst...
[2020-05-20T15:31:14.426Z] downloading mesa-20.0.7-2-x86_64.pkg.tar.zst...
[2020-05-20T15:31:14.426Z] downloading libglvnd-1.3.1-1-x86_64.pkg.tar.xz...
[2020-05-20T15:31:14.426Z] downloading libxi-1.7.10-3-x86_64.pkg.tar.zst...
[2020-05-20T15:31:14.676Z] downloading marked-1.1.0-1-any.pkg.tar.zst...
[2020-05-20T15:31:14.676Z] downloading marked-man-0.7.0-3-any.pkg.tar.xz...
[2020-05-20T15:31:14.676Z] checking keyring...
[2020-05-20T15:31:14.676Z] checking package integrity...
[2020-05-20T15:31:16.537Z] loading package files...
[2020-05-20T15:31:16.537Z] checking for file conflicts...
[2020-05-20T15:31:16.537Z] checking available disk space...
[2020-05-20T15:31:16.537Z] :: Processing package changes...
[2020-05-20T15:31:16.538Z] installing xcb-proto...
[2020-05-20T15:31:16.788Z] installing libxdmcp...
[2020-05-20T15:31:16.788Z] installing libxau...
[2020-05-20T15:31:16.788Z] installing libxcb...
[2020-05-20T15:31:16.788Z] installing xorgproto...
[2020-05-20T15:31:16.788Z] installing libx11...
[2020-05-20T15:31:17.038Z] installing libxext...
[2020-05-20T15:31:17.038Z] installing libpciaccess...
[2020-05-20T15:31:17.038Z] installing libdrm...
[2020-05-20T15:31:17.038Z] installing wayland...
[2020-05-20T15:31:17.038Z] installing libxxf86vm...
[2020-05-20T15:31:17.038Z] installing libxfixes...
[2020-05-20T15:31:17.038Z] installing libxdamage...
[2020-05-20T15:31:17.038Z] installing libxshmfence...
[2020-05-20T15:31:17.038Z] installing libomxil-bellagio...
[2020-05-20T15:31:17.038Z] installing libunwind...
[2020-05-20T15:31:17.038Z] installing libedit...
[2020-05-20T15:31:17.038Z] installing llvm-libs...
[2020-05-20T15:31:17.288Z] installing lm_sensors...
[2020-05-20T15:31:17.288Z] Optional dependencies for lm_sensors
[2020-05-20T15:31:17.288Z]     rrdtool: for logging with sensord
[2020-05-20T15:31:17.288Z] installing mesa...
[2020-05-20T15:31:17.539Z] Optional dependencies for mesa
[2020-05-20T15:31:17.539Z]     opengl-man-pages: for the OpenGL API man pages
[2020-05-20T15:31:17.539Z]     mesa-vdpau: for accelerated video playback
[2020-05-20T15:31:17.539Z]     libva-mesa-driver: for accelerated video playback
[2020-05-20T15:31:17.539Z] installing libglvnd...
[2020-05-20T15:31:17.539Z] installing libxi...
[2020-05-20T15:31:17.539Z] installing marked...
[2020-05-20T15:31:17.539Z] installing marked-man...
[2020-05-20T15:31:17.539Z] installing procps-ng...
[2020-05-20T15:31:17.539Z] installing python...
[2020-05-20T15:31:17.789Z] Optional dependencies for python
[2020-05-20T15:31:17.789Z]     python-setuptools
[2020-05-20T15:31:17.789Z]     python-pip
[2020-05-20T15:31:17.789Z]     sqlite [installed]
[2020-05-20T15:31:17.789Z]     mpdecimal: for decimal
[2020-05-20T15:31:17.789Z]     xz: for lzma [installed]
[2020-05-20T15:31:17.789Z]     tk: for tkinter
[2020-05-20T15:31:18.039Z] ==> Retrieving sources...
[2020-05-20T15:31:18.039Z]   -> Found npm-6.14.5.tar.gz
[2020-05-20T15:31:18.039Z] ==> WARNING: Skipping all source file integrity checks.
[2020-05-20T15:31:18.039Z] ==> Extracting sources...
[2020-05-20T15:31:18.039Z]   -> Extracting npm-6.14.5.tar.gz with bsdtar
[2020-05-20T15:31:18.290Z] ==> Starting prepare()...
[2020-05-20T15:31:18.290Z] ==> Starting build()...
[2020-05-20T15:31:18.540Z] node scripts/docs-build.js docs/content/cli-commands/npm.md man/man1/npm.1
[2020-05-20T15:31:18.540Z] node scripts/docs-build.js docs/content/cli-commands/npm-whoami.md man/man1/npm-whoami.1
[2020-05-20T15:31:18.540Z] node scripts/docs-build.js docs/content/cli-commands/npm-view.md man/man1/npm-view.1
[2020-05-20T15:31:18.540Z] node scripts/docs-build.js docs/content/cli-commands/npm-version.md man/man1/npm-version.1
[2020-05-20T15:31:18.540Z] node scripts/docs-build.js docs/content/cli-commands/npm-token.md man/man1/npm-token.1
[2020-05-20T15:31:18.540Z] node scripts/docs-build.js docs/content/cli-commands/npm-update.md man/man1/npm-update.1
[2020-05-20T15:31:18.540Z] node scripts/docs-build.js docs/content/cli-commands/npm-unpublish.md man/man1/npm-unpublish.1
[2020-05-20T15:31:18.540Z] node scripts/docs-build.js docs/content/cli-commands/npm-uninstall.md man/man1/npm-uninstall.1
[2020-05-20T15:31:18.540Z] node scripts/docs-build.js docs/content/cli-commands/npm-test.md man/man1/npm-test.1
[2020-05-20T15:31:18.540Z] node scripts/docs-build.js docs/content/cli-commands/npm-team.md man/man1/npm-team.1
[2020-05-20T15:31:18.540Z] node scripts/docs-build.js docs/content/cli-commands/npm-stop.md man/man1/npm-stop.1
[2020-05-20T15:31:18.540Z] node scripts/docs-build.js docs/content/cli-commands/npm-start.md man/man1/npm-start.1
[2020-05-20T15:31:18.540Z] node scripts/docs-build.js docs/content/cli-commands/npm-stars.md man/man1/npm-stars.1
[2020-05-20T15:31:18.540Z] node scripts/docs-build.js docs/content/cli-commands/npm-star.md man/man1/npm-star.1
[2020-05-20T15:31:18.540Z] node scripts/docs-build.js docs/content/cli-commands/npm-shrinkwrap.md man/man1/npm-shrinkwrap.1
[2020-05-20T15:31:18.540Z] node scripts/docs-build.js docs/content/cli-commands/npm-search.md man/man1/npm-search.1
[2020-05-20T15:31:18.540Z] node scripts/docs-build.js docs/content/cli-commands/npm-run-script.md man/man1/npm-run-script.1
[2020-05-20T15:31:18.540Z] node scripts/docs-build.js docs/content/cli-commands/npm-root.md man/man1/npm-root.1
[2020-05-20T15:31:18.540Z] node scripts/docs-build.js docs/content/cli-commands/npm-restart.md man/man1/npm-restart.1
[2020-05-20T15:31:18.540Z] node scripts/docs-build.js docs/content/cli-commands/npm-rebuild.md man/man1/npm-rebuild.1
[2020-05-20T15:31:18.540Z] node scripts/docs-build.js docs/content/cli-commands/npm-repo.md man/man1/npm-repo.1
[2020-05-20T15:31:18.540Z] node scripts/docs-build.js docs/content/cli-commands/npm-publish.md man/man1/npm-publish.1
[2020-05-20T15:31:18.540Z] node scripts/docs-build.js docs/content/cli-commands/npm-profile.md man/man1/npm-profile.1
[2020-05-20T15:31:18.540Z] node scripts/docs-build.js docs/content/cli-commands/npm-prune.md man/man1/npm-prune.1
[2020-05-20T15:31:18.540Z] /usr/lib/node_modules/marked-man/lib/marked-man.js:8
[2020-05-20T15:31:18.540Z] InlineLexer.prototype.html_output = InlineLexer.prototype.output;
[2020-05-20T15:31:18.540Z]             ^
[2020-05-20T15:31:18.540Z] 
[2020-05-20T15:31:18.540Z] TypeError: Cannot read property 'prototype' of undefined
[2020-05-20T15:31:18.540Z]     at Object.<anonymous> (/usr/lib/node_modules/marked-man/lib/marked-man.js:8:13)
[2020-05-20T15:31:18.540Z]     at Module._compile (internal/modules/cjs/loader.js:1200:30)
[2020-05-20T15:31:18.540Z]     at Object.Module._extensions..js (internal/modules/cjs/loader.js:1220:10)
[2020-05-20T15:31:18.540Z]     at Module.load (internal/modules/cjs/loader.js:1049:32)
[2020-05-20T15:31:18.540Z]     at Function.Module._load (internal/modules/cjs/loader.js:937:14)
[2020-05-20T15:31:18.540Z]     at Module.require (internal/modules/cjs/loader.js:1089:19)
[2020-05-20T15:31:18.540Z]     at require (internal/modules/cjs/helpers.js:73:18)
[2020-05-20T15:31:18.540Z]     at Object.<anonymous> (/build/npm/src/cli-6.14.5/scripts/docs-build.js:4:14)
[2020-05-20T15:31:18.540Z]     at Module._compile (internal/modules/cjs/loader.js:1200:30)
[2020-05-20T15:31:18.540Z]     at Object.Module._extensions..js (internal/modules/cjs/loader.js:1220:10)
[2020-05-20T15:31:18.540Z] /usr/lib/node_modules/marked-man/lib/marked-man.js:8
[2020-05-20T15:31:18.540Z] InlineLexer.prototype.html_output = InlineLexer.prototype.output;
[2020-05-20T15:31:18.540Z]             ^
[2020-05-20T15:31:18.540Z] 
[2020-05-20T15:31:18.540Z] TypeError: Cannot read property 'prototype' of undefined
[2020-05-20T15:31:18.540Z]     at Object.<anonymous> (/usr/lib/node_modules/marked-man/lib/marked-man.js:8:13)
[2020-05-20T15:31:18.540Z]     at Module._compile (internal/modules/cjs/loader.js:1200:30)
[2020-05-20T15:31:18.540Z]     at Object.Module._extensions..js (internal/modules/cjs/loader.js:1220:10)
[2020-05-20T15:31:18.540Z]     at Module.load (internal/modules/cjs/loader.js:1049:32)
[2020-05-20T15:31:18.540Z]     at Function.Module._load (internal/modules/cjs/loader.js:937:14)
[2020-05-20T15:31:18.540Z]     at Module.require (internal/modules/cjs/loader.js:1089:19)
[2020-05-20T15:31:18.540Z]     at require (internal/modules/cjs/helpers.js:73:18)
[2020-05-20T15:31:18.540Z]     at Object.<anonymous> (/build/npm/src/cli-6.14.5/scripts/docs-build.js:4:14)
[2020-05-20T15:31:18.540Z]     at Module._compile (internal/modules/cjs/loader.js:1200:30)
[2020-05-20T15:31:18.540Z]     at Object.Module._extensions..js (internal/modules/cjs/loader.js:1220:10)
[2020-05-20T15:31:18.540Z] /usr/lib/node_modules/marked-man/lib/marked-man.js:8
[2020-05-20T15:31:18.540Z] InlineLexer.prototype.html_output = InlineLexer.prototype.output;
[2020-05-20T15:31:18.540Z]             ^
[2020-05-20T15:31:18.540Z] 
[2020-05-20T15:31:18.540Z] TypeError: Cannot read property 'prototype' of undefined
[2020-05-20T15:31:18.540Z]     at Object.<anonymous> (/usr/lib/node_modules/marked-man/lib/marked-man.js:8:13)
[2020-05-20T15:31:18.540Z]     at Module._compile (internal/modules/cjs/loader.js:1200:30)
[2020-05-20T15:31:18.540Z]     at Object.Module._extensions..js (internal/modules/cjs/loader.js:1220:10)
[2020-05-20T15:31:18.540Z]     at Module.load (internal/modules/cjs/loader.js:1049:32)
[2020-05-20T15:31:18.540Z]     at Function.Module._load (internal/modules/cjs/loader.js:937:14)
[2020-05-20T15:31:18.541Z]     at Module.require (internal/modules/cjs/loader.js:1089:19)
[2020-05-20T15:31:18.541Z]     at require (internal/modules/cjs/helpers.js:73:18)
[2020-05-20T15:31:18.541Z]     at Object.<anonymous> (/build/npm/src/cli-6.14.5/scripts/docs-build.js:4:14)
[2020-05-20T15:31:18.541Z]     at Module._compile (internal/modules/cjs/loader.js:1200:30)
[2020-05-20T15:31:18.541Z]     at Object.Module._extensions..js (internal/modules/cjs/loader.js:1220:10)
[2020-05-20T15:31:18.541Z] make: *** [Makefile:85: man/man1/npm-version.1] Error 1
[2020-05-20T15:31:18.541Z] make: *** Waiting for unfinished jobs....
[2020-05-20T15:31:18.541Z] /usr/lib/node_modules/marked-man/lib/marked-man.js:8
[2020-05-20T15:31:18.541Z] InlineLexer.prototype.html_output = InlineLexer.prototype.output;
[2020-05-20T15:31:18.541Z]             ^
[2020-05-20T15:31:18.541Z] 
[2020-05-20T15:31:18.541Z] TypeError: Cannot read property 'prototype' of undefined
[2020-05-20T15:31:18.541Z]     at Object.<anonymous> (/usr/lib/node_modules/marked-man/lib/marked-man.js:8:13)
[2020-05-20T15:31:18.541Z]     at Module._compile (internal/modules/cjs/loader.js:1200:30)
[2020-05-20T15:31:18.541Z]     at Object.Module._extensions..js (internal/modules/cjs/loader.js:1220:10)
[2020-05-20T15:31:18.541Z]     at Module.load (internal/modules/cjs/loader.js:1049:32)
[2020-05-20T15:31:18.541Z]     at Function.Module._load (internal/modules/cjs/loader.js:937:14)
[2020-05-20T15:31:18.541Z]     at Module.require (internal/modules/cjs/loader.js:1089:19)
[2020-05-20T15:31:18.541Z]     at require (internal/modules/cjs/helpers.js:73:18)
[2020-05-20T15:31:18.541Z]     at Object.<anonymous> (/build/npm/src/cli-6.14.5/scripts/docs-build.js:4:14)
[2020-05-20T15:31:18.541Z]     at Module._compile (internal/modules/cjs/loader.js:1200:30)
[2020-05-20T15:31:18.541Z]     at Object.Module._extensions..js (internal/modules/cjs/loader.js:1220:10)
[2020-05-20T15:31:18.541Z] make: *** [Makefile:85: man/man1/npm-shrinkwrap.1] Error 1
[2020-05-20T15:31:18.541Z] make: *** [Makefile:85: man/man1/npm-run-script.1] Error 1
[2020-05-20T15:31:18.541Z] /usr/lib/node_modules/marked-man/lib/marked-man.js:8
[2020-05-20T15:31:18.541Z] InlineLexer.prototype.html_output = InlineLexer.prototype.output;
[2020-05-20T15:31:18.541Z]             ^
[2020-05-20T15:31:18.541Z] 
[2020-05-20T15:31:18.541Z] TypeError: Cannot read property 'prototype' of undefined
[2020-05-20T15:31:18.541Z]     at Object.<anonymous> (/usr/lib/node_modules/marked-man/lib/marked-man.js:8:13)
[2020-05-20T15:31:18.541Z]     at Module._compile (internal/modules/cjs/loader.js:1200:30)
[2020-05-20T15:31:18.541Z]     at Object.Module._extensions..js (internal/modules/cjs/loader.js:1220:10)
[2020-05-20T15:31:18.541Z]     at Module.load (internal/modules/cjs/loader.js:1049:32)
[2020-05-20T15:31:18.541Z]     at Function.Module._load (internal/modules/cjs/loader.js:937:14)
[2020-05-20T15:31:18.541Z]     at Module.require (internal/modules/cjs/loader.js:1089:19)
[2020-05-20T15:31:18.541Z]     at require (internal/modules/cjs/helpers.js:73:18)
[2020-05-20T15:31:18.541Z]     at Object.<anonymous> (/build/npm/src/cli-6.14.5/scripts/docs-build.js:4:14)
[2020-05-20T15:31:18.541Z]     at Module._compile (internal/modules/cjs/loader.js:1200:30)
[2020-05-20T15:31:18.541Z]     at Object.Module._extensions..js (internal/modules/cjs/loader.js:1220:10)
[2020-05-20T15:31:18.541Z] /usr/lib/node_modules/marked-man/lib/marked-man.js:8
[2020-05-20T15:31:18.541Z] InlineLexer.prototype.html_output = InlineLexer.prototype.output;
[2020-05-20T15:31:18.541Z]             ^
[2020-05-20T15:31:18.541Z] 
[2020-05-20T15:31:18.541Z] TypeError: Cannot read property 'prototype' of undefined
[2020-05-20T15:31:18.541Z]     at Object.<anonymous> (/usr/lib/node_modules/marked-man/lib/marked-man.js:8:13)
[2020-05-20T15:31:18.541Z]     at Module._compile (internal/modules/cjs/loader.js:1200:30)
[2020-05-20T15:31:18.541Z]     at Object.Module._extensions..js (internal/modules/cjs/loader.js:1220:10)
[2020-05-20T15:31:18.541Z]     at Module.load (internal/modules/cjs/loader.js:1049:32)
[2020-05-20T15:31:18.541Z]     at Function.Module._load (internal/modules/cjs/loader.js:937:14)
[2020-05-20T15:31:18.541Z]     at Module.require (internal/modules/cjs/loader.js:1089:19)
[2020-05-20T15:31:18.541Z]     at require (internal/modules/cjs/helpers.js:73:18)
[2020-05-20T15:31:18.541Z]     at Object.<anonymous> (/build/npm/src/cli-6.14.5/scripts/docs-build.js:4:14)
[2020-05-20T15:31:18.541Z]     at Module._compile (internal/modules/cjs/loader.js:1200:30)
[2020-05-20T15:31:18.541Z]     at Object.Module._extensions..js (internal/modules/cjs/loader.js:1220:10)
[2020-05-20T15:31:18.541Z] /usr/lib/node_modules/marked-man/lib/marked-man.js:8
[2020-05-20T15:31:18.541Z] InlineLexer.prototype.html_output = InlineLexer.prototype.output;
[2020-05-20T15:31:18.541Z]             ^
[2020-05-20T15:31:18.541Z] 
[2020-05-20T15:31:18.541Z] TypeError: Cannot read property 'prototype' of undefined
[2020-05-20T15:31:18.541Z]     at Object.<anonymous> (/usr/lib/node_modules/marked-man/lib/marked-man.js:8:13)
[2020-05-20T15:31:18.541Z]     at Module._compile (internal/modules/cjs/loader.js:1200:30)
[2020-05-20T15:31:18.541Z]     at Object.Module._extensions..js (internal/modules/cjs/loader.js:1220:10)
[2020-05-20T15:31:18.541Z]     at Module.load (internal/modules/cjs/loader.js:1049:32)
[2020-05-20T15:31:18.541Z]     at Function.Module._load (internal/modules/cjs/loader.js:937:14)
[2020-05-20T15:31:18.541Z]     at Module.require (internal/modules/cjs/loader.js:1089:19)
[2020-05-20T15:31:18.541Z]     at require (internal/modules/cjs/helpers.js:73:18)
[2020-05-20T15:31:18.541Z]     at Object.<anonymous> (/build/npm/src/cli-6.14.5/scripts/docs-build.js:4:14)
[2020-05-20T15:31:18.541Z]     at Module._compile (internal/modules/cjs/loader.js:1200:30)
[2020-05-20T15:31:18.541Z]     at Object.Module._extensions..js (internal/modules/cjs/loader.js:1220:10)
[2020-05-20T15:31:18.541Z] /usr/lib/node_modules/marked-man/lib/marked-man.js:8
[2020-05-20T15:31:18.541Z] InlineLexer.prototype.html_output = InlineLexer.prototype.output;
[2020-05-20T15:31:18.541Z]             ^
[2020-05-20T15:31:18.541Z] 
[2020-05-20T15:31:18.541Z] TypeError: Cannot read property 'prototype' of undefined
[2020-05-20T15:31:18.541Z]     at Object.<anonymous> (/usr/lib/node_modules/marked-man/lib/marked-man.js:8:13)
[2020-05-20T15:31:18.541Z]     at Module._compile (internal/modules/cjs/loader.js:1200:30)
[2020-05-20T15:31:18.541Z]     at Object.Module._extensions..js (internal/modules/cjs/loader.js:1220:10)
[2020-05-20T15:31:18.541Z]     at Module.load (internal/modules/cjs/loader.js:1049:32)
[2020-05-20T15:31:18.541Z]     at Function.Module._load (internal/modules/cjs/loader.js:937:14)
[2020-05-20T15:31:18.541Z]     at Module.require (internal/modules/cjs/loader.js:1089:19)
[2020-05-20T15:31:18.541Z]     at require (internal/modules/cjs/helpers.js:73:18)
[2020-05-20T15:31:18.541Z]     at Object.<anonymous> (/build/npm/src/cli-6.14.5/scripts/docs-build.js:4:14)
[2020-05-20T15:31:18.541Z]     at Module._compile (internal/modules/cjs/loader.js:1200:30)
[2020-05-20T15:31:18.541Z]     at Object.Module._extensions..js (internal/modules/cjs/loader.js:1220:10)
[2020-05-20T15:31:18.541Z] make: *** [Makefile:85: man/man1/npm-start.1] Error 1
[2020-05-20T15:31:18.541Z] make: *** [Makefile:85: man/man1/npm-stars.1] Error 1
[2020-05-20T15:31:18.541Z] make: *** [Makefile:85: man/man1/npm-restart.1] Error 1
[2020-05-20T15:31:18.541Z] make: *** [Makefile:85: man/man1/npm-team.1] Error 1
[2020-05-20T15:31:18.541Z] make: *** [Makefile:85: man/man1/npm-profile.1] Error 1
[2020-05-20T15:31:18.541Z] /usr/lib/node_modules/marked-man/lib/marked-man.js:8
[2020-05-20T15:31:18.541Z] InlineLexer.prototype.html_output = InlineLexer.prototype.output;
[2020-05-20T15:31:18.541Z]             ^
[2020-05-20T15:31:18.541Z] 
[2020-05-20T15:31:18.541Z] TypeError: Cannot read property 'prototype' of undefined
[2020-05-20T15:31:18.541Z]     at Object.<anonymous> (/usr/lib/node_modules/marked-man/lib/marked-man.js:8:13)
[2020-05-20T15:31:18.541Z]     at Module._compile (internal/modules/cjs/loader.js:1200:30)
[2020-05-20T15:31:18.541Z]     at Object.Module._extensions..js (internal/modules/cjs/loader.js:1220:10)
[2020-05-20T15:31:18.541Z]     at Module.load (internal/modules/cjs/loader.js:1049:32)
[2020-05-20T15:31:18.541Z]     at Function.Module._load (internal/modules/cjs/loader.js:937:14)
[2020-05-20T15:31:18.541Z]     at Module.require (internal/modules/cjs/loader.js:1089:19)
[2020-05-20T15:31:18.541Z]     at require (internal/modules/cjs/helpers.js:73:18)
[2020-05-20T15:31:18.541Z]     at Object.<anonymous> (/build/npm/src/cli-6.14.5/scripts/docs-build.js:4:14)
[2020-05-20T15:31:18.541Z]     at Module._compile (internal/modules/cjs/loader.js:1200:30)
[2020-05-20T15:31:18.541Z]     at Object.Module._extensions..js (internal/modules/cjs/loader.js:1220:10)
[2020-05-20T15:31:18.541Z] make: *** [Makefile:85: man/man1/npm-test.1] Error 1
[2020-05-20T15:31:18.541Z] /usr/lib/node_modules/marked-man/lib/marked-man.js:8
[2020-05-20T15:31:18.541Z] InlineLexer.prototype.html_output = InlineLexer.prototype.output;
[2020-05-20T15:31:18.541Z]             ^
[2020-05-20T15:31:18.541Z] 
[2020-05-20T15:31:18.541Z] TypeError: Cannot read property 'prototype' of undefined
[2020-05-20T15:31:18.541Z]     at Object.<anonymous> (/usr/lib/node_modules/marked-man/lib/marked-man.js:8:13)
[2020-05-20T15:31:18.541Z]     at Module._compile (internal/modules/cjs/loader.js:1200:30)
[2020-05-20T15:31:18.541Z]     at Object.Module._extensions..js (internal/modules/cjs/loader.js:1220:10)
[2020-05-20T15:31:18.541Z]     at Module.load (internal/modules/cjs/loader.js:1049:32)
[2020-05-20T15:31:18.541Z]     at Function.Module._load (internal/modules/cjs/loader.js:937:14)
[2020-05-20T15:31:18.541Z]     at Module.require (internal/modules/cjs/loader.js:1089:19)
[2020-05-20T15:31:18.541Z]     at require (internal/modules/cjs/helpers.js:73:18)
[2020-05-20T15:31:18.541Z]     at Object.<anonymous> (/build/npm/src/cli-6.14.5/scripts/docs-build.js:4:14)
[2020-05-20T15:31:18.541Z]     at Module._compile (internal/modules/cjs/loader.js:1200:30)
[2020-05-20T15:31:18.541Z]     at Object.Module._extensions..js (internal/modules/cjs/loader.js:1220:10)
[2020-05-20T15:31:18.541Z] /usr/lib/node_modules/marked-man/lib/marked-man.js:8
[2020-05-20T15:31:18.541Z] InlineLexer.prototype.html_output = InlineLexer.prototype.output;
[2020-05-20T15:31:18.541Z]             ^
[2020-05-20T15:31:18.541Z] 
[2020-05-20T15:31:18.541Z] TypeError: Cannot read property 'prototype' of undefined
[2020-05-20T15:31:18.541Z]     at Object.<anonymous> (/usr/lib/node_modules/marked-man/lib/marked-man.js:8:13)
[2020-05-20T15:31:18.541Z]     at Module._compile (internal/modules/cjs/loader.js:1200:30)
[2020-05-20T15:31:18.542Z]     at Object.Module._extensions..js (internal/modules/cjs/loader.js:1220:10)
[2020-05-20T15:31:18.542Z]     at Module.load (internal/modules/cjs/loader.js:1049:32)
[2020-05-20T15:31:18.542Z]     at Function.Module._load (internal/modules/cjs/loader.js:937:14)
[2020-05-20T15:31:18.542Z]     at Module.require (internal/modules/cjs/loader.js:1089:19)
[2020-05-20T15:31:18.542Z]     at require (internal/modules/cjs/helpers.js:73:18)
[2020-05-20T15:31:18.542Z]     at Object.<anonymous> (/build/npm/src/cli-6.14.5/scripts/docs-build.js:4:14)
[2020-05-20T15:31:18.542Z]     at Module._compile (internal/modules/cjs/loader.js:1200:30)
[2020-05-20T15:31:18.542Z]     at Object.Module._extensions..js (internal/modules/cjs/loader.js:1220:10)
[2020-05-20T15:31:18.542Z] /usr/lib/node_modules/marked-man/lib/marked-man.js:8
[2020-05-20T15:31:18.542Z] InlineLexer.prototype.html_output = InlineLexer.prototype.output;
[2020-05-20T15:31:18.542Z]             ^
[2020-05-20T15:31:18.542Z] 
[2020-05-20T15:31:18.542Z] TypeError: Cannot read property 'prototype' of undefined
[2020-05-20T15:31:18.542Z]     at Object.<anonymous> (/usr/lib/node_modules/marked-man/lib/marked-man.js:8:13)
[2020-05-20T15:31:18.542Z]     at Module._compile (internal/modules/cjs/loader.js:1200:30)
[2020-05-20T15:31:18.542Z]     at Object.Module._extensions..js (internal/modules/cjs/loader.js:1220:10)
[2020-05-20T15:31:18.542Z]     at Module.load (internal/modules/cjs/loader.js:1049:32)
[2020-05-20T15:31:18.542Z]     at Function.Module._load (internal/modules/cjs/loader.js:937:14)
[2020-05-20T15:31:18.542Z]     at Module.require (internal/modules/cjs/loader.js:1089:19)
[2020-05-20T15:31:18.542Z]     at require (internal/modules/cjs/helpers.js:73:18)
[2020-05-20T15:31:18.542Z]     at Object.<anonymous> (/build/npm/src/cli-6.14.5/scripts/docs-build.js:4:14)
[2020-05-20T15:31:18.542Z]     at Module._compile (internal/modules/cjs/loader.js:1200:30)
[2020-05-20T15:31:18.542Z]     at Object.Module._extensions..js (internal/modules/cjs/loader.js:1220:10)
[2020-05-20T15:31:18.542Z] /usr/lib/node_modules/marked-man/lib/marked-man.js:8
[2020-05-20T15:31:18.542Z] InlineLexer.prototype.html_output = InlineLexer.prototype.output;
[2020-05-20T15:31:18.542Z]             ^
[2020-05-20T15:31:18.542Z] 
[2020-05-20T15:31:18.542Z] TypeError: Cannot read property 'prototype' of undefined
[2020-05-20T15:31:18.542Z]     at Object.<anonymous> (/usr/lib/node_modules/marked-man/lib/marked-man.js:8:13)
[2020-05-20T15:31:18.542Z]     at Module._compile (internal/modules/cjs/loader.js:1200:30)
[2020-05-20T15:31:18.542Z]     at Object.Module._extensions..js (internal/modules/cjs/loader.js:1220:10)
[2020-05-20T15:31:18.542Z]     at Module.load (internal/modules/cjs/loader.js:1049:32)
[2020-05-20T15:31:18.542Z]     at Function.Module._load (internal/modules/cjs/loader.js:937:14)
[2020-05-20T15:31:18.542Z]     at Module.require (internal/modules/cjs/loader.js:1089:19)
[2020-05-20T15:31:18.542Z]     at require (internal/modules/cjs/helpers.js:73:18)
[2020-05-20T15:31:18.542Z]     at Object.<anonymous> (/build/npm/src/cli-6.14.5/scripts/docs-build.js:4:14)
[2020-05-20T15:31:18.542Z]     at Module._compile (internal/modules/cjs/loader.js:1200:30)
[2020-05-20T15:31:18.542Z]     at Object.Module._extensions..js (internal/modules/cjs/loader.js:1220:10)
[2020-05-20T15:31:18.542Z] /usr/lib/node_modules/marked-man/lib/marked-man.js:8
[2020-05-20T15:31:18.542Z] InlineLexer.prototype.html_output = InlineLexer.prototype.output;
[2020-05-20T15:31:18.542Z]             ^
[2020-05-20T15:31:18.542Z] 
[2020-05-20T15:31:18.542Z] TypeError: Cannot read property 'prototype' of undefined
[2020-05-20T15:31:18.542Z]     at Object.<anonymous> (/usr/lib/node_modules/marked-man/lib/marked-man.js:8:13)
[2020-05-20T15:31:18.542Z]     at Module._compile (internal/modules/cjs/loader.js:1200:30)
[2020-05-20T15:31:18.542Z]     at Object.Module._extensions..js (internal/modules/cjs/loader.js:1220:10)
[2020-05-20T15:31:18.542Z]     at Module.load (internal/modules/cjs/loader.js:1049:32)
[2020-05-20T15:31:18.542Z]     at Function.Module._load (internal/modules/cjs/loader.js:937:14)
[2020-05-20T15:31:18.542Z]     at Module.require (internal/modules/cjs/loader.js:1089:19)
[2020-05-20T15:31:18.542Z]     at require (internal/modules/cjs/helpers.js:73:18)
[2020-05-20T15:31:18.542Z]     at Object.<anonymous> (/build/npm/src/cli-6.14.5/scripts/docs-build.js:4:14)
[2020-05-20T15:31:18.542Z]     at Module._compile (internal/modules/cjs/loader.js:1200:30)
[2020-05-20T15:31:18.542Z]     at Object.Module._extensions..js (internal/modules/cjs/loader.js:1220:10)
[2020-05-20T15:31:18.542Z] make: *** [Makefile:85: man/man1/npm-view.1] Error 1
[2020-05-20T15:31:18.542Z] make: *** [Makefile:85: man/man1/npm-whoami.1] Error 1
[2020-05-20T15:31:18.542Z] make: *** [Makefile:85: man/man1/npm-token.1] Error 1
[2020-05-20T15:31:18.542Z] /usr/lib/node_modules/marked-man/lib/marked-man.js:8
[2020-05-20T15:31:18.542Z] InlineLexer.prototype.html_output = InlineLexer.prototype.output;
[2020-05-20T15:31:18.542Z]             ^
[2020-05-20T15:31:18.542Z] 
[2020-05-20T15:31:18.542Z] TypeError: Cannot read property 'prototype' of undefined
[2020-05-20T15:31:18.542Z]     at Object.<anonymous> (/usr/lib/node_modules/marked-man/lib/marked-man.js:8:13)
[2020-05-20T15:31:18.542Z]     at Module._compile (internal/modules/cjs/loader.js:1200:30)
[2020-05-20T15:31:18.542Z]     at Object.Module._extensions..js (internal/modules/cjs/loader.js:1220:10)
[2020-05-20T15:31:18.542Z]     at Module.load (internal/modules/cjs/loader.js:1049:32)
[2020-05-20T15:31:18.542Z]     at Function.Module._load (internal/modules/cjs/loader.js:937:14)
[2020-05-20T15:31:18.542Z]     at Module.require (internal/modules/cjs/loader.js:1089:19)
[2020-05-20T15:31:18.542Z]     at require (internal/modules/cjs/helpers.js:73:18)
[2020-05-20T15:31:18.542Z]     at Object.<anonymous> (/build/npm/src/cli-6.14.5/scripts/docs-build.js:4:14)
[2020-05-20T15:31:18.542Z]     at Module._compile (internal/modules/cjs/loader.js:1200:30)
[2020-05-20T15:31:18.542Z]     at Object.Module._extensions..js (internal/modules/cjs/loader.js:1220:10)
[2020-05-20T15:31:18.542Z] /usr/lib/node_modules/marked-man/lib/marked-man.js:8
[2020-05-20T15:31:18.542Z] InlineLexer.prototype.html_output = InlineLexer.prototype.output;
[2020-05-20T15:31:18.542Z]             ^
[2020-05-20T15:31:18.542Z] 
[2020-05-20T15:31:18.542Z] TypeError: Cannot read property 'prototype' of undefined
[2020-05-20T15:31:18.542Z]     at Object.<anonymous> (/usr/lib/node_modules/marked-man/lib/marked-man.js:8:13)
[2020-05-20T15:31:18.542Z]     at Module._compile (internal/modules/cjs/loader.js:1200:30)
[2020-05-20T15:31:18.542Z]     at Object.Module._extensions..js (internal/modules/cjs/loader.js:1220:10)
[2020-05-20T15:31:18.542Z]     at Module.load (internal/modules/cjs/loader.js:1049:32)
[2020-05-20T15:31:18.542Z]     at Function.Module._load (internal/modules/cjs/loader.js:937:14)
[2020-05-20T15:31:18.542Z]     at Module.require (internal/modules/cjs/loader.js:1089:19)
[2020-05-20T15:31:18.542Z]     at require (internal/modules/cjs/helpers.js:73:18)
[2020-05-20T15:31:18.542Z]     at Object.<anonymous> (/build/npm/src/cli-6.14.5/scripts/docs-build.js:4:14)
[2020-05-20T15:31:18.542Z]     at Module._compile (internal/modules/cjs/loader.js:1200:30)
[2020-05-20T15:31:18.542Z]     at Object.Module._extensions..js (internal/modules/cjs/loader.js:1220:10)
[2020-05-20T15:31:18.542Z] make: *** [Makefile:85: man/man1/npm-update.1] Error 1
[2020-05-20T15:31:18.542Z] make: *** [Makefile:85: man/man1/npm-search.1] Error 1
[2020-05-20T15:31:18.542Z] /usr/lib/node_modules/marked-man/lib/marked-man.js:8
[2020-05-20T15:31:18.542Z] InlineLexer.prototype.html_output = InlineLexer.prototype.output;
[2020-05-20T15:31:18.542Z]             ^
[2020-05-20T15:31:18.542Z] 
[2020-05-20T15:31:18.542Z] TypeError: Cannot read property 'prototype' of undefined
[2020-05-20T15:31:18.542Z]     at Object.<anonymous> (/usr/lib/node_modules/marked-man/lib/marked-man.js:8:13)
[2020-05-20T15:31:18.542Z]     at Module._compile (internal/modules/cjs/loader.js:1200:30)
[2020-05-20T15:31:18.542Z]     at Object.Module._extensions..js (internal/modules/cjs/loader.js:1220:10)
[2020-05-20T15:31:18.542Z]     at Module.load (internal/modules/cjs/loader.js:1049:32)
[2020-05-20T15:31:18.542Z]     at Function.Module._load (internal/modules/cjs/loader.js:937:14)
[2020-05-20T15:31:18.542Z]     at Module.require (internal/modules/cjs/loader.js:1089:19)
[2020-05-20T15:31:18.542Z]     at require (internal/modules/cjs/helpers.js:73:18)
[2020-05-20T15:31:18.542Z]     at Object.<anonymous> (/build/npm/src/cli-6.14.5/scripts/docs-build.js:4:14)
[2020-05-20T15:31:18.542Z]     at Module._compile (internal/modules/cjs/loader.js:1200:30)
[2020-05-20T15:31:18.542Z]     at Object.Module._extensions..js (internal/modules/cjs/loader.js:1220:10)
[2020-05-20T15:31:18.542Z] /usr/lib/node_modules/marked-man/lib/marked-man.js:8
[2020-05-20T15:31:18.542Z] InlineLexer.prototype.html_output = InlineLexer.prototype.output;
[2020-05-20T15:31:18.542Z]             ^
[2020-05-20T15:31:18.542Z] 
[2020-05-20T15:31:18.542Z] TypeError: Cannot read property 'prototype' of undefined
[2020-05-20T15:31:18.542Z]     at Object.<anonymous> (/usr/lib/node_modules/marked-man/lib/marked-man.js:8:13)
[2020-05-20T15:31:18.542Z]     at Module._compile (internal/modules/cjs/loader.js:1200:30)
[2020-05-20T15:31:18.542Z]     at Object.Module._extensions..js (internal/modules/cjs/loader.js:1220:10)
[2020-05-20T15:31:18.542Z]     at Module.load (internal/modules/cjs/loader.js:1049:32)
[2020-05-20T15:31:18.542Z]     at Function.Module._load (internal/modules/cjs/loader.js:937:14)
[2020-05-20T15:31:18.542Z]     at Module.require (internal/modules/cjs/loader.js:1089:19)
[2020-05-20T15:31:18.542Z]     at require (internal/modules/cjs/helpers.js:73:18)
[2020-05-20T15:31:18.542Z]     at Object.<anonymous> (/build/npm/src/cli-6.14.5/scripts/docs-build.js:4:14)
[2020-05-20T15:31:18.542Z]     at Module._compile (internal/modules/cjs/loader.js:1200:30)
[2020-05-20T15:31:18.542Z]     at Object.Module._extensions..js (internal/modules/cjs/loader.js:1220:10)
[2020-05-20T15:31:18.542Z] make: *** [Makefile:85: man/man1/npm.1] Error 1
[2020-05-20T15:31:18.542Z] make: *** [Makefile:85: man/man1/npm-stop.1] Error 1
[2020-05-20T15:31:18.542Z] make: *** [Makefile:85: man/man1/npm-star.1] Error 1
[2020-05-20T15:31:18.542Z] /usr/lib/node_modules/marked-man/lib/marked-man.js:8
[2020-05-20T15:31:18.542Z] InlineLexer.prototype.html_output = InlineLexer.prototype.output;
[2020-05-20T15:31:18.542Z]             ^
[2020-05-20T15:31:18.542Z] 
[2020-05-20T15:31:18.542Z] TypeError: Cannot read property 'prototype' of undefined
[2020-05-20T15:31:18.542Z]     at Object.<anonymous> (/usr/lib/node_modules/marked-man/lib/marked-man.js:8:13)
[2020-05-20T15:31:18.542Z]     at Module._compile (internal/modules/cjs/loader.js:1200:30)
[2020-05-20T15:31:18.542Z]     at Object.Module._extensions..js (internal/modules/cjs/loader.js:1220:10)
[2020-05-20T15:31:18.543Z]     at Module.load (internal/modules/cjs/loader.js:1049:32)
[2020-05-20T15:31:18.543Z]     at Function.Module._load (internal/modules/cjs/loader.js:937:14)
[2020-05-20T15:31:18.543Z]     at Module.require (internal/modules/cjs/loader.js:1089:19)
[2020-05-20T15:31:18.543Z]     at require (internal/modules/cjs/helpers.js:73:18)
[2020-05-20T15:31:18.543Z]     at Object.<anonymous> (/build/npm/src/cli-6.14.5/scripts/docs-build.js:4:14)
[2020-05-20T15:31:18.543Z]     at Module._compile (internal/modules/cjs/loader.js:1200:30)
[2020-05-20T15:31:18.543Z]     at Object.Module._extensions..js (internal/modules/cjs/loader.js:1220:10)
[2020-05-20T15:31:18.543Z] /usr/lib/node_modules/marked-man/lib/marked-man.js:8
[2020-05-20T15:31:18.543Z] InlineLexer.prototype.html_output = InlineLexer.prototype.output;
[2020-05-20T15:31:18.543Z]             ^
[2020-05-20T15:31:18.543Z] 
[2020-05-20T15:31:18.543Z] TypeError: Cannot read property 'prototype' of undefined
[2020-05-20T15:31:18.543Z]     at Object.<anonymous> (/usr/lib/node_modules/marked-man/lib/marked-man.js:8:13)
[2020-05-20T15:31:18.543Z]     at Module._compile (internal/modules/cjs/loader.js:1200:30)
[2020-05-20T15:31:18.543Z]     at Object.Module._extensions..js (internal/modules/cjs/loader.js:1220:10)
[2020-05-20T15:31:18.543Z]     at Module.load (internal/modules/cjs/loader.js:1049:32)
[2020-05-20T15:31:18.543Z]     at Function.Module._load (internal/modules/cjs/loader.js:937:14)
[2020-05-20T15:31:18.543Z]     at Module.require (internal/modules/cjs/loader.js:1089:19)
[2020-05-20T15:31:18.543Z]     at require (internal/modules/cjs/helpers.js:73:18)
[2020-05-20T15:31:18.543Z]     at Object.<anonymous> (/build/npm/src/cli-6.14.5/scripts/docs-build.js:4:14)
[2020-05-20T15:31:18.543Z]     at Module._compile (internal/modules/cjs/loader.js:1200:30)
[2020-05-20T15:31:18.543Z]     at Object.Module._extensions..js (internal/modules/cjs/loader.js:1220:10)
[2020-05-20T15:31:18.543Z] /usr/lib/node_modules/marked-man/lib/marked-man.js:8
[2020-05-20T15:31:18.543Z] InlineLexer.prototype.html_output = InlineLexer.prototype.output;
[2020-05-20T15:31:18.543Z]             ^
[2020-05-20T15:31:18.543Z] 
[2020-05-20T15:31:18.543Z] TypeError: Cannot read property 'prototype' of undefined
[2020-05-20T15:31:18.543Z]     at Object.<anonymous> (/usr/lib/node_modules/marked-man/lib/marked-man.js:8:13)
[2020-05-20T15:31:18.543Z]     at Module._compile (internal/modules/cjs/loader.js:1200:30)
[2020-05-20T15:31:18.543Z]     at Object.Module._extensions..js (internal/modules/cjs/loader.js:1220:10)
[2020-05-20T15:31:18.543Z]     at Module.load (internal/modules/cjs/loader.js:1049:32)
[2020-05-20T15:31:18.543Z]     at Function.Module._load (internal/modules/cjs/loader.js:937:14)
[2020-05-20T15:31:18.543Z]     at Module.require (internal/modules/cjs/loader.js:1089:19)
[2020-05-20T15:31:18.543Z]     at require (internal/modules/cjs/helpers.js:73:18)
[2020-05-20T15:31:18.543Z]     at Object.<anonymous> (/build/npm/src/cli-6.14.5/scripts/docs-build.js:4:14)
[2020-05-20T15:31:18.543Z]     at Module._compile (internal/modules/cjs/loader.js:1200:30)
[2020-05-20T15:31:18.543Z]     at Object.Module._extensions..js (internal/modules/cjs/loader.js:1220:10)
[2020-05-20T15:31:18.543Z] make: *** [Makefile:85: man/man1/npm-publish.1] Error 1
[2020-05-20T15:31:18.543Z] /usr/lib/node_modules/marked-man/lib/marked-man.js:8
[2020-05-20T15:31:18.543Z] InlineLexer.prototype.html_output = InlineLexer.prototype.output;
[2020-05-20T15:31:18.543Z]             ^
[2020-05-20T15:31:18.543Z] 
[2020-05-20T15:31:18.543Z] TypeError: Cannot read property 'prototype' of undefined
[2020-05-20T15:31:18.543Z]     at Object.<anonymous> (/usr/lib/node_modules/marked-man/lib/marked-man.js:8:13)
[2020-05-20T15:31:18.543Z]     at Module._compile (internal/modules/cjs/loader.js:1200:30)
[2020-05-20T15:31:18.543Z]     at Object.Module._extensions..js (internal/modules/cjs/loader.js:1220:10)
[2020-05-20T15:31:18.543Z]     at Module.load (internal/modules/cjs/loader.js:1049:32)
[2020-05-20T15:31:18.543Z]     at Function.Module._load (internal/modules/cjs/loader.js:937:14)
[2020-05-20T15:31:18.543Z]     at Module.require (internal/modules/cjs/loader.js:1089:19)
[2020-05-20T15:31:18.543Z]     at require (internal/modules/cjs/helpers.js:73:18)
[2020-05-20T15:31:18.543Z]     at Object.<anonymous> (/build/npm/src/cli-6.14.5/scripts/docs-build.js:4:14)
[2020-05-20T15:31:18.543Z]     at Module._compile (internal/modules/cjs/loader.js:1200:30)
[2020-05-20T15:31:18.543Z]     at Object.Module._extensions..js (internal/modules/cjs/loader.js:1220:10)
[2020-05-20T15:31:18.543Z] /usr/lib/node_modules/marked-man/lib/marked-man.js:8
[2020-05-20T15:31:18.543Z] InlineLexer.prototype.html_output = InlineLexer.prototype.output;
[2020-05-20T15:31:18.543Z]             ^
[2020-05-20T15:31:18.543Z] 
[2020-05-20T15:31:18.543Z] TypeError: Cannot read property 'prototype' of undefined
[2020-05-20T15:31:18.543Z]     at Object.<anonymous> (/usr/lib/node_modules/marked-man/lib/marked-man.js:8:13)
[2020-05-20T15:31:18.543Z]     at Module._compile (internal/modules/cjs/loader.js:1200:30)
[2020-05-20T15:31:18.543Z]     at Object.Module._extensions..js (internal/modules/cjs/loader.js:1220:10)
[2020-05-20T15:31:18.543Z]     at Module.load (internal/modules/cjs/loader.js:1049:32)
[2020-05-20T15:31:18.543Z]     at Function.Module._load (internal/modules/cjs/loader.js:937:14)
[2020-05-20T15:31:18.543Z]     at Module.require (internal/modules/cjs/loader.js:1089:19)
[2020-05-20T15:31:18.543Z]     at require (internal/modules/cjs/helpers.js:73:18)
[2020-05-20T15:31:18.543Z]     at Object.<anonymous> (/build/npm/src/cli-6.14.5/scripts/docs-build.js:4:14)
[2020-05-20T15:31:18.543Z]     at Module._compile (internal/modules/cjs/loader.js:1200:30)
[2020-05-20T15:31:18.543Z]     at Object.Module._extensions..js (internal/modules/cjs/loader.js:1220:10)
[2020-05-20T15:31:18.543Z] make: *** [Makefile:85: man/man1/npm-uninstall.1] Error 1
[2020-05-20T15:31:18.543Z] make: *** [Makefile:85: man/man1/npm-unpublish.1] Error 1
[2020-05-20T15:31:18.543Z] make: *** [Makefile:85: man/man1/npm-rebuild.1] Error 1
[2020-05-20T15:31:18.543Z] make: *** [Makefile:85: man/man1/npm-root.1] Error 1
[2020-05-20T15:31:18.543Z] make: *** [Makefile:85: man/man1/npm-repo.1] Error 1
[2020-05-20T15:31:18.543Z] /usr/lib/node_modules/marked-man/lib/marked-man.js:8
[2020-05-20T15:31:18.543Z] InlineLexer.prototype.html_output = InlineLexer.prototype.output;
[2020-05-20T15:31:18.543Z]             ^
[2020-05-20T15:31:18.543Z] 
[2020-05-20T15:31:18.543Z] TypeError: Cannot read property 'prototype' of undefined
[2020-05-20T15:31:18.543Z]     at Object.<anonymous> (/usr/lib/node_modules/marked-man/lib/marked-man.js:8:13)
[2020-05-20T15:31:18.543Z]     at Module._compile (internal/modules/cjs/loader.js:1200:30)
[2020-05-20T15:31:18.543Z]     at Object.Module._extensions..js (internal/modules/cjs/loader.js:1220:10)
[2020-05-20T15:31:18.543Z]     at Module.load (internal/modules/cjs/loader.js:1049:32)
[2020-05-20T15:31:18.543Z]     at Function.Module._load (internal/modules/cjs/loader.js:937:14)
[2020-05-20T15:31:18.543Z]     at Module.require (internal/modules/cjs/loader.js:1089:19)
[2020-05-20T15:31:18.543Z]     at require (internal/modules/cjs/helpers.js:73:18)
[2020-05-20T15:31:18.543Z]     at Object.<anonymous> (/build/npm/src/cli-6.14.5/scripts/docs-build.js:4:14)
[2020-05-20T15:31:18.543Z]     at Module._compile (internal/modules/cjs/loader.js:1200:30)
[2020-05-20T15:31:18.543Z]     at Object.Module._extensions..js (internal/modules/cjs/loader.js:1220:10)
[2020-05-20T15:31:18.543Z] make: *** [Makefile:85: man/man1/npm-prune.1] Error 1
[2020-05-20T15:31:18.543Z] ==> ERROR: A failure occurred in build().
[2020-05-20T15:31:18.543Z]     Aborting...
[2020-05-20T15:31:19.454Z] ==> ERROR: Build failed, check /build/buildpkg/default-x86_64/jenkins/build
[Pipeline] }
[Pipeline] // dir
Post stage
[Pipeline] emailext
[2020-05-20T15:31:19.520Z] Sending email to: artix-build-failures at artixlinux.org


More information about the artix-build-failures mailing list