[artix-build-failures] [galaxy] Failure: npm

jenkins at artixlinux.org jenkins at artixlinux.org
Tue May 12 22:36:24 CEST 2020


   Failure

   Build: repos/community-any

   Packages:

   [npm-6.14.5-1-any.pkg.tar.zst]

   authorName: alium

   authorEmail: alium at artixlinux.org

   [1]https://orion.artixlinux.org/job/packagesN/job/npm/job/master/16/

References

   1. https://orion.artixlinux.org/job/packagesN/job/npm/job/master/16/
-------------- next part --------------
Started by user alium
Restarted from build #15, stage Prepare
Querying the current revision of branch master...
Current revision of branch master is 5b227ddb36da44282af61abb31b2b42aa84f8dc0
Obtained Jenkinsfile from 5b227ddb36da44282af61abb31b2b42aa84f8dc0
Running in Durability level: PERFORMANCE_OPTIMIZED
[Pipeline] Start of Pipeline
[Pipeline] node
Running on Jenkins in /build/jenkins/workspace/packagesN_npm_master
[Pipeline] {
[Pipeline] timestamps
[Pipeline] {
[Pipeline] stage
[Pipeline] { (Prepare)
[Pipeline] checkout
[2020-05-12T20:35:59.578Z] Warning: CredentialId "jenkins-ci" could not be found.
[2020-05-12T20:35:59.578Z]  > git rev-parse --is-inside-work-tree # timeout=10
[2020-05-12T20:35:59.584Z] Fetching changes from the remote Git repository
[2020-05-12T20:35:59.584Z]  > git config remote.origin.url https://237b7412742b4068af4173944de150f12959f4d3@gitea.artixlinux.org/packagesN/npm.git # timeout=10
[2020-05-12T20:35:59.594Z] Cleaning workspace
[2020-05-12T20:35:59.594Z]  > git rev-parse --verify HEAD # timeout=10
[2020-05-12T20:35:59.600Z] Resetting working tree
[2020-05-12T20:35:59.600Z]  > git reset --hard # timeout=10
[2020-05-12T20:35:59.613Z]  > git clean -fdx # timeout=10
[2020-05-12T20:35:59.618Z] Fetching without tags
[2020-05-12T20:35:59.618Z] Fetching upstream changes from https://237b7412742b4068af4173944de150f12959f4d3@gitea.artixlinux.org/packagesN/npm.git
[2020-05-12T20:35:59.618Z]  > git --version # timeout=10
[2020-05-12T20:35:59.623Z]  > git fetch --no-tags --force --progress -- https://237b7412742b4068af4173944de150f12959f4d3@gitea.artixlinux.org/packagesN/npm.git +refs/heads/master:refs/remotes/origin/master # timeout=10
[2020-05-12T20:35:59.723Z] Checking out Revision 5b227ddb36da44282af61abb31b2b42aa84f8dc0 (master)
[2020-05-12T20:35:59.723Z]  > git config core.sparsecheckout # timeout=10
[2020-05-12T20:35:59.728Z]  > git checkout -f 5b227ddb36da44282af61abb31b2b42aa84f8dc0 # timeout=10
[2020-05-12T20:35:59.735Z] Commit message: "[trunk] -> [community] 'npm-6.14.5-1' add"
[2020-05-12T20:35:59.736Z]  > git rev-list --no-walk 5b227ddb36da44282af61abb31b2b42aa84f8dc0 # timeout=10
[2020-05-12T20:35:59.747Z] [Gitea] Notifying branch build status: PENDING Build started...
[2020-05-12T20:35:59.892Z] [Gitea] Notified
[Pipeline] libraryResource
[Pipeline] readYaml
[Pipeline] sh
[2020-05-12T20:36:00.261Z] + git rev-parse @
[Pipeline] sh
[2020-05-12T20:36:00.547Z] + git show -s --format=%an 5b227ddb36da44282af61abb31b2b42aa84f8dc0
[Pipeline] sh
[2020-05-12T20:36:00.832Z] + git show -s --format=%ae 5b227ddb36da44282af61abb31b2b42aa84f8dc0
[Pipeline] sh
[2020-05-12T20:36:01.117Z] + git show --pretty=format: --name-status 5b227ddb36da44282af61abb31b2b42aa84f8dc0
[Pipeline] fileExists
[Pipeline] sh
[2020-05-12T20:36:01.454Z] + pkg2yaml repos/community-any
[Pipeline] readYaml
[Pipeline] }
[Pipeline] // stage
[Pipeline] stage
[Pipeline] { (Build)
[Pipeline] echo
[2020-05-12T20:36:01.706Z] isRebuild: false
[Pipeline] dir
[2020-05-12T20:36:01.738Z] Running in /build/jenkins/workspace/packagesN_npm_master/repos/community-any
[Pipeline] {
[Pipeline] sh
[2020-05-12T20:36:02.043Z] + buildpkg-galaxy
[2020-05-12T20:36:05.272Z] :: Synchronizing package databases...
[2020-05-12T20:36:05.272Z]  system is up to date
[2020-05-12T20:36:05.272Z] downloading world.db...
[2020-05-12T20:36:05.272Z] downloading galaxy.db...
[2020-05-12T20:36:05.272Z]  extra is up to date
[2020-05-12T20:36:05.272Z]  community is up to date
[2020-05-12T20:36:05.272Z] :: Starting full system upgrade...
[2020-05-12T20:36:05.272Z]  there is nothing to do
[2020-05-12T20:36:05.823Z] ==> Building in chroot for [default] (x86_64)...
[2020-05-12T20:36:06.373Z] ==> Synchronizing chroot copy [/build/buildpkg/default-x86_64/root] -> [jenkins]...done
[2020-05-12T20:36:07.284Z] ==> Making package: npm 6.14.5-1 (Tue May 12 22:36:07 2020)
[2020-05-12T20:36:07.285Z] ==> Retrieving sources...
[2020-05-12T20:36:07.285Z]   -> Found npm-6.14.5.tar.gz
[2020-05-12T20:36:07.285Z] ==> Validating source files with sha512sums...
[2020-05-12T20:36:07.285Z]     npm-6.14.5.tar.gz ... Passed
[2020-05-12T20:36:11.406Z] ==> Making package: npm 6.14.5-1 (Tue 12 May 2020 10:36:11 PM CEST)
[2020-05-12T20:36:11.406Z] ==> Checking runtime dependencies...
[2020-05-12T20:36:11.406Z] ==> Installing missing dependencies...
[2020-05-12T20:36:11.957Z] resolving dependencies...
[2020-05-12T20:36:11.957Z] looking for conflicting packages...
[2020-05-12T20:36:11.957Z] 
[2020-05-12T20:36:11.957Z] Package (6)      New Version  Net Change
[2020-05-12T20:36:11.957Z] 
[2020-05-12T20:36:11.957Z] world/c-ares     1.16.1-1       0.19 MiB
[2020-05-12T20:36:11.957Z] system/libnsl    1.2.0-2        0.19 MiB
[2020-05-12T20:36:11.957Z] world/libuv      1.37.0-1       0.51 MiB
[2020-05-12T20:36:11.957Z] galaxy/node-gyp  6.1.0-1        6.35 MiB
[2020-05-12T20:36:11.957Z] galaxy/nodejs    14.2.0-1      27.31 MiB
[2020-05-12T20:36:11.957Z] galaxy/semver    7.3.2-1        0.08 MiB
[2020-05-12T20:36:11.957Z] 
[2020-05-12T20:36:11.957Z] Total Installed Size:  34.63 MiB
[2020-05-12T20:36:11.957Z] 
[2020-05-12T20:36:11.957Z] :: Proceed with installation? [Y/n] 
[2020-05-12T20:36:11.957Z] checking keyring...
[2020-05-12T20:36:11.957Z] checking package integrity...
[2020-05-12T20:36:12.208Z] loading package files...
[2020-05-12T20:36:12.208Z] checking for file conflicts...
[2020-05-12T20:36:12.208Z] checking available disk space...
[2020-05-12T20:36:12.208Z] :: Processing package changes...
[2020-05-12T20:36:12.208Z] installing libnsl...
[2020-05-12T20:36:12.208Z] installing libuv...
[2020-05-12T20:36:12.208Z] installing c-ares...
[2020-05-12T20:36:12.208Z] installing nodejs...
[2020-05-12T20:36:12.759Z] Optional dependencies for nodejs
[2020-05-12T20:36:12.759Z]     npm: nodejs package manager
[2020-05-12T20:36:12.759Z] installing semver...
[2020-05-12T20:36:12.759Z] installing node-gyp...
[2020-05-12T20:36:13.009Z] ==> Checking buildtime dependencies...
[2020-05-12T20:36:13.009Z] ==> Installing missing dependencies...
[2020-05-12T20:36:13.560Z] :: There are 2 providers available for libgl:
[2020-05-12T20:36:13.560Z] :: Repository world
[2020-05-12T20:36:13.560Z]    1) libglvnd
[2020-05-12T20:36:13.560Z] :: Repository extra
[2020-05-12T20:36:13.560Z]    2) libglvnd
[2020-05-12T20:36:13.560Z] 
[2020-05-12T20:36:13.560Z] Enter a number (default=1): 
[2020-05-12T20:36:13.560Z] resolving dependencies...
[2020-05-12T20:36:13.560Z] looking for conflicting packages...
[2020-05-12T20:36:13.560Z] warning: dependency cycle detected:
[2020-05-12T20:36:13.560Z] warning: mesa will be installed before its libglvnd dependency
[2020-05-12T20:36:13.560Z] 
[2020-05-12T20:36:13.560Z] Package (26)             New Version     Net Change  Download Size
[2020-05-12T20:36:13.560Z] 
[2020-05-12T20:36:13.560Z] world/libdrm             2.4.101-1         0.92 MiB               
[2020-05-12T20:36:13.560Z] system/libedit           20191231_3.1-1    0.25 MiB               
[2020-05-12T20:36:13.560Z] world/libomxil-bellagio  0.9.3-2           0.62 MiB               
[2020-05-12T20:36:13.560Z] world/libpciaccess       0.16-1            0.09 MiB               
[2020-05-12T20:36:13.560Z] world/libunwind          1.3.1-1           0.29 MiB               
[2020-05-12T20:36:13.560Z] world/libx11             1.6.9-6          10.15 MiB               
[2020-05-12T20:36:13.560Z] world/libxau             1.0.9-2           0.02 MiB               
[2020-05-12T20:36:13.560Z] world/libxcb             1.14-1            3.73 MiB               
[2020-05-12T20:36:13.560Z] world/libxdamage         1.1.5-2           0.02 MiB               
[2020-05-12T20:36:13.560Z] world/libxdmcp           1.1.3-2           0.13 MiB               
[2020-05-12T20:36:13.560Z] world/libxext            1.3.4-2           0.30 MiB               
[2020-05-12T20:36:13.560Z] world/libxfixes          5.0.3-3           0.04 MiB               
[2020-05-12T20:36:13.560Z] world/libxshmfence       1.3-2             0.02 MiB               
[2020-05-12T20:36:13.560Z] world/libxxf86vm         1.1.4-3           0.03 MiB               
[2020-05-12T20:36:13.560Z] world/llvm-libs          10.0.0-1         84.13 MiB               
[2020-05-12T20:36:13.560Z] world/lm_sensors         3.6.0-1           0.52 MiB               
[2020-05-12T20:36:13.560Z] world/mesa               20.0.6-2         83.83 MiB               
[2020-05-12T20:36:13.560Z] world/wayland            1.18.0-2          0.73 MiB               
[2020-05-12T20:36:13.560Z] world/xcb-proto          1.14-1            0.83 MiB               
[2020-05-12T20:36:13.560Z] world/xorgproto          2020.1-1          1.40 MiB               
[2020-05-12T20:36:13.560Z] world/libglvnd           1.3.1-1           3.67 MiB               
[2020-05-12T20:36:13.560Z] world/libxi              1.7.10-2          0.47 MiB               
[2020-05-12T20:36:13.560Z] community/marked         1.0.0-1           0.21 MiB       0.04 MiB
[2020-05-12T20:36:13.560Z] galaxy/marked-man        0.7.0-3           0.02 MiB       0.01 MiB
[2020-05-12T20:36:13.560Z] system/procps-ng         3.3.16-1          1.34 MiB               
[2020-05-12T20:36:13.560Z] world/python             3.8.2-2          80.70 MiB               
[2020-05-12T20:36:13.560Z] 
[2020-05-12T20:36:13.560Z] Total Download Size:     0.04 MiB
[2020-05-12T20:36:13.560Z] Total Installed Size:  274.48 MiB
[2020-05-12T20:36:13.560Z] 
[2020-05-12T20:36:13.560Z] :: Proceed with installation? [Y/n] 
[2020-05-12T20:36:13.560Z] :: Retrieving packages...
[2020-05-12T20:36:13.560Z] downloading marked-man-0.7.0-3-any.pkg.tar.xz...
[2020-05-12T20:36:13.560Z] downloading marked-1.0.0-1-any.pkg.tar.zst...
[2020-05-12T20:36:13.560Z] checking keyring...
[2020-05-12T20:36:13.811Z] checking package integrity...
[2020-05-12T20:36:15.672Z] loading package files...
[2020-05-12T20:36:15.672Z] checking for file conflicts...
[2020-05-12T20:36:15.672Z] checking available disk space...
[2020-05-12T20:36:15.672Z] :: Processing package changes...
[2020-05-12T20:36:15.672Z] installing xcb-proto...
[2020-05-12T20:36:15.672Z] installing libxdmcp...
[2020-05-12T20:36:15.672Z] installing libxau...
[2020-05-12T20:36:15.672Z] installing libxcb...
[2020-05-12T20:36:15.672Z] installing xorgproto...
[2020-05-12T20:36:15.922Z] installing libx11...
[2020-05-12T20:36:15.922Z] installing libxext...
[2020-05-12T20:36:15.922Z] installing libpciaccess...
[2020-05-12T20:36:16.172Z] installing libdrm...
[2020-05-12T20:36:16.172Z] installing wayland...
[2020-05-12T20:36:16.172Z] installing libxxf86vm...
[2020-05-12T20:36:16.172Z] installing libxfixes...
[2020-05-12T20:36:16.172Z] installing libxdamage...
[2020-05-12T20:36:16.172Z] installing libxshmfence...
[2020-05-12T20:36:16.172Z] installing libomxil-bellagio...
[2020-05-12T20:36:16.172Z] installing libunwind...
[2020-05-12T20:36:16.172Z] installing libedit...
[2020-05-12T20:36:16.173Z] installing llvm-libs...
[2020-05-12T20:36:18.034Z] installing lm_sensors...
[2020-05-12T20:36:18.034Z] Optional dependencies for lm_sensors
[2020-05-12T20:36:18.034Z]     rrdtool: for logging with sensord
[2020-05-12T20:36:18.034Z] installing mesa...
[2020-05-12T20:36:20.516Z] Optional dependencies for mesa
[2020-05-12T20:36:20.516Z]     opengl-man-pages: for the OpenGL API man pages
[2020-05-12T20:36:20.516Z]     mesa-vdpau: for accelerated video playback
[2020-05-12T20:36:20.516Z]     libva-mesa-driver: for accelerated video playback
[2020-05-12T20:36:20.516Z] installing libglvnd...
[2020-05-12T20:36:20.516Z] installing libxi...
[2020-05-12T20:36:20.516Z] installing marked...
[2020-05-12T20:36:20.516Z] installing marked-man...
[2020-05-12T20:36:20.516Z] installing procps-ng...
[2020-05-12T20:36:20.516Z] installing python...
[2020-05-12T20:36:22.377Z] Optional dependencies for python
[2020-05-12T20:36:22.377Z]     python-setuptools
[2020-05-12T20:36:22.377Z]     python-pip
[2020-05-12T20:36:22.377Z]     sqlite [installed]
[2020-05-12T20:36:22.377Z]     mpdecimal: for decimal
[2020-05-12T20:36:22.377Z]     xz: for lzma [installed]
[2020-05-12T20:36:22.377Z]     tk: for tkinter
[2020-05-12T20:36:22.627Z] ==> Retrieving sources...
[2020-05-12T20:36:22.627Z]   -> Found npm-6.14.5.tar.gz
[2020-05-12T20:36:22.627Z] ==> WARNING: Skipping all source file integrity checks.
[2020-05-12T20:36:22.627Z] ==> Extracting sources...
[2020-05-12T20:36:22.627Z]   -> Extracting npm-6.14.5.tar.gz with bsdtar
[2020-05-12T20:36:22.878Z] ==> Starting prepare()...
[2020-05-12T20:36:22.878Z] ==> Starting build()...
[2020-05-12T20:36:22.878Z] node scripts/docs-build.js docs/content/cli-commands/npm.md man/man1/npm.1
[2020-05-12T20:36:22.878Z] node scripts/docs-build.js docs/content/cli-commands/npm-whoami.md man/man1/npm-whoami.1
[2020-05-12T20:36:22.878Z] node scripts/docs-build.js docs/content/cli-commands/npm-view.md man/man1/npm-view.1
[2020-05-12T20:36:22.878Z] node scripts/docs-build.js docs/content/cli-commands/npm-version.md man/man1/npm-version.1
[2020-05-12T20:36:22.878Z] node scripts/docs-build.js docs/content/cli-commands/npm-update.md man/man1/npm-update.1
[2020-05-12T20:36:22.878Z] node scripts/docs-build.js docs/content/cli-commands/npm-unpublish.md man/man1/npm-unpublish.1
[2020-05-12T20:36:22.878Z] node scripts/docs-build.js docs/content/cli-commands/npm-uninstall.md man/man1/npm-uninstall.1
[2020-05-12T20:36:22.878Z] node scripts/docs-build.js docs/content/cli-commands/npm-token.md man/man1/npm-token.1
[2020-05-12T20:36:22.878Z] node scripts/docs-build.js docs/content/cli-commands/npm-test.md man/man1/npm-test.1
[2020-05-12T20:36:22.878Z] node scripts/docs-build.js docs/content/cli-commands/npm-team.md man/man1/npm-team.1
[2020-05-12T20:36:22.878Z] node scripts/docs-build.js docs/content/cli-commands/npm-stop.md man/man1/npm-stop.1
[2020-05-12T20:36:22.878Z] node scripts/docs-build.js docs/content/cli-commands/npm-start.md man/man1/npm-start.1
[2020-05-12T20:36:22.878Z] node scripts/docs-build.js docs/content/cli-commands/npm-stars.md man/man1/npm-stars.1
[2020-05-12T20:36:22.878Z] node scripts/docs-build.js docs/content/cli-commands/npm-star.md man/man1/npm-star.1
[2020-05-12T20:36:22.878Z] node scripts/docs-build.js docs/content/cli-commands/npm-shrinkwrap.md man/man1/npm-shrinkwrap.1
[2020-05-12T20:36:22.878Z] node scripts/docs-build.js docs/content/cli-commands/npm-search.md man/man1/npm-search.1
[2020-05-12T20:36:22.878Z] node scripts/docs-build.js docs/content/cli-commands/npm-run-script.md man/man1/npm-run-script.1
[2020-05-12T20:36:22.878Z] node scripts/docs-build.js docs/content/cli-commands/npm-root.md man/man1/npm-root.1
[2020-05-12T20:36:22.878Z] node scripts/docs-build.js docs/content/cli-commands/npm-restart.md man/man1/npm-restart.1
[2020-05-12T20:36:22.878Z] node scripts/docs-build.js docs/content/cli-commands/npm-repo.md man/man1/npm-repo.1
[2020-05-12T20:36:23.129Z] node scripts/docs-build.js docs/content/cli-commands/npm-rebuild.md man/man1/npm-rebuild.1
[2020-05-12T20:36:23.129Z] node scripts/docs-build.js docs/content/cli-commands/npm-publish.md man/man1/npm-publish.1
[2020-05-12T20:36:23.129Z] node scripts/docs-build.js docs/content/cli-commands/npm-prune.md man/man1/npm-prune.1
[2020-05-12T20:36:23.129Z] node scripts/docs-build.js docs/content/cli-commands/npm-profile.md man/man1/npm-profile.1
[2020-05-12T20:36:23.129Z] /usr/lib/node_modules/marked-man/lib/marked-man.js:8
[2020-05-12T20:36:23.129Z] InlineLexer.prototype.html_output = InlineLexer.prototype.output;
[2020-05-12T20:36:23.129Z]             ^
[2020-05-12T20:36:23.129Z] 
[2020-05-12T20:36:23.130Z] TypeError: Cannot read property 'prototype' of undefined
[2020-05-12T20:36:23.130Z]     at Object.<anonymous> (/usr/lib/node_modules/marked-man/lib/marked-man.js:8:13)
[2020-05-12T20:36:23.130Z]     at Module._compile (internal/modules/cjs/loader.js:1176:30)
[2020-05-12T20:36:23.130Z]     at Object.Module._extensions..js (internal/modules/cjs/loader.js:1196:10)
[2020-05-12T20:36:23.130Z]     at Module.load (internal/modules/cjs/loader.js:1040:32)
[2020-05-12T20:36:23.130Z]     at Function.Module._load (internal/modules/cjs/loader.js:929:14)
[2020-05-12T20:36:23.130Z]     at Module.require (internal/modules/cjs/loader.js:1080:19)
[2020-05-12T20:36:23.130Z]     at require (internal/modules/cjs/helpers.js:72:18)
[2020-05-12T20:36:23.130Z]     at Object.<anonymous> (/build/npm/src/cli-6.14.5/scripts/docs-build.js:4:14)
[2020-05-12T20:36:23.130Z]     at Module._compile (internal/modules/cjs/loader.js:1176:30)
[2020-05-12T20:36:23.130Z]     at Object.Module._extensions..js (internal/modules/cjs/loader.js:1196:10)
[2020-05-12T20:36:23.130Z] make: *** [Makefile:85: man/man1/npm-version.1] Error 1
[2020-05-12T20:36:23.130Z] make: *** Waiting for unfinished jobs....
[2020-05-12T20:36:23.130Z] /usr/lib/node_modules/marked-man/lib/marked-man.js:8
[2020-05-12T20:36:23.130Z] InlineLexer.prototype.html_output = InlineLexer.prototype.output;
[2020-05-12T20:36:23.130Z]             ^
[2020-05-12T20:36:23.130Z] 
[2020-05-12T20:36:23.130Z] TypeError: Cannot read property 'prototype' of undefined
[2020-05-12T20:36:23.130Z]     at Object.<anonymous> (/usr/lib/node_modules/marked-man/lib/marked-man.js:8:13)
[2020-05-12T20:36:23.130Z]     at Module._compile (internal/modules/cjs/loader.js:1176:30)
[2020-05-12T20:36:23.130Z]     at Object.Module._extensions..js (internal/modules/cjs/loader.js:1196:10)
[2020-05-12T20:36:23.130Z]     at Module.load (internal/modules/cjs/loader.js:1040:32)
[2020-05-12T20:36:23.130Z]     at Function.Module._load (internal/modules/cjs/loader.js:929:14)
[2020-05-12T20:36:23.130Z]     at Module.require (internal/modules/cjs/loader.js:1080:19)
[2020-05-12T20:36:23.130Z]     at require (internal/modules/cjs/helpers.js:72:18)
[2020-05-12T20:36:23.130Z]     at Object.<anonymous> (/build/npm/src/cli-6.14.5/scripts/docs-build.js:4:14)
[2020-05-12T20:36:23.130Z]     at Module._compile (internal/modules/cjs/loader.js:1176:30)
[2020-05-12T20:36:23.130Z]     at Object.Module._extensions..js (internal/modules/cjs/loader.js:1196:10)
[2020-05-12T20:36:23.130Z] /usr/lib/node_modules/marked-man/lib/marked-man.js:8
[2020-05-12T20:36:23.130Z] InlineLexer.prototype.html_output = InlineLexer.prototype.output;
[2020-05-12T20:36:23.130Z]             ^
[2020-05-12T20:36:23.130Z] 
[2020-05-12T20:36:23.130Z] TypeError: Cannot read property 'prototype' of undefined
[2020-05-12T20:36:23.130Z]     at Object.<anonymous> (/usr/lib/node_modules/marked-man/lib/marked-man.js:8:13)
[2020-05-12T20:36:23.130Z]     at Module._compile (internal/modules/cjs/loader.js:1176:30)
[2020-05-12T20:36:23.130Z]     at Object.Module._extensions..js (internal/modules/cjs/loader.js:1196:10)
[2020-05-12T20:36:23.130Z]     at Module.load (internal/modules/cjs/loader.js:1040:32)
[2020-05-12T20:36:23.130Z]     at Function.Module._load (internal/modules/cjs/loader.js:929:14)
[2020-05-12T20:36:23.130Z]     at Module.require (internal/modules/cjs/loader.js:1080:19)
[2020-05-12T20:36:23.130Z]     at require (internal/modules/cjs/helpers.js:72:18)
[2020-05-12T20:36:23.130Z]     at Object.<anonymous> (/build/npm/src/cli-6.14.5/scripts/docs-build.js:4:14)
[2020-05-12T20:36:23.130Z]     at Module._compile (internal/modules/cjs/loader.js:1176:30)
[2020-05-12T20:36:23.130Z]     at Object.Module._extensions..js (internal/modules/cjs/loader.js:1196:10)
[2020-05-12T20:36:23.130Z] /usr/lib/node_modules/marked-man/lib/marked-man.js:8
[2020-05-12T20:36:23.130Z] InlineLexer.prototype.html_output = InlineLexer.prototype.output;
[2020-05-12T20:36:23.130Z]             ^
[2020-05-12T20:36:23.130Z] 
[2020-05-12T20:36:23.130Z] TypeError: Cannot read property 'prototype' of undefined
[2020-05-12T20:36:23.130Z]     at Object.<anonymous> (/usr/lib/node_modules/marked-man/lib/marked-man.js:8:13)
[2020-05-12T20:36:23.130Z]     at Module._compile (internal/modules/cjs/loader.js:1176:30)
[2020-05-12T20:36:23.130Z]     at Object.Module._extensions..js (internal/modules/cjs/loader.js:1196:10)
[2020-05-12T20:36:23.130Z]     at Module.load (internal/modules/cjs/loader.js:1040:32)
[2020-05-12T20:36:23.130Z]     at Function.Module._load (internal/modules/cjs/loader.js:929:14)
[2020-05-12T20:36:23.130Z]     at Module.require (internal/modules/cjs/loader.js:1080:19)
[2020-05-12T20:36:23.130Z]     at require (internal/modules/cjs/helpers.js:72:18)
[2020-05-12T20:36:23.130Z]     at Object.<anonymous> (/build/npm/src/cli-6.14.5/scripts/docs-build.js:4:14)
[2020-05-12T20:36:23.130Z]     at Module._compile (internal/modules/cjs/loader.js:1176:30)
[2020-05-12T20:36:23.130Z]     at Object.Module._extensions..js (internal/modules/cjs/loader.js:1196:10)
[2020-05-12T20:36:23.130Z] make: *** [Makefile:85: man/man1/npm-star.1] Error 1
[2020-05-12T20:36:23.130Z] make: *** [Makefile:85: man/man1/npm-view.1] Error 1
[2020-05-12T20:36:23.130Z] /usr/lib/node_modules/marked-man/lib/marked-man.js:8
[2020-05-12T20:36:23.130Z] InlineLexer.prototype.html_output = InlineLexer.prototype.output;
[2020-05-12T20:36:23.130Z]             ^
[2020-05-12T20:36:23.130Z] 
[2020-05-12T20:36:23.130Z] TypeError: Cannot read property 'prototype' of undefined
[2020-05-12T20:36:23.130Z]     at Object.<anonymous> (/usr/lib/node_modules/marked-man/lib/marked-man.js:8:13)
[2020-05-12T20:36:23.130Z]     at Module._compile (internal/modules/cjs/loader.js:1176:30)
[2020-05-12T20:36:23.130Z]     at Object.Module._extensions..js (internal/modules/cjs/loader.js:1196:10)
[2020-05-12T20:36:23.130Z]     at Module.load (internal/modules/cjs/loader.js:1040:32)
[2020-05-12T20:36:23.130Z]     at Function.Module._load (internal/modules/cjs/loader.js:929:14)
[2020-05-12T20:36:23.130Z]     at Module.require (internal/modules/cjs/loader.js:1080:19)
[2020-05-12T20:36:23.130Z]     at require (internal/modules/cjs/helpers.js:72:18)
[2020-05-12T20:36:23.130Z]     at Object.<anonymous> (/build/npm/src/cli-6.14.5/scripts/docs-build.js:4:14)
[2020-05-12T20:36:23.130Z]     at Module._compile (internal/modules/cjs/loader.js:1176:30)
[2020-05-12T20:36:23.130Z]     at Object.Module._extensions..js (internal/modules/cjs/loader.js:1196:10)
[2020-05-12T20:36:23.130Z] make: *** [Makefile:85: man/man1/npm-team.1] Error 1
[2020-05-12T20:36:23.130Z] make: *** [Makefile:85: man/man1/npm-start.1] Error 1
[2020-05-12T20:36:23.130Z] /usr/lib/node_modules/marked-man/lib/marked-man.js:8
[2020-05-12T20:36:23.130Z] InlineLexer.prototype.html_output = InlineLexer.prototype.output;
[2020-05-12T20:36:23.130Z]             ^
[2020-05-12T20:36:23.130Z] 
[2020-05-12T20:36:23.130Z] TypeError: Cannot read property 'prototype' of undefined
[2020-05-12T20:36:23.130Z]     at Object.<anonymous> (/usr/lib/node_modules/marked-man/lib/marked-man.js:8:13)
[2020-05-12T20:36:23.130Z]     at Module._compile (internal/modules/cjs/loader.js:1176:30)
[2020-05-12T20:36:23.130Z]     at Object.Module._extensions..js (internal/modules/cjs/loader.js:1196:10)
[2020-05-12T20:36:23.130Z]     at Module.load (internal/modules/cjs/loader.js:1040:32)
[2020-05-12T20:36:23.130Z]     at Function.Module._load (internal/modules/cjs/loader.js:929:14)
[2020-05-12T20:36:23.130Z]     at Module.require (internal/modules/cjs/loader.js:1080:19)
[2020-05-12T20:36:23.130Z]     at require (internal/modules/cjs/helpers.js:72:18)
[2020-05-12T20:36:23.130Z]     at Object.<anonymous> (/build/npm/src/cli-6.14.5/scripts/docs-build.js:4:14)
[2020-05-12T20:36:23.130Z]     at Module._compile (internal/modules/cjs/loader.js:1176:30)
[2020-05-12T20:36:23.130Z]     at Object.Module._extensions..js (internal/modules/cjs/loader.js:1196:10)
[2020-05-12T20:36:23.130Z] /usr/lib/node_modules/marked-man/lib/marked-man.js:8
[2020-05-12T20:36:23.130Z] InlineLexer.prototype.html_output = InlineLexer.prototype.output;
[2020-05-12T20:36:23.130Z]             ^
[2020-05-12T20:36:23.130Z] 
[2020-05-12T20:36:23.130Z] TypeError: Cannot read property 'prototype' of undefined
[2020-05-12T20:36:23.130Z]     at Object.<anonymous> (/usr/lib/node_modules/marked-man/lib/marked-man.js:8:13)
[2020-05-12T20:36:23.130Z]     at Module._compile (internal/modules/cjs/loader.js:1176:30)
[2020-05-12T20:36:23.130Z]     at Object.Module._extensions..js (internal/modules/cjs/loader.js:1196:10)
[2020-05-12T20:36:23.130Z]     at Module.load (internal/modules/cjs/loader.js:1040:32)
[2020-05-12T20:36:23.130Z]     at Function.Module._load (internal/modules/cjs/loader.js:929:14)
[2020-05-12T20:36:23.130Z]     at Module.require (internal/modules/cjs/loader.js:1080:19)
[2020-05-12T20:36:23.130Z]     at require (internal/modules/cjs/helpers.js:72:18)
[2020-05-12T20:36:23.130Z]     at Object.<anonymous> (/build/npm/src/cli-6.14.5/scripts/docs-build.js:4:14)
[2020-05-12T20:36:23.130Z]     at Module._compile (internal/modules/cjs/loader.js:1176:30)
[2020-05-12T20:36:23.130Z]     at Object.Module._extensions..js (internal/modules/cjs/loader.js:1196:10)
[2020-05-12T20:36:23.130Z] /usr/lib/node_modules/marked-man/lib/marked-man.js:8
[2020-05-12T20:36:23.130Z] InlineLexer.prototype.html_output = InlineLexer.prototype.output;
[2020-05-12T20:36:23.130Z]             ^
[2020-05-12T20:36:23.131Z] 
[2020-05-12T20:36:23.131Z] TypeError: Cannot read property 'prototype' of undefined
[2020-05-12T20:36:23.131Z]     at Object.<anonymous> (/usr/lib/node_modules/marked-man/lib/marked-man.js:8:13)
[2020-05-12T20:36:23.131Z]     at Module._compile (internal/modules/cjs/loader.js:1176:30)
[2020-05-12T20:36:23.131Z]     at Object.Module._extensions..js (internal/modules/cjs/loader.js:1196:10)
[2020-05-12T20:36:23.131Z]     at Module.load (internal/modules/cjs/loader.js:1040:32)
[2020-05-12T20:36:23.131Z]     at Function.Module._load (internal/modules/cjs/loader.js:929:14)
[2020-05-12T20:36:23.131Z]     at Module.require (internal/modules/cjs/loader.js:1080:19)
[2020-05-12T20:36:23.131Z]     at require (internal/modules/cjs/helpers.js:72:18)
[2020-05-12T20:36:23.131Z]     at Object.<anonymous> (/build/npm/src/cli-6.14.5/scripts/docs-build.js:4:14)
[2020-05-12T20:36:23.131Z]     at Module._compile (internal/modules/cjs/loader.js:1176:30)
[2020-05-12T20:36:23.131Z]     at Object.Module._extensions..js (internal/modules/cjs/loader.js:1196:10)
[2020-05-12T20:36:23.131Z] /usr/lib/node_modules/marked-man/lib/marked-man.js:8
[2020-05-12T20:36:23.131Z] InlineLexer.prototype.html_output = InlineLexer.prototype.output;
[2020-05-12T20:36:23.131Z]             ^
[2020-05-12T20:36:23.131Z] 
[2020-05-12T20:36:23.131Z] TypeError: Cannot read property 'prototype' of undefined
[2020-05-12T20:36:23.131Z]     at Object.<anonymous> (/usr/lib/node_modules/marked-man/lib/marked-man.js:8:13)
[2020-05-12T20:36:23.131Z]     at Module._compile (internal/modules/cjs/loader.js:1176:30)
[2020-05-12T20:36:23.131Z]     at Object.Module._extensions..js (internal/modules/cjs/loader.js:1196:10)
[2020-05-12T20:36:23.131Z]     at Module.load (internal/modules/cjs/loader.js:1040:32)
[2020-05-12T20:36:23.131Z]     at Function.Module._load (internal/modules/cjs/loader.js:929:14)
[2020-05-12T20:36:23.131Z]     at Module.require (internal/modules/cjs/loader.js:1080:19)
[2020-05-12T20:36:23.131Z]     at require (internal/modules/cjs/helpers.js:72:18)
[2020-05-12T20:36:23.131Z]     at Object.<anonymous> (/build/npm/src/cli-6.14.5/scripts/docs-build.js:4:14)
[2020-05-12T20:36:23.131Z]     at Module._compile (internal/modules/cjs/loader.js:1176:30)
[2020-05-12T20:36:23.131Z]     at Object.Module._extensions..js (internal/modules/cjs/loader.js:1196:10)
[2020-05-12T20:36:23.131Z] /usr/lib/node_modules/marked-man/lib/marked-man.js:8
[2020-05-12T20:36:23.131Z] InlineLexer.prototype.html_output = InlineLexer.prototype.output;
[2020-05-12T20:36:23.131Z]             ^
[2020-05-12T20:36:23.131Z] 
[2020-05-12T20:36:23.131Z] TypeError: Cannot read property 'prototype' of undefined
[2020-05-12T20:36:23.131Z]     at Object.<anonymous> (/usr/lib/node_modules/marked-man/lib/marked-man.js:8:13)
[2020-05-12T20:36:23.131Z]     at Module._compile (internal/modules/cjs/loader.js:1176:30)
[2020-05-12T20:36:23.131Z]     at Object.Module._extensions..js (internal/modules/cjs/loader.js:1196:10)
[2020-05-12T20:36:23.131Z]     at Module.load (internal/modules/cjs/loader.js:1040:32)
[2020-05-12T20:36:23.131Z]     at Function.Module._load (internal/modules/cjs/loader.js:929:14)
[2020-05-12T20:36:23.131Z]     at Module.require (internal/modules/cjs/loader.js:1080:19)
[2020-05-12T20:36:23.131Z]     at require (internal/modules/cjs/helpers.js:72:18)
[2020-05-12T20:36:23.131Z]     at Object.<anonymous> (/build/npm/src/cli-6.14.5/scripts/docs-build.js:4:14)
[2020-05-12T20:36:23.131Z]     at Module._compile (internal/modules/cjs/loader.js:1176:30)
[2020-05-12T20:36:23.131Z]     at Object.Module._extensions..js (internal/modules/cjs/loader.js:1196:10)
[2020-05-12T20:36:23.131Z] make: *** [Makefile:85: man/man1/npm-whoami.1] Error 1
[2020-05-12T20:36:23.131Z] make: *** [Makefile:85: man/man1/npm.1] Error 1
[2020-05-12T20:36:23.131Z] /usr/lib/node_modules/marked-man/lib/marked-man.js:8
[2020-05-12T20:36:23.131Z] InlineLexer.prototype.html_output = InlineLexer.prototype.output;
[2020-05-12T20:36:23.131Z]             ^
[2020-05-12T20:36:23.131Z] 
[2020-05-12T20:36:23.131Z] TypeError: Cannot read property 'prototype' of undefined
[2020-05-12T20:36:23.131Z]     at Object.<anonymous> (/usr/lib/node_modules/marked-man/lib/marked-man.js:8:13)
[2020-05-12T20:36:23.131Z]     at Module._compile (internal/modules/cjs/loader.js:1176:30)
[2020-05-12T20:36:23.131Z]     at Object.Module._extensions..js (internal/modules/cjs/loader.js:1196:10)
[2020-05-12T20:36:23.131Z]     at Module.load (internal/modules/cjs/loader.js:1040:32)
[2020-05-12T20:36:23.131Z]     at Function.Module._load (internal/modules/cjs/loader.js:929:14)
[2020-05-12T20:36:23.131Z]     at Module.require (internal/modules/cjs/loader.js:1080:19)
[2020-05-12T20:36:23.131Z]     at require (internal/modules/cjs/helpers.js:72:18)
[2020-05-12T20:36:23.131Z]     at Object.<anonymous> (/build/npm/src/cli-6.14.5/scripts/docs-build.js:4:14)
[2020-05-12T20:36:23.131Z]     at Module._compile (internal/modules/cjs/loader.js:1176:30)
[2020-05-12T20:36:23.131Z]     at Object.Module._extensions..js (internal/modules/cjs/loader.js:1196:10)
[2020-05-12T20:36:23.131Z] /usr/lib/node_modules/marked-man/lib/marked-man.js:8
[2020-05-12T20:36:23.131Z] InlineLexer.prototype.html_output = InlineLexer.prototype.output;
[2020-05-12T20:36:23.131Z]             ^
[2020-05-12T20:36:23.131Z] 
[2020-05-12T20:36:23.131Z] TypeError: Cannot read property 'prototype' of undefined
[2020-05-12T20:36:23.131Z]     at Object.<anonymous> (/usr/lib/node_modules/marked-man/lib/marked-man.js:8:13)
[2020-05-12T20:36:23.131Z]     at Module._compile (internal/modules/cjs/loader.js:1176:30)
[2020-05-12T20:36:23.131Z]     at Object.Module._extensions..js (internal/modules/cjs/loader.js:1196:10)
[2020-05-12T20:36:23.131Z]     at Module.load (internal/modules/cjs/loader.js:1040:32)
[2020-05-12T20:36:23.131Z]     at Function.Module._load (internal/modules/cjs/loader.js:929:14)
[2020-05-12T20:36:23.131Z]     at Module.require (internal/modules/cjs/loader.js:1080:19)
[2020-05-12T20:36:23.131Z]     at require (internal/modules/cjs/helpers.js:72:18)
[2020-05-12T20:36:23.131Z]     at Object.<anonymous> (/build/npm/src/cli-6.14.5/scripts/docs-build.js:4:14)
[2020-05-12T20:36:23.131Z]     at Module._compile (internal/modules/cjs/loader.js:1176:30)
[2020-05-12T20:36:23.131Z]     at Object.Module._extensions..js (internal/modules/cjs/loader.js:1196:10)
[2020-05-12T20:36:23.131Z] /usr/lib/node_modules/marked-man/lib/marked-man.js:8
[2020-05-12T20:36:23.131Z] InlineLexer.prototype.html_output = InlineLexer.prototype.output;
[2020-05-12T20:36:23.131Z]             ^
[2020-05-12T20:36:23.131Z] 
[2020-05-12T20:36:23.131Z] TypeError: Cannot read property 'prototype' of undefined
[2020-05-12T20:36:23.131Z]     at Object.<anonymous> (/usr/lib/node_modules/marked-man/lib/marked-man.js:8:13)
[2020-05-12T20:36:23.131Z]     at Module._compile (internal/modules/cjs/loader.js:1176:30)
[2020-05-12T20:36:23.131Z]     at Object.Module._extensions..js (internal/modules/cjs/loader.js:1196:10)
[2020-05-12T20:36:23.131Z]     at Module.load (internal/modules/cjs/loader.js:1040:32)
[2020-05-12T20:36:23.131Z]     at Function.Module._load (internal/modules/cjs/loader.js:929:14)
[2020-05-12T20:36:23.131Z]     at Module.require (internal/modules/cjs/loader.js:1080:19)
[2020-05-12T20:36:23.131Z]     at require (internal/modules/cjs/helpers.js:72:18)
[2020-05-12T20:36:23.131Z]     at Object.<anonymous> (/build/npm/src/cli-6.14.5/scripts/docs-build.js:4:14)
[2020-05-12T20:36:23.131Z]     at Module._compile (internal/modules/cjs/loader.js:1176:30)
[2020-05-12T20:36:23.131Z]     at Object.Module._extensions..js (internal/modules/cjs/loader.js:1196:10)
[2020-05-12T20:36:23.131Z] make: *** [Makefile:85: man/man1/npm-stop.1] Error 1
[2020-05-12T20:36:23.131Z] make: *** [Makefile:85: man/man1/npm-restart.1] Error 1
[2020-05-12T20:36:23.131Z] /usr/lib/node_modules/marked-man/lib/marked-man.js:8
[2020-05-12T20:36:23.131Z] InlineLexer.prototype.html_output = InlineLexer.prototype.output;
[2020-05-12T20:36:23.131Z]             ^
[2020-05-12T20:36:23.131Z] 
[2020-05-12T20:36:23.131Z] TypeError: Cannot read property 'prototype' of undefined
[2020-05-12T20:36:23.131Z]     at Object.<anonymous> (/usr/lib/node_modules/marked-man/lib/marked-man.js:8:13)
[2020-05-12T20:36:23.131Z]     at Module._compile (internal/modules/cjs/loader.js:1176:30)
[2020-05-12T20:36:23.131Z]     at Object.Module._extensions..js (internal/modules/cjs/loader.js:1196:10)
[2020-05-12T20:36:23.131Z]     at Module.load (internal/modules/cjs/loader.js:1040:32)
[2020-05-12T20:36:23.131Z]     at Function.Module._load (internal/modules/cjs/loader.js:929:14)
[2020-05-12T20:36:23.131Z]     at Module.require (internal/modules/cjs/loader.js:1080:19)
[2020-05-12T20:36:23.131Z]     at require (internal/modules/cjs/helpers.js:72:18)
[2020-05-12T20:36:23.131Z]     at Object.<anonymous> (/build/npm/src/cli-6.14.5/scripts/docs-build.js:4:14)
[2020-05-12T20:36:23.131Z]     at Module._compile (internal/modules/cjs/loader.js:1176:30)
[2020-05-12T20:36:23.131Z]     at Object.Module._extensions..js (internal/modules/cjs/loader.js:1196:10)
[2020-05-12T20:36:23.131Z] make: *** [Makefile:85: man/man1/npm-unpublish.1] Error 1
[2020-05-12T20:36:23.131Z] make: *** [Makefile:85: man/man1/npm-search.1] Error 1
[2020-05-12T20:36:23.131Z] /usr/lib/node_modules/marked-man/lib/marked-man.js:8
[2020-05-12T20:36:23.131Z] InlineLexer.prototype.html_output = InlineLexer.prototype.output;
[2020-05-12T20:36:23.131Z]             ^
[2020-05-12T20:36:23.131Z] 
[2020-05-12T20:36:23.131Z] TypeError: Cannot read property 'prototype' of undefined
[2020-05-12T20:36:23.132Z]     at Object.<anonymous> (/usr/lib/node_modules/marked-man/lib/marked-man.js:8:13)
[2020-05-12T20:36:23.132Z]     at Module._compile (internal/modules/cjs/loader.js:1176:30)
[2020-05-12T20:36:23.132Z]     at Object.Module._extensions..js (internal/modules/cjs/loader.js:1196:10)
[2020-05-12T20:36:23.132Z]     at Module.load (internal/modules/cjs/loader.js:1040:32)
[2020-05-12T20:36:23.132Z]     at Function.Module._load (internal/modules/cjs/loader.js:929:14)
[2020-05-12T20:36:23.132Z]     at Module.require (internal/modules/cjs/loader.js:1080:19)
[2020-05-12T20:36:23.132Z]     at require (internal/modules/cjs/helpers.js:72:18)
[2020-05-12T20:36:23.132Z]     at Object.<anonymous> (/build/npm/src/cli-6.14.5/scripts/docs-build.js:4:14)
[2020-05-12T20:36:23.132Z]     at Module._compile (internal/modules/cjs/loader.js:1176:30)
[2020-05-12T20:36:23.132Z]     at Object.Module._extensions..js (internal/modules/cjs/loader.js:1196:10)
[2020-05-12T20:36:23.132Z] /usr/lib/node_modules/marked-man/lib/marked-man.js:8
[2020-05-12T20:36:23.132Z] InlineLexer.prototype.html_output = InlineLexer.prototype.output;
[2020-05-12T20:36:23.132Z]             ^
[2020-05-12T20:36:23.132Z] 
[2020-05-12T20:36:23.132Z] TypeError: Cannot read property 'prototype' of undefined
[2020-05-12T20:36:23.132Z]     at Object.<anonymous> (/usr/lib/node_modules/marked-man/lib/marked-man.js:8:13)
[2020-05-12T20:36:23.132Z]     at Module._compile (internal/modules/cjs/loader.js:1176:30)
[2020-05-12T20:36:23.132Z]     at Object.Module._extensions..js (internal/modules/cjs/loader.js:1196:10)
[2020-05-12T20:36:23.132Z]     at Module.load (internal/modules/cjs/loader.js:1040:32)
[2020-05-12T20:36:23.132Z]     at Function.Module._load (internal/modules/cjs/loader.js:929:14)
[2020-05-12T20:36:23.132Z]     at Module.require (internal/modules/cjs/loader.js:1080:19)
[2020-05-12T20:36:23.132Z]     at require (internal/modules/cjs/helpers.js:72:18)
[2020-05-12T20:36:23.132Z]     at Object.<anonymous> (/build/npm/src/cli-6.14.5/scripts/docs-build.js:4:14)
[2020-05-12T20:36:23.132Z]     at Module._compile (internal/modules/cjs/loader.js:1176:30)
[2020-05-12T20:36:23.132Z]     at Object.Module._extensions..js (internal/modules/cjs/loader.js:1196:10)
[2020-05-12T20:36:23.132Z] make: *** [Makefile:85: man/man1/npm-test.1] Error 1
[2020-05-12T20:36:23.132Z] make: *** [Makefile:85: man/man1/npm-token.1] Error 1
[2020-05-12T20:36:23.132Z] make: *** [Makefile:85: man/man1/npm-update.1] Error 1
[2020-05-12T20:36:23.132Z] make: *** [Makefile:85: man/man1/npm-uninstall.1] Error 1
[2020-05-12T20:36:23.132Z] make: *** [Makefile:85: man/man1/npm-profile.1] Error 1
[2020-05-12T20:36:23.132Z] /usr/lib/node_modules/marked-man/lib/marked-man.js:8
[2020-05-12T20:36:23.132Z] InlineLexer.prototype.html_output = InlineLexer.prototype.output;
[2020-05-12T20:36:23.132Z]             ^
[2020-05-12T20:36:23.132Z] 
[2020-05-12T20:36:23.132Z] TypeError: Cannot read property 'prototype' of undefined
[2020-05-12T20:36:23.132Z]     at Object.<anonymous> (/usr/lib/node_modules/marked-man/lib/marked-man.js:8:13)
[2020-05-12T20:36:23.132Z]     at Module._compile (internal/modules/cjs/loader.js:1176:30)
[2020-05-12T20:36:23.132Z]     at Object.Module._extensions..js (internal/modules/cjs/loader.js:1196:10)
[2020-05-12T20:36:23.132Z]     at Module.load (internal/modules/cjs/loader.js:1040:32)
[2020-05-12T20:36:23.132Z]     at Function.Module._load (internal/modules/cjs/loader.js:929:14)
[2020-05-12T20:36:23.132Z]     at Module.require (internal/modules/cjs/loader.js:1080:19)
[2020-05-12T20:36:23.132Z]     at require (internal/modules/cjs/helpers.js:72:18)
[2020-05-12T20:36:23.132Z]     at Object.<anonymous> (/build/npm/src/cli-6.14.5/scripts/docs-build.js:4:14)
[2020-05-12T20:36:23.132Z]     at Module._compile (internal/modules/cjs/loader.js:1176:30)
[2020-05-12T20:36:23.132Z]     at Object.Module._extensions..js (internal/modules/cjs/loader.js:1196:10)
[2020-05-12T20:36:23.132Z] /usr/lib/node_modules/marked-man/lib/marked-man.js:8
[2020-05-12T20:36:23.132Z] InlineLexer.prototype.html_output = InlineLexer.prototype.output;
[2020-05-12T20:36:23.132Z]             ^
[2020-05-12T20:36:23.132Z] 
[2020-05-12T20:36:23.132Z] TypeError: Cannot read property 'prototype' of undefined
[2020-05-12T20:36:23.132Z]     at Object.<anonymous> (/usr/lib/node_modules/marked-man/lib/marked-man.js:8:13)
[2020-05-12T20:36:23.132Z]     at Module._compile (internal/modules/cjs/loader.js:1176:30)
[2020-05-12T20:36:23.132Z]     at Object.Module._extensions..js (internal/modules/cjs/loader.js:1196:10)
[2020-05-12T20:36:23.132Z]     at Module.load (internal/modules/cjs/loader.js:1040:32)
[2020-05-12T20:36:23.132Z]     at Function.Module._load (internal/modules/cjs/loader.js:929:14)
[2020-05-12T20:36:23.132Z]     at Module.require (internal/modules/cjs/loader.js:1080:19)
[2020-05-12T20:36:23.132Z]     at require (internal/modules/cjs/helpers.js:72:18)
[2020-05-12T20:36:23.132Z]     at Object.<anonymous> (/build/npm/src/cli-6.14.5/scripts/docs-build.js:4:14)
[2020-05-12T20:36:23.132Z]     at Module._compile (internal/modules/cjs/loader.js:1176:30)
[2020-05-12T20:36:23.132Z]     at Object.Module._extensions..js (internal/modules/cjs/loader.js:1196:10)
[2020-05-12T20:36:23.132Z] make: *** [Makefile:85: man/man1/npm-repo.1] Error 1
[2020-05-12T20:36:23.132Z] make: *** [Makefile:85: man/man1/npm-publish.1] Error 1
[2020-05-12T20:36:23.132Z] /usr/lib/node_modules/marked-man/lib/marked-man.js:8
[2020-05-12T20:36:23.132Z] InlineLexer.prototype.html_output = InlineLexer.prototype.output;
[2020-05-12T20:36:23.132Z]             ^
[2020-05-12T20:36:23.132Z] 
[2020-05-12T20:36:23.132Z] TypeError: Cannot read property 'prototype' of undefined
[2020-05-12T20:36:23.132Z]     at Object.<anonymous> (/usr/lib/node_modules/marked-man/lib/marked-man.js:8:13)
[2020-05-12T20:36:23.132Z]     at Module._compile (internal/modules/cjs/loader.js:1176:30)
[2020-05-12T20:36:23.132Z]     at Object.Module._extensions..js (internal/modules/cjs/loader.js:1196:10)
[2020-05-12T20:36:23.132Z]     at Module.load (internal/modules/cjs/loader.js:1040:32)
[2020-05-12T20:36:23.132Z]     at Function.Module._load (internal/modules/cjs/loader.js:929:14)
[2020-05-12T20:36:23.132Z]     at Module.require (internal/modules/cjs/loader.js:1080:19)
[2020-05-12T20:36:23.132Z]     at require (internal/modules/cjs/helpers.js:72:18)
[2020-05-12T20:36:23.132Z]     at Object.<anonymous> (/build/npm/src/cli-6.14.5/scripts/docs-build.js:4:14)
[2020-05-12T20:36:23.132Z]     at Module._compile (internal/modules/cjs/loader.js:1176:30)
[2020-05-12T20:36:23.132Z]     at Object.Module._extensions..js (internal/modules/cjs/loader.js:1196:10)
[2020-05-12T20:36:23.132Z] make: *** [Makefile:85: man/man1/npm-prune.1] Error 1
[2020-05-12T20:36:23.132Z] /usr/lib/node_modules/marked-man/lib/marked-man.js:8
[2020-05-12T20:36:23.132Z] InlineLexer.prototype.html_output = InlineLexer.prototype.output;
[2020-05-12T20:36:23.132Z]             ^
[2020-05-12T20:36:23.132Z] 
[2020-05-12T20:36:23.132Z] TypeError: Cannot read property 'prototype' of undefined
[2020-05-12T20:36:23.132Z]     at Object.<anonymous> (/usr/lib/node_modules/marked-man/lib/marked-man.js:8:13)
[2020-05-12T20:36:23.132Z]     at Module._compile (internal/modules/cjs/loader.js:1176:30)
[2020-05-12T20:36:23.132Z]     at Object.Module._extensions..js (internal/modules/cjs/loader.js:1196:10)
[2020-05-12T20:36:23.132Z]     at Module.load (internal/modules/cjs/loader.js:1040:32)
[2020-05-12T20:36:23.132Z]     at Function.Module._load (internal/modules/cjs/loader.js:929:14)
[2020-05-12T20:36:23.132Z]     at Module.require (internal/modules/cjs/loader.js:1080:19)
[2020-05-12T20:36:23.132Z]     at require (internal/modules/cjs/helpers.js:72:18)
[2020-05-12T20:36:23.132Z]     at Object.<anonymous> (/build/npm/src/cli-6.14.5/scripts/docs-build.js:4:14)
[2020-05-12T20:36:23.132Z]     at Module._compile (internal/modules/cjs/loader.js:1176:30)
[2020-05-12T20:36:23.132Z]     at Object.Module._extensions..js (internal/modules/cjs/loader.js:1196:10)
[2020-05-12T20:36:23.132Z] /usr/lib/node_modules/marked-man/lib/marked-man.js:8
[2020-05-12T20:36:23.132Z] InlineLexer.prototype.html_output = InlineLexer.prototype.output;
[2020-05-12T20:36:23.132Z]             ^
[2020-05-12T20:36:23.132Z] 
[2020-05-12T20:36:23.132Z] TypeError: Cannot read property 'prototype' of undefined
[2020-05-12T20:36:23.132Z]     at Object.<anonymous> (/usr/lib/node_modules/marked-man/lib/marked-man.js:8:13)
[2020-05-12T20:36:23.132Z]     at Module._compile (internal/modules/cjs/loader.js:1176:30)
[2020-05-12T20:36:23.132Z]     at Object.Module._extensions..js (internal/modules/cjs/loader.js:1196:10)
[2020-05-12T20:36:23.132Z]     at Module.load (internal/modules/cjs/loader.js:1040:32)
[2020-05-12T20:36:23.132Z]     at Function.Module._load (internal/modules/cjs/loader.js:929:14)
[2020-05-12T20:36:23.132Z]     at Module.require (internal/modules/cjs/loader.js:1080:19)
[2020-05-12T20:36:23.132Z]     at require (internal/modules/cjs/helpers.js:72:18)
[2020-05-12T20:36:23.132Z]     at Object.<anonymous> (/build/npm/src/cli-6.14.5/scripts/docs-build.js:4:14)
[2020-05-12T20:36:23.132Z]     at Module._compile (internal/modules/cjs/loader.js:1176:30)
[2020-05-12T20:36:23.132Z]     at Object.Module._extensions..js (internal/modules/cjs/loader.js:1196:10)
[2020-05-12T20:36:23.132Z] make: *** [Makefile:85: man/man1/npm-stars.1] Error 1
[2020-05-12T20:36:23.132Z] /usr/lib/node_modules/marked-man/lib/marked-man.js:8
[2020-05-12T20:36:23.133Z] InlineLexer.prototype.html_output = InlineLexer.prototype.output;
[2020-05-12T20:36:23.133Z]             ^
[2020-05-12T20:36:23.133Z] 
[2020-05-12T20:36:23.133Z] TypeError: Cannot read property 'prototype' of undefined
[2020-05-12T20:36:23.133Z]     at Object.<anonymous> (/usr/lib/node_modules/marked-man/lib/marked-man.js:8:13)
[2020-05-12T20:36:23.133Z]     at Module._compile (internal/modules/cjs/loader.js:1176:30)
[2020-05-12T20:36:23.133Z]     at Object.Module._extensions..js (internal/modules/cjs/loader.js:1196:10)
[2020-05-12T20:36:23.133Z]     at Module.load (internal/modules/cjs/loader.js:1040:32)
[2020-05-12T20:36:23.133Z]     at Function.Module._load (internal/modules/cjs/loader.js:929:14)
[2020-05-12T20:36:23.133Z]     at Module.require (internal/modules/cjs/loader.js:1080:19)
[2020-05-12T20:36:23.133Z]     at require (internal/modules/cjs/helpers.js:72:18)
[2020-05-12T20:36:23.133Z]     at Object.<anonymous> (/build/npm/src/cli-6.14.5/scripts/docs-build.js:4:14)
[2020-05-12T20:36:23.133Z]     at Module._compile (internal/modules/cjs/loader.js:1176:30)
[2020-05-12T20:36:23.133Z]     at Object.Module._extensions..js (internal/modules/cjs/loader.js:1196:10)
[2020-05-12T20:36:23.133Z] make: *** [Makefile:85: man/man1/npm-run-script.1] Error 1
[2020-05-12T20:36:23.133Z] make: *** [Makefile:85: man/man1/npm-root.1] Error 1
[2020-05-12T20:36:23.133Z] /usr/lib/node_modules/marked-man/lib/marked-man.js:8
[2020-05-12T20:36:23.133Z] InlineLexer.prototype.html_output = InlineLexer.prototype.output;
[2020-05-12T20:36:23.133Z]             ^
[2020-05-12T20:36:23.133Z] 
[2020-05-12T20:36:23.133Z] TypeError: Cannot read property 'prototype' of undefined
[2020-05-12T20:36:23.133Z]     at Object.<anonymous> (/usr/lib/node_modules/marked-man/lib/marked-man.js:8:13)
[2020-05-12T20:36:23.133Z]     at Module._compile (internal/modules/cjs/loader.js:1176:30)
[2020-05-12T20:36:23.133Z]     at Object.Module._extensions..js (internal/modules/cjs/loader.js:1196:10)
[2020-05-12T20:36:23.133Z]     at Module.load (internal/modules/cjs/loader.js:1040:32)
[2020-05-12T20:36:23.133Z]     at Function.Module._load (internal/modules/cjs/loader.js:929:14)
[2020-05-12T20:36:23.133Z]     at Module.require (internal/modules/cjs/loader.js:1080:19)
[2020-05-12T20:36:23.133Z]     at require (internal/modules/cjs/helpers.js:72:18)
[2020-05-12T20:36:23.133Z]     at Object.<anonymous> (/build/npm/src/cli-6.14.5/scripts/docs-build.js:4:14)
[2020-05-12T20:36:23.133Z]     at Module._compile (internal/modules/cjs/loader.js:1176:30)
[2020-05-12T20:36:23.133Z]     at Object.Module._extensions..js (internal/modules/cjs/loader.js:1196:10)
[2020-05-12T20:36:23.133Z] make: *** [Makefile:85: man/man1/npm-shrinkwrap.1] Error 1
[2020-05-12T20:36:23.133Z] /usr/lib/node_modules/marked-man/lib/marked-man.js:8
[2020-05-12T20:36:23.133Z] InlineLexer.prototype.html_output = InlineLexer.prototype.output;
[2020-05-12T20:36:23.133Z]             ^
[2020-05-12T20:36:23.133Z] 
[2020-05-12T20:36:23.133Z] TypeError: Cannot read property 'prototype' of undefined
[2020-05-12T20:36:23.133Z]     at Object.<anonymous> (/usr/lib/node_modules/marked-man/lib/marked-man.js:8:13)
[2020-05-12T20:36:23.133Z]     at Module._compile (internal/modules/cjs/loader.js:1176:30)
[2020-05-12T20:36:23.133Z]     at Object.Module._extensions..js (internal/modules/cjs/loader.js:1196:10)
[2020-05-12T20:36:23.133Z]     at Module.load (internal/modules/cjs/loader.js:1040:32)
[2020-05-12T20:36:23.133Z]     at Function.Module._load (internal/modules/cjs/loader.js:929:14)
[2020-05-12T20:36:23.133Z]     at Module.require (internal/modules/cjs/loader.js:1080:19)
[2020-05-12T20:36:23.133Z]     at require (internal/modules/cjs/helpers.js:72:18)
[2020-05-12T20:36:23.133Z]     at Object.<anonymous> (/build/npm/src/cli-6.14.5/scripts/docs-build.js:4:14)
[2020-05-12T20:36:23.133Z]     at Module._compile (internal/modules/cjs/loader.js:1176:30)
[2020-05-12T20:36:23.133Z]     at Object.Module._extensions..js (internal/modules/cjs/loader.js:1196:10)
[2020-05-12T20:36:23.133Z] make: *** [Makefile:85: man/man1/npm-rebuild.1] Error 1
[2020-05-12T20:36:23.133Z] ==> ERROR: A failure occurred in build().
[2020-05-12T20:36:23.133Z]     Aborting...
[2020-05-12T20:36:24.044Z] ==> ERROR: Build failed, check /build/buildpkg/default-x86_64/jenkins/build
[Pipeline] }
[Pipeline] // dir
Post stage
[Pipeline] emailext
[2020-05-12T20:36:24.233Z] Sending email to: artix-build-failures at artixlinux.org


More information about the artix-build-failures mailing list