[artix-build-failures] [goblins] Failure: apparmor

jenkins at artixlinux.org jenkins at artixlinux.org
Sun Jun 21 21:09:42 CEST 2020


   Failure

   Build: x86_64/staging

   Packages:

   apparmor-2.13.4-6-x86_64.pkg.tar.zst

   author: artoo

   email: artoo at artixlinux.org

   [1]https://orion.artixlinux.org/job/packagesA/job/apparmor/job/master/1
   3/

References

   1. https://orion.artixlinux.org/job/packagesA/job/apparmor/job/master/13/
-------------- next part --------------
Push event to branch master
Querying the current revision of branch master...
Current revision of branch master is 7204604c5b6cae93b698b9409a48691f9e9e4da9
Obtained Jenkinsfile from 7204604c5b6cae93b698b9409a48691f9e9e4da9
Running in Durability level: PERFORMANCE_OPTIMIZED
Loading library artix-ci at master
Attempting to resolve master from remote references...
 > git --version # timeout=10
 > git ls-remote -- https://gitea.artixlinux.org/artix/pipeline-libs.git # timeout=10
Found match: refs/heads/master revision d7992e76739bba40e5e57f4e22437a25787e3cb7
Warning: CredentialId "gitea-ci" could not be found.
 > git rev-parse --is-inside-work-tree # timeout=10
Fetching changes from the remote Git repository
 > git config remote.origin.url https://gitea.artixlinux.org/artix/pipeline-libs.git # timeout=10
Fetching without tags
Fetching upstream changes from https://gitea.artixlinux.org/artix/pipeline-libs.git
 > git --version # timeout=10
 > git fetch --no-tags --force --progress -- https://gitea.artixlinux.org/artix/pipeline-libs.git +refs/heads/master:refs/remotes/origin/master # timeout=10
Checking out Revision d7992e76739bba40e5e57f4e22437a25787e3cb7 (master)
 > git config core.sparsecheckout # timeout=10
 > git checkout -f d7992e76739bba40e5e57f4e22437a25787e3cb7 # timeout=10
Commit message: "adjust arch map"
[Gitea] Notifying branch build status: PENDING Build started...
[Gitea] Notified
[Pipeline] Start of Pipeline
[Pipeline] node
Running on Jenkins in /build/jenkins/workspace/packagesA_apparmor_master
[Pipeline] {
[Pipeline] timestamps
[Pipeline] {
[Pipeline] stage
[Pipeline] { (Prepare)
[Pipeline] catchError
[Pipeline] {
[Pipeline] checkout
[2020-06-21T19:04:59.596Z] Warning: CredentialId "jenkins-ci" could not be found.
[2020-06-21T19:04:59.597Z]  > git rev-parse --is-inside-work-tree # timeout=10
[2020-06-21T19:04:59.605Z] Fetching changes from the remote Git repository
[2020-06-21T19:04:59.605Z]  > git config remote.origin.url https://237b7412742b4068af4173944de150f12959f4d3@gitea.artixlinux.org/packagesA/apparmor.git # timeout=10
[2020-06-21T19:04:59.611Z] Cleaning workspace
[2020-06-21T19:04:59.611Z]  > git rev-parse --verify HEAD # timeout=10
[2020-06-21T19:04:59.617Z] Resetting working tree
[2020-06-21T19:04:59.617Z]  > git reset --hard # timeout=10
[2020-06-21T19:04:59.632Z]  > git clean -fdx # timeout=10
[2020-06-21T19:04:59.638Z] Fetching without tags
[2020-06-21T19:04:59.638Z] Fetching upstream changes from https://237b7412742b4068af4173944de150f12959f4d3@gitea.artixlinux.org/packagesA/apparmor.git
[2020-06-21T19:04:59.638Z]  > git --version # timeout=10
[2020-06-21T19:04:59.643Z]  > git fetch --no-tags --force --progress -- https://237b7412742b4068af4173944de150f12959f4d3@gitea.artixlinux.org/packagesA/apparmor.git +refs/heads/master:refs/remotes/origin/master # timeout=10
[2020-06-21T19:04:59.785Z] Checking out Revision 7204604c5b6cae93b698b9409a48691f9e9e4da9 (master)
[2020-06-21T19:04:59.785Z]  > git config core.sparsecheckout # timeout=10
[2020-06-21T19:04:59.790Z]  > git checkout -f 7204604c5b6cae93b698b9409a48691f9e9e4da9 # timeout=10
[2020-06-21T19:04:59.803Z] Commit message: "[trunk] -> [staging] 'apparmor-2.13.4-6' add"
[2020-06-21T19:04:59.803Z]  > git rev-list --no-walk 697b7b9dfb428a8e2e43df28177f35f1fee968a6 # timeout=10
[2020-06-21T19:04:59.817Z] [Gitea] Notifying branch build status: PENDING Build started...
[2020-06-21T19:04:59.951Z] [Gitea] Notified
[Pipeline] libraryResource
[Pipeline] readYaml
[Pipeline] sh
[2020-06-21T19:05:00.225Z] + git show -s --format=%an 7204604c5b6cae93b698b9409a48691f9e9e4da9
[Pipeline] sh
[2020-06-21T19:05:00.482Z] + git show -s --format=%ae 7204604c5b6cae93b698b9409a48691f9e9e4da9
[Pipeline] sh
[2020-06-21T19:05:00.740Z] + git show --pretty=format: --name-status 7204604c5b6cae93b698b9409a48691f9e9e4da9
[Pipeline] fileExists
[Pipeline] sh
[2020-06-21T19:05:01.010Z] + pkg2yaml -d x86_64/staging
[Pipeline] readYaml
[Pipeline] echo
[2020-06-21T19:05:01.028Z] isNextLayout: true
[Pipeline] }
[Pipeline] // catchError
[Pipeline] }
[Pipeline] // stage
[Pipeline] stage
[Pipeline] { (Build)
[Pipeline] withCredentials
[2020-06-21T19:05:01.172Z] Masking supported pattern matches of $BUILDBOT_GPGP
[Pipeline] {
[Pipeline] input
[2020-06-21T19:05:01.204Z] Input requested
[2020-06-21T19:08:02.721Z] Approved by artoo
[Pipeline] echo
[2020-06-21T19:08:02.732Z] isLibBump: false
[Pipeline] dir
[2020-06-21T19:08:02.739Z] Running in /build/jenkins/workspace/packagesA_apparmor_master/x86_64/staging
[Pipeline] {
[Pipeline] catchError
[Pipeline] {
[Pipeline] sh
[2020-06-21T19:08:03.010Z] + buildpkg -C -d goblins
[2020-06-21T19:08:06.238Z] :: Synchronizing package databases...
[2020-06-21T19:08:06.238Z]  goblins is up to date
[2020-06-21T19:08:06.238Z]  gremlins is up to date
[2020-06-21T19:08:06.238Z]  system is up to date
[2020-06-21T19:08:06.238Z] downloading world.db...
[2020-06-21T19:08:06.238Z] downloading galaxy-goblins.db...
[2020-06-21T19:08:06.238Z]  galaxy-gremlins is up to date
[2020-06-21T19:08:06.238Z] downloading galaxy.db...
[2020-06-21T19:08:06.238Z] downloading staging.db...
[2020-06-21T19:08:06.238Z] downloading testing.db...
[2020-06-21T19:08:06.238Z] downloading extra.db...
[2020-06-21T19:08:06.238Z] downloading community-staging.db...
[2020-06-21T19:08:06.238Z] downloading community-testing.db...
[2020-06-21T19:08:06.238Z] downloading community.db...
[2020-06-21T19:08:06.489Z] :: Starting full system upgrade...
[2020-06-21T19:08:07.039Z]  there is nothing to do
[2020-06-21T19:08:07.950Z] ==> Building in chroot for [goblins] (x86_64)...
[2020-06-21T19:08:08.501Z] ==> Synchronizing chroot copy [/build/buildpkg/goblins-x86_64/root] -> [jenkins]...done
[2020-06-21T19:08:09.412Z] ==> Making package: apparmor 2.13.4-6 (Sun Jun 21 21:08:09 2020)
[2020-06-21T19:08:09.412Z] ==> Retrieving sources...
[2020-06-21T19:08:09.663Z]   -> Found apparmor-2.13.4.tar.gz
[2020-06-21T19:08:09.663Z]   -> Found apparmor-2.13.4.tar.gz.asc
[2020-06-21T19:08:09.663Z]   -> Found apparmor-2.13.4-make4.3.patch
[2020-06-21T19:08:09.663Z]   -> Found apparmor-2.13.4-vim_file.patch
[2020-06-21T19:08:09.663Z]   -> Found apparmor-2.13.4-run_variable.patch
[2020-06-21T19:08:09.663Z] ==> Validating source files with sha512sums...
[2020-06-21T19:08:09.663Z]     apparmor-2.13.4.tar.gz ... Passed
[2020-06-21T19:08:09.663Z]     apparmor-2.13.4.tar.gz.asc ... Skipped
[2020-06-21T19:08:09.663Z]     apparmor-2.13.4-make4.3.patch ... Passed
[2020-06-21T19:08:09.663Z]     apparmor-2.13.4-vim_file.patch ... Passed
[2020-06-21T19:08:09.663Z]     apparmor-2.13.4-run_variable.patch ... Passed
[2020-06-21T19:08:09.663Z] ==> Verifying source file signatures with gpg...
[2020-06-21T19:08:09.913Z]     apparmor-2.13.4.tar.gz ... Passed
[2020-06-21T19:08:15.107Z] ==> Making package: apparmor 2.13.4-6 (Sun 21 Jun 2020 07:08:14 PM UTC)
[2020-06-21T19:08:15.107Z] ==> Checking runtime dependencies...
[2020-06-21T19:08:15.107Z] ==> Installing missing dependencies...
[2020-06-21T19:08:15.107Z] resolving dependencies...
[2020-06-21T19:08:15.107Z] looking for conflicting packages...
[2020-06-21T19:08:15.107Z] 
[2020-06-21T19:08:15.107Z] Package (2)    New Version  Net Change
[2020-06-21T19:08:15.107Z] 
[2020-06-21T19:08:15.107Z] system/libnsl  1.2.0-2        0.19 MiB
[2020-06-21T19:08:15.107Z] world/python   3.8.3-1       77.54 MiB
[2020-06-21T19:08:15.107Z] 
[2020-06-21T19:08:15.107Z] Total Installed Size:  77.73 MiB
[2020-06-21T19:08:15.107Z] 
[2020-06-21T19:08:15.107Z] :: Proceed with installation? [Y/n] 
[2020-06-21T19:08:15.107Z] checking keyring...
[2020-06-21T19:08:15.107Z] checking package integrity...
[2020-06-21T19:08:15.107Z] loading package files...
[2020-06-21T19:08:15.107Z] checking for file conflicts...
[2020-06-21T19:08:15.107Z] checking available disk space...
[2020-06-21T19:08:15.107Z] :: Processing package changes...
[2020-06-21T19:08:15.107Z] installing libnsl...
[2020-06-21T19:08:15.107Z] installing python...
[2020-06-21T19:08:15.358Z] Optional dependencies for python
[2020-06-21T19:08:15.358Z]     python-setuptools
[2020-06-21T19:08:15.358Z]     python-pip
[2020-06-21T19:08:15.358Z]     sqlite [installed]
[2020-06-21T19:08:15.358Z]     mpdecimal: for decimal
[2020-06-21T19:08:15.358Z]     xz: for lzma [installed]
[2020-06-21T19:08:15.358Z]     tk: for tkinter
[2020-06-21T19:08:15.608Z] ==> Checking buildtime dependencies...
[2020-06-21T19:08:15.608Z] ==> Installing missing dependencies...
[2020-06-21T19:08:15.858Z] resolving dependencies...
[2020-06-21T19:08:16.109Z] looking for conflicting packages...
[2020-06-21T19:08:16.109Z] warning: dependency cycle detected:
[2020-06-21T19:08:16.109Z] warning: rubygems will be installed before its ruby dependency
[2020-06-21T19:08:16.109Z] warning: dependency cycle detected:
[2020-06-21T19:08:16.109Z] warning: ruby-irb will be installed before its ruby dependency
[2020-06-21T19:08:16.109Z] warning: dependency cycle detected:
[2020-06-21T19:08:16.109Z] warning: ruby-reline will be installed before its ruby dependency
[2020-06-21T19:08:16.109Z] 
[2020-06-21T19:08:16.109Z] Package (20)                 New Version  Net Change  Download Size
[2020-06-21T19:08:16.109Z] 
[2020-06-21T19:08:16.109Z] world/apr                    1.7.0-3        1.15 MiB               
[2020-06-21T19:08:16.109Z] world/apr-util               1.6.1-7        0.67 MiB               
[2020-06-21T19:08:16.109Z] world/expect                 5.45.4-2.1     0.41 MiB       0.18 MiB
[2020-06-21T19:08:16.109Z] world/libyaml                0.2.5-1        0.18 MiB               
[2020-06-21T19:08:16.109Z] world/python-appdirs         1.4.4-1        0.07 MiB               
[2020-06-21T19:08:16.109Z] world/python-ordered-set     3.1.1-2        0.05 MiB               
[2020-06-21T19:08:16.109Z] world/python-packaging       20.4-1         0.17 MiB               
[2020-06-21T19:08:16.109Z] world/python-pyparsing       2.4.7-1        0.73 MiB               
[2020-06-21T19:08:16.109Z] world/python-setuptools      1:47.3.1-1     1.54 MiB               
[2020-06-21T19:08:16.109Z] world/python-six             1.15.0-1       0.09 MiB               
[2020-06-21T19:08:16.109Z] community/ruby-irb           1.2.4-1        0.20 MiB               
[2020-06-21T19:08:16.109Z] community/ruby-reline        0.1.4-1        0.18 MiB               
[2020-06-21T19:08:16.109Z] world/rubygems               3.1.3-1        0.88 MiB               
[2020-06-21T19:08:16.109Z] world/tcl                    8.6.10-2       6.64 MiB               
[2020-06-21T19:08:16.109Z] world/apache                 2.4.43-1       6.28 MiB       1.54 MiB
[2020-06-21T19:08:16.109Z] world/dejagnu                1.6.2-2        0.52 MiB       0.14 MiB
[2020-06-21T19:08:16.109Z] goblins/perl-locale-gettext  1.07-10        0.03 MiB       0.01 MiB
[2020-06-21T19:08:16.109Z] galaxy/python-pyflakes       2.2.0-1        0.87 MiB               
[2020-06-21T19:08:16.109Z] world/ruby                   2.7.1-2       13.30 MiB               
[2020-06-21T19:08:16.109Z] world/swig                   4.0.2-1        4.62 MiB               
[2020-06-21T19:08:16.109Z] 
[2020-06-21T19:08:16.109Z] Total Download Size:    1.88 MiB
[2020-06-21T19:08:16.109Z] Total Installed Size:  38.57 MiB
[2020-06-21T19:08:16.109Z] 
[2020-06-21T19:08:16.109Z] :: Proceed with installation? [Y/n] 
[2020-06-21T19:08:16.109Z] :: Retrieving packages...
[2020-06-21T19:08:16.109Z] downloading perl-locale-gettext-1.07-10-x86_64.pkg.tar.zst...
[2020-06-21T19:08:16.109Z] downloading apache-2.4.43-1-x86_64.pkg.tar.xz...
[2020-06-21T19:08:16.109Z] downloading expect-5.45.4-2.1-x86_64.pkg.tar.zst...
[2020-06-21T19:08:16.109Z] downloading dejagnu-1.6.2-2-any.pkg.tar.zst...
[2020-06-21T19:08:16.109Z] checking keyring...
[2020-06-21T19:08:16.109Z] checking package integrity...
[2020-06-21T19:08:17.452Z] loading package files...
[2020-06-21T19:08:17.452Z] checking for file conflicts...
[2020-06-21T19:08:17.452Z] checking available disk space...
[2020-06-21T19:08:17.452Z] :: Processing package changes...
[2020-06-21T19:08:17.452Z] installing apr...
[2020-06-21T19:08:17.452Z] installing apr-util...
[2020-06-21T19:08:17.452Z] Optional dependencies for apr-util
[2020-06-21T19:08:17.452Z]     gdbm: enable gdbm support [installed]
[2020-06-21T19:08:17.452Z]     libldap: enable ldap support [installed]
[2020-06-21T19:08:17.452Z]     unixodbc: enable odbc support
[2020-06-21T19:08:17.452Z]     mariadb-libs: enable mysql/mariadb support
[2020-06-21T19:08:17.452Z]     postgresql-libs: enable postgres support
[2020-06-21T19:08:17.452Z]     db: enable berkley db support [installed]
[2020-06-21T19:08:17.452Z]     sqlite: enable sqlite support [installed]
[2020-06-21T19:08:17.452Z]     nss: enable nss crypto support
[2020-06-21T19:08:17.452Z]     openssl: enable openssl crypto support [installed]
[2020-06-21T19:08:17.452Z] installing apache...
[2020-06-21T19:08:17.452Z] Optional dependencies for apache
[2020-06-21T19:08:17.452Z]     lua: for mod_lua module
[2020-06-21T19:08:17.452Z]     libxml2: for mod_proxy_html, mod_xml2enc modules [installed]
[2020-06-21T19:08:17.452Z]     curl: for mod_md module [installed]
[2020-06-21T19:08:17.452Z]     jansson: for mod_md module
[2020-06-21T19:08:17.452Z]     brotli: for mod_brotli module
[2020-06-21T19:08:17.452Z]     uwsgi: for mod_proxy_uwsgi module
[2020-06-21T19:08:17.452Z]     lynx: apachectl status
[2020-06-21T19:08:17.452Z] installing libyaml...
[2020-06-21T19:08:17.452Z] installing rubygems...
[2020-06-21T19:08:17.452Z] installing ruby-reline...
[2020-06-21T19:08:17.452Z] installing ruby-irb...
[2020-06-21T19:08:17.452Z] installing ruby...
[2020-06-21T19:08:17.702Z] Optional dependencies for ruby
[2020-06-21T19:08:17.702Z]     ruby-docs: Ruby documentation
[2020-06-21T19:08:17.702Z]     tk: for Ruby/TK
[2020-06-21T19:08:17.702Z] installing swig...
[2020-06-21T19:08:17.953Z] installing tcl...
[2020-06-21T19:08:17.953Z] installing expect...
[2020-06-21T19:08:17.953Z] installing dejagnu...
[2020-06-21T19:08:17.953Z] installing perl-locale-gettext...
[2020-06-21T19:08:17.953Z] installing python-appdirs...
[2020-06-21T19:08:17.953Z] installing python-pyparsing...
[2020-06-21T19:08:17.953Z] installing python-six...
[2020-06-21T19:08:17.953Z] installing python-packaging...
[2020-06-21T19:08:17.953Z] installing python-ordered-set...
[2020-06-21T19:08:17.953Z] installing python-setuptools...
[2020-06-21T19:08:17.953Z] installing python-pyflakes...
[2020-06-21T19:08:17.953Z] :: Running post-transaction hooks...
[2020-06-21T19:08:17.953Z] (1/2) Warn about old perl modules
[2020-06-21T19:08:17.953Z] WARNING: '/usr/lib/perl5/5.30' contains data from at least 1 packages which will NOT be used by the installed perl interpreter.
[2020-06-21T19:08:17.953Z]  -> Run the following command to get a list of affected packages: pacman -Qqo '/usr/lib/perl5/5.30'
[2020-06-21T19:08:17.953Z] (2/2) Updating the info directory file...
[2020-06-21T19:08:18.203Z] ==> Retrieving sources...
[2020-06-21T19:08:18.203Z]   -> Found apparmor-2.13.4.tar.gz
[2020-06-21T19:08:18.203Z]   -> Found apparmor-2.13.4.tar.gz.asc
[2020-06-21T19:08:18.203Z]   -> Found apparmor-2.13.4-make4.3.patch
[2020-06-21T19:08:18.203Z]   -> Found apparmor-2.13.4-vim_file.patch
[2020-06-21T19:08:18.203Z]   -> Found apparmor-2.13.4-run_variable.patch
[2020-06-21T19:08:18.203Z] ==> WARNING: Skipping all source file integrity checks.
[2020-06-21T19:08:18.203Z] ==> Extracting sources...
[2020-06-21T19:08:18.203Z]   -> Extracting apparmor-2.13.4.tar.gz with bsdtar
[2020-06-21T19:08:18.454Z] ==> Starting prepare()...
[2020-06-21T19:08:18.454Z] patching file common/Make.rules
[2020-06-21T19:08:18.454Z] patching file common/list_af_names.sh
[2020-06-21T19:08:18.454Z] patching file parser/Makefile
[2020-06-21T19:08:18.454Z] patching file utils/vim/create-apparmor.vim.py
[2020-06-21T19:08:18.454Z] patching file utils/test/test-network.py
[2020-06-21T19:08:18.454Z] patching file common/Make.rules
[2020-06-21T19:08:18.454Z] patching file common/list_capabilities.sh
[2020-06-21T19:08:18.454Z] patching file parser/Makefile
[2020-06-21T19:08:18.454Z] patching file utils/Makefile
[2020-06-21T19:08:18.454Z] patching file utils/vim/create-apparmor.vim.py
[2020-06-21T19:08:18.454Z] patching file utils/vim/create-apparmor.vim.py
[2020-06-21T19:08:18.454Z] patching file utils/vim/create-apparmor.vim.py
[2020-06-21T19:08:18.454Z] patching file utils/vim/Makefile
[2020-06-21T19:08:18.454Z] patching file parser/apparmor.d.pod
[2020-06-21T19:08:18.454Z] patching file profiles/apparmor.d/tunables/global
[2020-06-21T19:08:18.454Z] patching file profiles/apparmor.d/tunables/run
[2020-06-21T19:08:19.004Z] autoreconf: Entering directory `.'
[2020-06-21T19:08:19.004Z] autoreconf: configure.ac: not using Gettext
[2020-06-21T19:08:19.915Z] autoreconf: running: aclocal --force 
[2020-06-21T19:08:20.826Z] autoreconf: configure.ac: tracing
[2020-06-21T19:08:21.376Z] autoreconf: running: libtoolize --copy --force
[2020-06-21T19:08:21.626Z] libtoolize: putting auxiliary files in '.'.
[2020-06-21T19:08:21.626Z] libtoolize: copying file './ltmain.sh'
[2020-06-21T19:08:21.877Z] libtoolize: Consider adding 'AC_CONFIG_MACRO_DIRS([m4])' to configure.ac,
[2020-06-21T19:08:21.877Z] libtoolize: and rerunning libtoolize and aclocal.
[2020-06-21T19:08:21.877Z] libtoolize: Consider adding '-I m4' to ACLOCAL_AMFLAGS in Makefile.am.
[2020-06-21T19:08:22.787Z] autoreconf: running: /usr/bin/autoconf --force
[2020-06-21T19:08:23.338Z] autoreconf: configure.ac: not using Autoheader
[2020-06-21T19:08:23.338Z] autoreconf: running: automake --add-missing --copy --force-missing
[2020-06-21T19:08:23.888Z] configure.ac:8: warning: AM_INIT_AUTOMAKE: two- and three-arguments forms are deprecated.  For more info, see:
[2020-06-21T19:08:23.888Z] configure.ac:8: https://www.gnu.org/software/automake/manual/automake.html#Modernize-AM_005fINIT_005fAUTOMAKE-invocation
[2020-06-21T19:08:23.888Z] configure.ac:10: installing './compile'
[2020-06-21T19:08:23.888Z] configure.ac:8: installing './missing'
[2020-06-21T19:08:23.888Z] doc/Makefile.am:10: warning: subst .2,.pod,$(man_MANS: non-POSIX variable name
[2020-06-21T19:08:23.888Z] doc/Makefile.am:10: (probably a GNU make extension)
[2020-06-21T19:08:23.888Z] doc/Makefile.am:10: warning: subst .3,.pod,$(man_MANS: non-POSIX variable name
[2020-06-21T19:08:23.888Z] doc/Makefile.am:10: (probably a GNU make extension)
[2020-06-21T19:08:23.888Z] doc/Makefile.am:17: warning: '%'-style pattern rules are a GNU make extension
[2020-06-21T19:08:23.888Z] doc/Makefile.am:26: warning: '%'-style pattern rules are a GNU make extension
[2020-06-21T19:08:23.888Z] src/Makefile.am:60: warning: '%'-style pattern rules are a GNU make extension
[2020-06-21T19:08:23.888Z] src/Makefile.am:1: warning: 'INCLUDES' is the old name for 'AM_CPPFLAGS' (or '*_CPPFLAGS')
[2020-06-21T19:08:23.888Z] src/Makefile.am: installing './depcomp'
[2020-06-21T19:08:24.139Z] testsuite/Makefile.am:5: warning: 'INCLUDES' is the old name for 'AM_CPPFLAGS' (or '*_CPPFLAGS')
[2020-06-21T19:08:24.139Z] autoreconf: Leaving directory `.'
[2020-06-21T19:08:24.389Z] ==> Starting build()...
[2020-06-21T19:08:24.389Z] checking for a BSD-compatible install... /usr/bin/install -c
[2020-06-21T19:08:24.389Z] checking whether build environment is sane... yes
[2020-06-21T19:08:24.389Z] checking for a thread-safe mkdir -p... /usr/bin/mkdir -p
[2020-06-21T19:08:24.389Z] checking for gawk... gawk
[2020-06-21T19:08:24.389Z] checking whether make sets $(MAKE)... yes
[2020-06-21T19:08:24.389Z] checking whether make supports nested variables... yes
[2020-06-21T19:08:24.639Z] checking whether make supports the include directive... yes (GNU style)
[2020-06-21T19:08:24.639Z] checking for gcc... gcc
[2020-06-21T19:08:24.639Z] checking whether the C compiler works... yes
[2020-06-21T19:08:24.639Z] checking for C compiler default output file name... a.out
[2020-06-21T19:08:24.639Z] checking for suffix of executables... 
[2020-06-21T19:08:24.639Z] checking whether we are cross compiling... no
[2020-06-21T19:08:24.639Z] checking for suffix of object files... o
[2020-06-21T19:08:24.890Z] checking whether we are using the GNU C compiler... yes
[2020-06-21T19:08:24.890Z] checking whether gcc accepts -g... yes
[2020-06-21T19:08:24.890Z] checking for gcc option to accept ISO C89... none needed
[2020-06-21T19:08:24.890Z] checking whether gcc understands -c and -o together... yes
[2020-06-21T19:08:24.890Z] checking dependency style of gcc... gcc3
[2020-06-21T19:08:24.890Z] checking for flex... flex
[2020-06-21T19:08:24.890Z] checking lex output file root... lex.yy
[2020-06-21T19:08:25.800Z] checking lex library... -lfl
[2020-06-21T19:08:26.051Z] checking whether yytext is a pointer... yes
[2020-06-21T19:08:26.051Z] checking for bison... bison -y
[2020-06-21T19:08:26.051Z] checking for a sed that does not truncate output... /usr/bin/sed
[2020-06-21T19:08:26.051Z] checking for pkg-config... /usr/bin/pkg-config
[2020-06-21T19:08:26.051Z] checking pkg-config is at least version 0.9.0... yes
[2020-06-21T19:08:26.051Z] checking for swig... /usr/bin/swig
[2020-06-21T19:08:26.051Z] checking whether the libapparmor debug output should be enabled... no
[2020-06-21T19:08:26.051Z] checking whether the libapparmor man pages should be generated... yes
[2020-06-21T19:08:26.051Z] checking for podchecker... podchecker
[2020-06-21T19:08:26.051Z] checking for pod2man... pod2man
[2020-06-21T19:08:26.051Z] checking whether python bindings are enabled... yes
[2020-06-21T19:08:26.051Z] checking for python... /usr/bin/python
[2020-06-21T19:08:26.051Z] checking for python... (cached) /usr/bin/python
[2020-06-21T19:08:26.051Z] checking for a version of Python >= '2.1.0'... yes
[2020-06-21T19:08:26.051Z] checking for the distutils Python package... yes
[2020-06-21T19:08:26.051Z] checking for Python include path... /usr/bin/python-config is /usr/bin/python-config
[2020-06-21T19:08:26.051Z] -I/usr/include/python3.8 -I/usr/include/python3.8
[2020-06-21T19:08:26.051Z] checking for Python library path... /usr/bin/python-config is /usr/bin/python-config
[2020-06-21T19:08:26.051Z]  -L/usr/lib  -lcrypt -lpthread -ldl  -lutil -lm -lm 
[2020-06-21T19:08:26.051Z] checking for Python site-packages path... /usr/lib/python3.8/site-packages
[2020-06-21T19:08:26.051Z] checking python extra libraries... -L. -lpython3.8  -lcrypt -lpthread -ldl  -lutil -lm
[2020-06-21T19:08:26.301Z] checking python extra linking flags... -Xlinker -export-dynamic
[2020-06-21T19:08:26.301Z] checking consistency of all components of python development environment... yes
[2020-06-21T19:08:26.301Z] checking for python version... 3.8
[2020-06-21T19:08:26.301Z] checking for python platform... linux
[2020-06-21T19:08:26.552Z] checking for python script directory... ${prefix}/lib/python3.8/site-packages
[2020-06-21T19:08:26.552Z] checking for python extension module directory... ${exec_prefix}/lib/python3.8/site-packages
[2020-06-21T19:08:26.552Z] checking whether perl bindings are enabled... yes
[2020-06-21T19:08:26.552Z] checking for perl... /usr/bin/perl
[2020-06-21T19:08:26.552Z] checking for /usr/lib/perl5/5.32/core_perl/CORE/perl.h... yes
[2020-06-21T19:08:26.552Z] checking whether ruby bindings are enabled... yes
[2020-06-21T19:08:26.552Z] checking for ruby... /usr/bin/ruby
[2020-06-21T19:08:26.552Z] checking how to run the C preprocessor... gcc -E
[2020-06-21T19:08:26.552Z] checking for grep that handles long lines and -e... /usr/bin/grep
[2020-06-21T19:08:26.552Z] checking for egrep... /usr/bin/grep -E
[2020-06-21T19:08:26.802Z] checking for ANSI C header files... yes
[2020-06-21T19:08:26.802Z] checking for sys/types.h... yes
[2020-06-21T19:08:26.802Z] checking for sys/stat.h... yes
[2020-06-21T19:08:26.802Z] checking for stdlib.h... yes
[2020-06-21T19:08:27.052Z] checking for string.h... yes
[2020-06-21T19:08:27.052Z] checking for memory.h... yes
[2020-06-21T19:08:27.052Z] checking for strings.h... yes
[2020-06-21T19:08:27.052Z] checking for inttypes.h... yes
[2020-06-21T19:08:27.052Z] checking for stdint.h... yes
[2020-06-21T19:08:27.303Z] checking for unistd.h... yes
[2020-06-21T19:08:27.303Z] checking for unistd.h... (cached) yes
[2020-06-21T19:08:27.303Z] checking for stdint.h... (cached) yes
[2020-06-21T19:08:27.303Z] checking syslog.h usability... yes
[2020-06-21T19:08:27.303Z] checking syslog.h presence... yes
[2020-06-21T19:08:27.303Z] checking for syslog.h... yes
[2020-06-21T19:08:27.303Z] checking for asprintf... yes
[2020-06-21T19:08:27.553Z] checking for __secure_getenv... no
[2020-06-21T19:08:27.553Z] checking for secure_getenv... yes
[2020-06-21T19:08:27.553Z] checking for reallocarray... yes
[2020-06-21T19:08:27.553Z] checking for an ANSI C-conforming const... yes
[2020-06-21T19:08:27.803Z] checking build system type... x86_64-pc-linux-gnu
[2020-06-21T19:08:27.803Z] checking host system type... x86_64-pc-linux-gnu
[2020-06-21T19:08:27.803Z] checking how to print strings... printf
[2020-06-21T19:08:27.803Z] checking for a sed that does not truncate output... (cached) /usr/bin/sed
[2020-06-21T19:08:27.803Z] checking for fgrep... /usr/bin/grep -F
[2020-06-21T19:08:27.803Z] checking for ld used by gcc... /usr/bin/ld
[2020-06-21T19:08:27.803Z] checking if the linker (/usr/bin/ld) is GNU ld... yes
[2020-06-21T19:08:27.803Z] checking for BSD- or MS-compatible name lister (nm)... /usr/bin/nm -B
[2020-06-21T19:08:27.803Z] checking the name lister (/usr/bin/nm -B) interface... BSD nm
[2020-06-21T19:08:27.803Z] checking whether ln -s works... yes
[2020-06-21T19:08:27.803Z] checking the maximum length of command line arguments... 1572864
[2020-06-21T19:08:27.803Z] checking how to convert x86_64-pc-linux-gnu file names to x86_64-pc-linux-gnu format... func_convert_file_noop
[2020-06-21T19:08:27.803Z] checking how to convert x86_64-pc-linux-gnu file names to toolchain format... func_convert_file_noop
[2020-06-21T19:08:27.803Z] checking for /usr/bin/ld option to reload object files... -r
[2020-06-21T19:08:27.803Z] checking for objdump... objdump
[2020-06-21T19:08:27.803Z] checking how to recognize dependent libraries... pass_all
[2020-06-21T19:08:27.803Z] checking for dlltool... no
[2020-06-21T19:08:27.803Z] checking how to associate runtime and link libraries... printf %s\n
[2020-06-21T19:08:27.803Z] checking for ar... ar
[2020-06-21T19:08:27.803Z] checking for archiver @FILE support... @
[2020-06-21T19:08:27.803Z] checking for strip... strip
[2020-06-21T19:08:27.803Z] checking for ranlib... ranlib
[2020-06-21T19:08:27.803Z] checking command to parse /usr/bin/nm -B output from gcc object... ok
[2020-06-21T19:08:27.803Z] checking for sysroot... no
[2020-06-21T19:08:28.054Z] checking for a working dd... /usr/bin/dd
[2020-06-21T19:08:28.054Z] checking how to truncate binary pipes... /usr/bin/dd bs=4096 count=1
[2020-06-21T19:08:28.054Z] checking for mt... no
[2020-06-21T19:08:28.054Z] checking if : is a manifest tool... no
[2020-06-21T19:08:28.054Z] checking for dlfcn.h... yes
[2020-06-21T19:08:28.054Z] checking for objdir... .libs
[2020-06-21T19:08:28.054Z] checking if gcc supports -fno-rtti -fno-exceptions... no
[2020-06-21T19:08:28.054Z] checking for gcc option to produce PIC... -fPIC -DPIC
[2020-06-21T19:08:28.304Z] checking if gcc PIC flag -fPIC -DPIC works... yes
[2020-06-21T19:08:28.304Z] checking if gcc static flag -static works... yes
[2020-06-21T19:08:28.304Z] checking if gcc supports -c -o file.o... yes
[2020-06-21T19:08:28.304Z] checking if gcc supports -c -o file.o... (cached) yes
[2020-06-21T19:08:28.304Z] checking whether the gcc linker (/usr/bin/ld -m elf_x86_64) supports shared libraries... yes
[2020-06-21T19:08:28.304Z] checking whether -lc should be explicitly linked in... no
[2020-06-21T19:08:28.554Z] checking dynamic linker characteristics... GNU/Linux ld.so
[2020-06-21T19:08:28.554Z] checking how to hardcode library paths into programs... immediate
[2020-06-21T19:08:28.554Z] checking whether stripping libraries is possible... yes
[2020-06-21T19:08:28.554Z] checking if libtool supports shared libraries... yes
[2020-06-21T19:08:28.555Z] checking whether to build shared libraries... yes
[2020-06-21T19:08:28.555Z] checking whether to build static libraries... yes
[2020-06-21T19:08:28.555Z] checking for gcc option to accept ISO C99... none needed
[2020-06-21T19:08:28.555Z] checking that generated files are newer than configure... done
[2020-06-21T19:08:28.555Z] configure: creating ./config.status
[2020-06-21T19:08:29.465Z] config.status: creating Makefile
[2020-06-21T19:08:29.465Z] config.status: creating doc/Makefile
[2020-06-21T19:08:29.465Z] config.status: creating src/Makefile
[2020-06-21T19:08:29.465Z] config.status: creating swig/Makefile
[2020-06-21T19:08:29.465Z] config.status: creating swig/perl/Makefile
[2020-06-21T19:08:29.465Z] config.status: creating swig/perl/Makefile.PL
[2020-06-21T19:08:29.465Z] config.status: creating swig/python/Makefile
[2020-06-21T19:08:29.465Z] config.status: creating swig/python/setup.py
[2020-06-21T19:08:29.465Z] config.status: creating swig/python/test/Makefile
[2020-06-21T19:08:29.465Z] config.status: creating swig/ruby/Makefile
[2020-06-21T19:08:29.465Z] config.status: creating testsuite/Makefile
[2020-06-21T19:08:29.716Z] config.status: creating testsuite/config/Makefile
[2020-06-21T19:08:29.716Z] config.status: creating testsuite/libaalogparse.test/Makefile
[2020-06-21T19:08:29.716Z] config.status: creating testsuite/lib/Makefile
[2020-06-21T19:08:29.716Z] config.status: creating include/Makefile
[2020-06-21T19:08:29.716Z] config.status: creating include/sys/Makefile
[2020-06-21T19:08:29.716Z] config.status: executing depfiles commands
[2020-06-21T19:08:29.966Z] config.status: executing libtool commands
[2020-06-21T19:08:29.966Z] Making all in doc
[2020-06-21T19:08:29.966Z] make[1]: Entering directory '/build/apparmor/src/apparmor-2.13.4/libraries/libapparmor/doc'
[2020-06-21T19:08:29.966Z] /usr/bin/core_perl/podchecker -warnings -warnings aa_change_hat.pod
[2020-06-21T19:08:29.966Z] /usr/bin/core_perl/podchecker -warnings -warnings aa_change_profile.pod
[2020-06-21T19:08:29.966Z] /usr/bin/core_perl/podchecker -warnings -warnings aa_stack_profile.pod
[2020-06-21T19:08:29.966Z] /usr/bin/core_perl/podchecker -warnings -warnings aa_getcon.pod
[2020-06-21T19:08:29.966Z] /usr/bin/core_perl/podchecker -warnings -warnings aa_find_mountpoint.pod
[2020-06-21T19:08:29.966Z] /usr/bin/core_perl/podchecker -warnings -warnings aa_splitcon.pod
[2020-06-21T19:08:29.966Z] /usr/bin/core_perl/podchecker -warnings -warnings aa_query_label.pod
[2020-06-21T19:08:29.966Z] /usr/bin/core_perl/podchecker -warnings -warnings aa_features.pod
[2020-06-21T19:08:29.966Z] /usr/bin/core_perl/podchecker -warnings -warnings aa_kernel_interface.pod
[2020-06-21T19:08:29.966Z] /usr/bin/core_perl/podchecker -warnings -warnings aa_policy_cache.pod
[2020-06-21T19:08:29.966Z] aa_getcon.pod pod syntax OK.
[2020-06-21T19:08:29.966Z] aa_features.pod pod syntax OK.
[2020-06-21T19:08:29.966Z] aa_kernel_interface.pod pod syntax OK.
[2020-06-21T19:08:29.966Z] /usr/bin/core_perl/pod2man \
[2020-06-21T19:08:29.966Z] 	--section=2 \
[2020-06-21T19:08:29.966Z] 	--release="AppArmor 2.13.4" \
[2020-06-21T19:08:29.966Z] 	--center="AppArmor" \
[2020-06-21T19:08:29.966Z] 	--stderr \
[2020-06-21T19:08:29.966Z] 	aa_getcon.pod > aa_getcon.2
[2020-06-21T19:08:29.966Z] /usr/bin/core_perl/pod2man \
[2020-06-21T19:08:29.966Z] 	--section=3 \
[2020-06-21T19:08:29.966Z] 	--release="AppArmor 2.13.4" \
[2020-06-21T19:08:29.966Z] 	--center="AppArmor" \
[2020-06-21T19:08:29.966Z] 	--stderr \
[2020-06-21T19:08:29.966Z] 	aa_features.pod > aa_features.3
[2020-06-21T19:08:29.966Z] /usr/bin/core_perl/pod2man \
[2020-06-21T19:08:29.966Z] 	--section=3 \
[2020-06-21T19:08:29.966Z] 	--release="AppArmor 2.13.4" \
[2020-06-21T19:08:29.966Z] 	--center="AppArmor" \
[2020-06-21T19:08:29.966Z] 	--stderr \
[2020-06-21T19:08:29.966Z] 	aa_kernel_interface.pod > aa_kernel_interface.3
[2020-06-21T19:08:29.966Z] aa_policy_cache.pod pod syntax OK.
[2020-06-21T19:08:29.966Z] /usr/bin/core_perl/pod2man \
[2020-06-21T19:08:29.966Z] 	--section=3 \
[2020-06-21T19:08:29.966Z] 	--release="AppArmor 2.13.4" \
[2020-06-21T19:08:29.966Z] 	--center="AppArmor" \
[2020-06-21T19:08:29.966Z] 	--stderr \
[2020-06-21T19:08:29.966Z] 	aa_policy_cache.pod > aa_policy_cache.3
[2020-06-21T19:08:29.966Z] *** WARNING: line containing nothing but whitespace in paragraph at line 140 in file aa_stack_profile.pod
[2020-06-21T19:08:29.966Z] *** WARNING: line containing nothing but whitespace in paragraph at line 145 in file aa_stack_profile.pod
[2020-06-21T19:08:29.967Z] *** WARNING: *** WARNING: line containing nothing but whitespace in paragraph at line 156 in file aa_stack_profile.pod
[2020-06-21T19:08:29.967Z] multiple occurrences (2) of link target 'EACCES' at line - in file aa_find_mountpoint.pod
[2020-06-21T19:08:29.967Z] *** WARNING: multiple occurrences (2) of link target 'ENOENT' at line - in file aa_find_mountpoint.pod
[2020-06-21T19:08:29.967Z] *** WARNING: multiple occurrences (2) of link target 'ENOMEM' at line - in file aa_find_mountpoint.pod
[2020-06-21T19:08:29.967Z] *** WARNING: line containing nothing but whitespace in paragraph at line 161 in file aa_stack_profile.pod
[2020-06-21T19:08:29.967Z] aa_find_mountpoint.pod pod syntax OK.
[2020-06-21T19:08:29.967Z] *** WARNING: line containing nothing but whitespace in paragraph at line 168 in file aa_stack_profile.pod
[2020-06-21T19:08:29.967Z] /usr/bin/core_perl/pod2man \
[2020-06-21T19:08:29.967Z] 	--section=2 \
[2020-06-21T19:08:29.967Z] 	--release="AppArmor 2.13.4" \
[2020-06-21T19:08:29.967Z] 	--center="AppArmor" \
[2020-06-21T19:08:29.967Z] 	--stderr \
[2020-06-21T19:08:29.967Z] 	aa_find_mountpoint.pod > aa_find_mountpoint.2
[2020-06-21T19:08:29.967Z] aa_stack_profile.pod pod syntax OK.
[2020-06-21T19:08:29.967Z] /usr/bin/core_perl/pod2man \
[2020-06-21T19:08:29.967Z] 	--section=2 \
[2020-06-21T19:08:29.967Z] 	--release="AppArmor 2.13.4" \
[2020-06-21T19:08:29.967Z] 	--center="AppArmor" \
[2020-06-21T19:08:29.967Z] 	--stderr \
[2020-06-21T19:08:29.967Z] 	aa_stack_profile.pod > aa_stack_profile.2
[2020-06-21T19:08:29.967Z] aa_splitcon.pod pod syntax OK.
[2020-06-21T19:08:29.967Z] /usr/bin/core_perl/pod2man \
[2020-06-21T19:08:29.967Z] 	--section=3 \
[2020-06-21T19:08:29.967Z] 	--release="AppArmor 2.13.4" \
[2020-06-21T19:08:29.967Z] 	--center="AppArmor" \
[2020-06-21T19:08:29.967Z] 	--stderr \
[2020-06-21T19:08:29.967Z] 	aa_splitcon.pod > aa_splitcon.3
[2020-06-21T19:08:29.967Z] aa_change_profile.pod pod syntax OK.
[2020-06-21T19:08:29.967Z] /usr/bin/core_perl/pod2man \
[2020-06-21T19:08:29.967Z] 	--section=2 \
[2020-06-21T19:08:29.967Z] 	--release="AppArmor 2.13.4" \
[2020-06-21T19:08:29.967Z] 	--center="AppArmor" \
[2020-06-21T19:08:29.967Z] 	--stderr \
[2020-06-21T19:08:29.967Z] 	aa_change_profile.pod > aa_change_profile.2
[2020-06-21T19:08:30.217Z] *** WARNING: line containing nothing but whitespace in paragraph at line 140 in file aa_change_hat.pod
[2020-06-21T19:08:30.217Z] *** WARNING: line containing nothing but whitespace in paragraph at line 144 in file aa_change_hat.pod
[2020-06-21T19:08:30.217Z] *** WARNING: line containing nothing but whitespace in paragraph at line 169 in file aa_change_hat.pod
[2020-06-21T19:08:30.217Z] *** WARNING: line containing nothing but whitespace in paragraph at line 170 in file aa_change_hat.pod
[2020-06-21T19:08:30.217Z] *** WARNING: line containing nothing but whitespace in paragraph at line 175 in file aa_change_hat.pod
[2020-06-21T19:08:30.217Z] *** WARNING: line containing nothing but whitespace in paragraph at line 178 in file aa_change_hat.pod
[2020-06-21T19:08:30.217Z] aa_query_label.pod pod syntax OK.
[2020-06-21T19:08:30.217Z] *** WARNING: line containing nothing but whitespace in paragraph at line 182 in file aa_change_hat.pod
[2020-06-21T19:08:30.217Z] *** WARNING: line containing nothing but whitespace in paragraph at line 191 in file aa_change_hat.pod
[2020-06-21T19:08:30.217Z] *** WARNING: line containing nothing but whitespace in paragraph at line 199 in file aa_change_hat.pod
[2020-06-21T19:08:30.217Z] *** WARNING: line containing nothing but whitespace in paragraph at line 207 in file aa_change_hat.pod
[2020-06-21T19:08:30.217Z] /usr/bin/core_perl/pod2man \
[2020-06-21T19:08:30.217Z] 	--section=2 \
[2020-06-21T19:08:30.217Z] 	--release="AppArmor 2.13.4" \
[2020-06-21T19:08:30.217Z] 	--center="AppArmor" \
[2020-06-21T19:08:30.217Z] 	--stderr \
[2020-06-21T19:08:30.217Z] 	aa_query_label.pod > aa_query_label.2
[2020-06-21T19:08:30.217Z] aa_change_hat.pod pod syntax OK.
[2020-06-21T19:08:30.217Z] /usr/bin/core_perl/pod2man \
[2020-06-21T19:08:30.217Z] 	--section=2 \
[2020-06-21T19:08:30.218Z] 	--release="AppArmor 2.13.4" \
[2020-06-21T19:08:30.218Z] 	--center="AppArmor" \
[2020-06-21T19:08:30.218Z] 	--stderr \
[2020-06-21T19:08:30.218Z] 	aa_change_hat.pod > aa_change_hat.2
[2020-06-21T19:08:30.218Z] make[1]: Leaving directory '/build/apparmor/src/apparmor-2.13.4/libraries/libapparmor/doc'
[2020-06-21T19:08:30.218Z] Making all in src
[2020-06-21T19:08:30.218Z] make[1]: Entering directory '/build/apparmor/src/apparmor-2.13.4/libraries/libapparmor/src'
[2020-06-21T19:08:30.218Z] /bin/sh ../ylwrap grammar.y y.tab.c grammar.c y.tab.h `echo grammar.c | sed -e s/cc$/hh/ -e s/cpp$/hpp/ -e s/cxx$/hxx/ -e s/c++$/h++/ -e s/c$/h/` y.output grammar.output -- bison -y -d -p aalogparse_ 
[2020-06-21T19:08:30.218Z] flex -v scanner.l
[2020-06-21T19:08:30.218Z] echo '#include <netinet/in.h>' | gcc -E -dM - | LC_ALL=C  sed  -n -e "/IPPROTO_MAX/d"  -e "s/^\#define[ \\t]\\+IPPROTO_\\([A-Z0-9_]\\+\\)\\(.*\\)$/AA_GEN_PROTO_ENT(\\UIPPROTO_\\1, \"\\L\\1\")/p" > af_protos.h
[2020-06-21T19:08:30.218Z] flex version 2.6.4 usage statistics:
[2020-06-21T19:08:30.218Z]   scanner options: ---reentrant--bison-bridgevI8 -Cem -oscanner.c -Paalogparse_
[2020-06-21T19:08:30.218Z]   1237/2000 NFA states
[2020-06-21T19:08:30.218Z]   626/1000 DFA states (2575 words)
[2020-06-21T19:08:30.218Z]   129 rules
[2020-06-21T19:08:30.218Z]   Compressed tables always back-up
[2020-06-21T19:08:30.218Z]   12/40 start conditions
[2020-06-21T19:08:30.218Z]   504 epsilon states, 200 double epsilon states
[2020-06-21T19:08:30.218Z]   44/100 character classes needed 554/750 words of storage, 0 reused
[2020-06-21T19:08:30.218Z]   23778 state/nextstate pairs created
[2020-06-21T19:08:30.218Z]   1520/22258 unique/duplicate transitions
[2020-06-21T19:08:30.218Z]   645/1000 base-def entries created
[2020-06-21T19:08:30.218Z]   1532/2000 (peak 2395) nxt-chk entries created
[2020-06-21T19:08:30.218Z]   171/2500 (peak 1273) template nxt-chk entries created
[2020-06-21T19:08:30.218Z]   0 empty table entries
[2020-06-21T19:08:30.218Z]   21 protos created
[2020-06-21T19:08:30.218Z]   19 templates created, 456 uses
[2020-06-21T19:08:30.218Z]   67/256 equivalence classes created
[2020-06-21T19:08:30.218Z]   9/256 meta-equivalence classes created
[2020-06-21T19:08:30.218Z]   0 (14 saved) hash collisions, 919 DFAs equal
[2020-06-21T19:08:30.218Z]   2 sets of reallocations needed
[2020-06-21T19:08:30.218Z]   4677 total table entries needed
[2020-06-21T19:08:30.218Z] /build/apparmor/src/apparmor-2.13.4/libraries/libapparmor/src/grammar.y:77.1-8: warning: POSIX Yacc does not support %defines [-Wyacc]
[2020-06-21T19:08:30.218Z]    77 | %defines
[2020-06-21T19:08:30.218Z]       | ^~~~~~~~
[2020-06-21T19:08:30.218Z] /build/apparmor/src/apparmor-2.13.4/libraries/libapparmor/src/grammar.y:83.1-7: warning: POSIX Yacc does not support %define [-Wyacc]
[2020-06-21T19:08:30.218Z]    83 | %define api.pure
[2020-06-21T19:08:30.218Z]       | ^~~~~~~
[2020-06-21T19:08:30.218Z] /build/apparmor/src/apparmor-2.13.4/libraries/libapparmor/src/grammar.y:183.1-11: warning: POSIX Yacc does not support %destructor [-Wyacc]
[2020-06-21T19:08:30.218Z]   183 | %destructor { free($$); } TOK_QUOTED_STRING TOK_ID TOK_MODE TOK_DMESG...
[2020-06-21T19:08:30.218Z]       | ^~~~~~~~~~~
[2020-06-21T19:08:30.218Z] /build/apparmor/src/apparmor-2.13.4/libraries/libapparmor/src/grammar.y:184.1-11: warning: POSIX Yacc does not support %destructor [-Wyacc]
[2020-06-21T19:08:30.218Z]   184 | %destructor { free($$); } TOK_AUDIT_DIGITS TOK_DATE_MONTH TOK_DATE TO...
[2020-06-21T19:08:30.218Z]       | ^~~~~~~~~~~
[2020-06-21T19:08:30.218Z] /build/apparmor/src/apparmor-2.13.4/libraries/libapparmor/src/grammar.y:185.1-11: warning: POSIX Yacc does not support %destructor [-Wyacc]
[2020-06-21T19:08:30.218Z]   185 | %destructor { free($$); } TOK_HEXSTRING TOK_TYPE_OTHER TOK_MSG_REST
[2020-06-21T19:08:30.218Z]       | ^~~~~~~~~~~
[2020-06-21T19:08:30.218Z] /build/apparmor/src/apparmor-2.13.4/libraries/libapparmor/src/grammar.y:186.1-11: warning: POSIX Yacc does not support %destructor [-Wyacc]
[2020-06-21T19:08:30.218Z]   186 | %destructor { free($$); } TOK_IP_ADDR
[2020-06-21T19:08:30.218Z]       | ^~~~~~~~~~~
[2020-06-21T19:08:30.218Z] /build/apparmor/src/apparmor-2.13.4/libraries/libapparmor/src/grammar.y:236.48-62: warning: unused value: $4 [-Wother]
[2020-06-21T19:08:30.218Z]   236 | 	| syslog_date TOK_ID TOK_SYSLOG_KERNEL TOK_DMESG_STAMP TOK_AU...
[2020-06-21T19:08:30.218Z]       |                                                ^~~~~~~~~~~~~~~
[2020-06-21T19:08:30.218Z] /build/apparmor/src/apparmor-2.13.4/libraries/libapparmor/src/grammar.y:238.48-62: warning: unused value: $4 [-Wother]
[2020-06-21T19:08:30.218Z]   238 | 	| syslog_date TOK_ID TOK_SYSLOG_KERNEL TOK_DMESG_STAMP TOK_AU...
[2020-06-21T19:08:30.218Z]       |                                                ^~~~~~~~~~~~~~~
[2020-06-21T19:08:30.769Z] updating grammar.h
[2020-06-21T19:08:30.769Z] make  all-am
[2020-06-21T19:08:30.769Z] make[2]: Entering directory '/build/apparmor/src/apparmor-2.13.4/libraries/libapparmor/src'
[2020-06-21T19:08:30.769Z] /bin/sh ../libtool  --tag=CC   --mode=compile gcc -DPACKAGE_NAME=\"\" -DPACKAGE_TARNAME=\"\" -DPACKAGE_VERSION=\"\" -DPACKAGE_STRING=\"\" -DPACKAGE_BUGREPORT=\"\" -DPACKAGE_URL=\"\" -DPACKAGE=\"libapparmor1\" -DVERSION=\"2.13.4\" -DYYTEXT_POINTER=1 -DSTDC_HEADERS=1 -DHAVE_SYS_TYPES_H=1 -DHAVE_SYS_STAT_H=1 -DHAVE_STDLIB_H=1 -DHAVE_STRING_H=1 -DHAVE_MEMORY_H=1 -DHAVE_STRINGS_H=1 -DHAVE_INTTYPES_H=1 -DHAVE_STDINT_H=1 -DHAVE_UNISTD_H=1 -DHAVE_UNISTD_H=1 -DHAVE_STDINT_H=1 -DHAVE_SYSLOG_H=1 -DHAVE_ASPRINTF=1 -DHAVE_SECURE_GETENV=1 -DHAVE_REALLOCARRAY=1 -DHAVE_DLFCN_H=1 -DLT_OBJDIR=\".libs/\" -I.  -D_GNU_SOURCE -I../include/ -D_FORTIFY_SOURCE=2 -Wall -march=x86-64 -mtune=generic -O2 -pipe -fno-plt -MT grammar.lo -MD -MP -MF .deps/grammar.Tpo -c -o grammar.lo grammar.c
[2020-06-21T19:08:30.769Z] /bin/sh ../libtool  --tag=CC   --mode=compile gcc -DPACKAGE_NAME=\"\" -DPACKAGE_TARNAME=\"\" -DPACKAGE_VERSION=\"\" -DPACKAGE_STRING=\"\" -DPACKAGE_BUGREPORT=\"\" -DPACKAGE_URL=\"\" -DPACKAGE=\"libapparmor1\" -DVERSION=\"2.13.4\" -DYYTEXT_POINTER=1 -DSTDC_HEADERS=1 -DHAVE_SYS_TYPES_H=1 -DHAVE_SYS_STAT_H=1 -DHAVE_STDLIB_H=1 -DHAVE_STRING_H=1 -DHAVE_MEMORY_H=1 -DHAVE_STRINGS_H=1 -DHAVE_INTTYPES_H=1 -DHAVE_STDINT_H=1 -DHAVE_UNISTD_H=1 -DHAVE_UNISTD_H=1 -DHAVE_STDINT_H=1 -DHAVE_SYSLOG_H=1 -DHAVE_ASPRINTF=1 -DHAVE_SECURE_GETENV=1 -DHAVE_REALLOCARRAY=1 -DHAVE_DLFCN_H=1 -DLT_OBJDIR=\".libs/\" -I.  -D_GNU_SOURCE -I../include/ -D_FORTIFY_SOURCE=2 -Wall -march=x86-64 -mtune=generic -O2 -pipe -fno-plt -MT libaalogparse.lo -MD -MP -MF .deps/libaalogparse.Tpo -c -o libaalogparse.lo libaalogparse.c
[2020-06-21T19:08:30.769Z] /bin/sh ../libtool  --tag=CC   --mode=compile gcc -DPACKAGE_NAME=\"\" -DPACKAGE_TARNAME=\"\" -DPACKAGE_VERSION=\"\" -DPACKAGE_STRING=\"\" -DPACKAGE_BUGREPORT=\"\" -DPACKAGE_URL=\"\" -DPACKAGE=\"libapparmor1\" -DVERSION=\"2.13.4\" -DYYTEXT_POINTER=1 -DSTDC_HEADERS=1 -DHAVE_SYS_TYPES_H=1 -DHAVE_SYS_STAT_H=1 -DHAVE_STDLIB_H=1 -DHAVE_STRING_H=1 -DHAVE_MEMORY_H=1 -DHAVE_STRINGS_H=1 -DHAVE_INTTYPES_H=1 -DHAVE_STDINT_H=1 -DHAVE_UNISTD_H=1 -DHAVE_UNISTD_H=1 -DHAVE_STDINT_H=1 -DHAVE_SYSLOG_H=1 -DHAVE_ASPRINTF=1 -DHAVE_SECURE_GETENV=1 -DHAVE_REALLOCARRAY=1 -DHAVE_DLFCN_H=1 -DLT_OBJDIR=\".libs/\" -I.  -D_GNU_SOURCE -I../include/ -D_FORTIFY_SOURCE=2 -Wall -march=x86-64 -mtune=generic -O2 -pipe -fno-plt -MT kernel.lo -MD -MP -MF .deps/kernel.Tpo -c -o kernel.lo kernel.c
[2020-06-21T19:08:30.770Z] /bin/sh ../libtool  --tag=CC   --mode=compile gcc -DPACKAGE_NAME=\"\" -DPACKAGE_TARNAME=\"\" -DPACKAGE_VERSION=\"\" -DPACKAGE_STRING=\"\" -DPACKAGE_BUGREPORT=\"\" -DPACKAGE_URL=\"\" -DPACKAGE=\"libapparmor1\" -DVERSION=\"2.13.4\" -DYYTEXT_POINTER=1 -DSTDC_HEADERS=1 -DHAVE_SYS_TYPES_H=1 -DHAVE_SYS_STAT_H=1 -DHAVE_STDLIB_H=1 -DHAVE_STRING_H=1 -DHAVE_MEMORY_H=1 -DHAVE_STRINGS_H=1 -DHAVE_INTTYPES_H=1 -DHAVE_STDINT_H=1 -DHAVE_UNISTD_H=1 -DHAVE_UNISTD_H=1 -DHAVE_STDINT_H=1 -DHAVE_SYSLOG_H=1 -DHAVE_ASPRINTF=1 -DHAVE_SECURE_GETENV=1 -DHAVE_REALLOCARRAY=1 -DHAVE_DLFCN_H=1 -DLT_OBJDIR=\".libs/\" -I.  -D_GNU_SOURCE -I../include/ -D_FORTIFY_SOURCE=2 -Wall -march=x86-64 -mtune=generic -O2 -pipe -fno-plt -MT scanner.lo -MD -MP -MF .deps/scanner.Tpo -c -o scanner.lo scanner.c
[2020-06-21T19:08:30.770Z] /bin/sh ../libtool  --tag=CC   --mode=compile gcc -DPACKAGE_NAME=\"\" -DPACKAGE_TARNAME=\"\" -DPACKAGE_VERSION=\"\" -DPACKAGE_STRING=\"\" -DPACKAGE_BUGREPORT=\"\" -DPACKAGE_URL=\"\" -DPACKAGE=\"libapparmor1\" -DVERSION=\"2.13.4\" -DYYTEXT_POINTER=1 -DSTDC_HEADERS=1 -DHAVE_SYS_TYPES_H=1 -DHAVE_SYS_STAT_H=1 -DHAVE_STDLIB_H=1 -DHAVE_STRING_H=1 -DHAVE_MEMORY_H=1 -DHAVE_STRINGS_H=1 -DHAVE_INTTYPES_H=1 -DHAVE_STDINT_H=1 -DHAVE_UNISTD_H=1 -DHAVE_UNISTD_H=1 -DHAVE_STDINT_H=1 -DHAVE_SYSLOG_H=1 -DHAVE_ASPRINTF=1 -DHAVE_SECURE_GETENV=1 -DHAVE_REALLOCARRAY=1 -DHAVE_DLFCN_H=1 -DLT_OBJDIR=\".libs/\" -I.  -D_GNU_SOURCE -I../include/ -D_FORTIFY_SOURCE=2 -Wall -march=x86-64 -mtune=generic -O2 -pipe -fno-plt -MT private.lo -MD -MP -MF .deps/private.Tpo -c -o private.lo private.c
[2020-06-21T19:08:30.770Z] /bin/sh ../libtool  --tag=CC   --mode=compile gcc -DPACKAGE_NAME=\"\" -DPACKAGE_TARNAME=\"\" -DPACKAGE_VERSION=\"\" -DPACKAGE_STRING=\"\" -DPACKAGE_BUGREPORT=\"\" -DPACKAGE_URL=\"\" -DPACKAGE=\"libapparmor1\" -DVERSION=\"2.13.4\" -DYYTEXT_POINTER=1 -DSTDC_HEADERS=1 -DHAVE_SYS_TYPES_H=1 -DHAVE_SYS_STAT_H=1 -DHAVE_STDLIB_H=1 -DHAVE_STRING_H=1 -DHAVE_MEMORY_H=1 -DHAVE_STRINGS_H=1 -DHAVE_INTTYPES_H=1 -DHAVE_STDINT_H=1 -DHAVE_UNISTD_H=1 -DHAVE_UNISTD_H=1 -DHAVE_STDINT_H=1 -DHAVE_SYSLOG_H=1 -DHAVE_ASPRINTF=1 -DHAVE_SECURE_GETENV=1 -DHAVE_REALLOCARRAY=1 -DHAVE_DLFCN_H=1 -DLT_OBJDIR=\".libs/\" -I.  -D_GNU_SOURCE -I../include/ -D_FORTIFY_SOURCE=2 -Wall -march=x86-64 -mtune=generic -O2 -pipe -fno-plt -MT features.lo -MD -MP -MF .deps/features.Tpo -c -o features.lo features.c
[2020-06-21T19:08:30.770Z] /bin/sh ../libtool  --tag=CC   --mode=compile gcc -DPACKAGE_NAME=\"\" -DPACKAGE_TARNAME=\"\" -DPACKAGE_VERSION=\"\" -DPACKAGE_STRING=\"\" -DPACKAGE_BUGREPORT=\"\" -DPACKAGE_URL=\"\" -DPACKAGE=\"libapparmor1\" -DVERSION=\"2.13.4\" -DYYTEXT_POINTER=1 -DSTDC_HEADERS=1 -DHAVE_SYS_TYPES_H=1 -DHAVE_SYS_STAT_H=1 -DHAVE_STDLIB_H=1 -DHAVE_STRING_H=1 -DHAVE_MEMORY_H=1 -DHAVE_STRINGS_H=1 -DHAVE_INTTYPES_H=1 -DHAVE_STDINT_H=1 -DHAVE_UNISTD_H=1 -DHAVE_UNISTD_H=1 -DHAVE_STDINT_H=1 -DHAVE_SYSLOG_H=1 -DHAVE_ASPRINTF=1 -DHAVE_SECURE_GETENV=1 -DHAVE_REALLOCARRAY=1 -DHAVE_DLFCN_H=1 -DLT_OBJDIR=\".libs/\" -I.  -D_GNU_SOURCE -I../include/ -D_FORTIFY_SOURCE=2 -Wall -march=x86-64 -mtune=generic -O2 -pipe -fno-plt -MT kernel_interface.lo -MD -MP -MF .deps/kernel_interface.Tpo -c -o kernel_interface.lo kernel_interface.c
[2020-06-21T19:08:30.770Z] /bin/sh ../libtool  --tag=CC   --mode=compile gcc -DPACKAGE_NAME=\"\" -DPACKAGE_TARNAME=\"\" -DPACKAGE_VERSION=\"\" -DPACKAGE_STRING=\"\" -DPACKAGE_BUGREPORT=\"\" -DPACKAGE_URL=\"\" -DPACKAGE=\"libapparmor1\" -DVERSION=\"2.13.4\" -DYYTEXT_POINTER=1 -DSTDC_HEADERS=1 -DHAVE_SYS_TYPES_H=1 -DHAVE_SYS_STAT_H=1 -DHAVE_STDLIB_H=1 -DHAVE_STRING_H=1 -DHAVE_MEMORY_H=1 -DHAVE_STRINGS_H=1 -DHAVE_INTTYPES_H=1 -DHAVE_STDINT_H=1 -DHAVE_UNISTD_H=1 -DHAVE_UNISTD_H=1 -DHAVE_STDINT_H=1 -DHAVE_SYSLOG_H=1 -DHAVE_ASPRINTF=1 -DHAVE_SECURE_GETENV=1 -DHAVE_REALLOCARRAY=1 -DHAVE_DLFCN_H=1 -DLT_OBJDIR=\".libs/\" -I.  -D_GNU_SOURCE -I../include/ -D_FORTIFY_SOURCE=2 -Wall -march=x86-64 -mtune=generic -O2 -pipe -fno-plt -MT policy_cache.lo -MD -MP -MF .deps/policy_cache.Tpo -c -o policy_cache.lo policy_cache.c
[2020-06-21T19:08:30.770Z] /bin/sh ../libtool  --tag=CC   --mode=compile gcc -DPACKAGE_NAME=\"\" -DPACKAGE_TARNAME=\"\" -DPACKAGE_VERSION=\"\" -DPACKAGE_STRING=\"\" -DPACKAGE_BUGREPORT=\"\" -DPACKAGE_URL=\"\" -DPACKAGE=\"libapparmor1\" -DVERSION=\"2.13.4\" -DYYTEXT_POINTER=1 -DSTDC_HEADERS=1 -DHAVE_SYS_TYPES_H=1 -DHAVE_SYS_STAT_H=1 -DHAVE_STDLIB_H=1 -DHAVE_STRING_H=1 -DHAVE_MEMORY_H=1 -DHAVE_STRINGS_H=1 -DHAVE_INTTYPES_H=1 -DHAVE_STDINT_H=1 -DHAVE_UNISTD_H=1 -DHAVE_UNISTD_H=1 -DHAVE_STDINT_H=1 -DHAVE_SYSLOG_H=1 -DHAVE_ASPRINTF=1 -DHAVE_SECURE_GETENV=1 -DHAVE_REALLOCARRAY=1 -DHAVE_DLFCN_H=1 -DLT_OBJDIR=\".libs/\" -I.  -D_GNU_SOURCE -I../include/ -D_FORTIFY_SOURCE=2 -Wall -march=x86-64 -mtune=generic -O2 -pipe -fno-plt -MT PMurHash.lo -MD -MP -MF .deps/PMurHash.Tpo -c -o PMurHash.lo PMurHash.c
[2020-06-21T19:08:30.770Z] cd ".." && \
[2020-06-21T19:08:30.770Z] /bin/sh ./config.status --file="src/libapparmor.pc"
[2020-06-21T19:08:30.771Z] libtool: compile:  gcc -DPACKAGE_NAME=\"\" -DPACKAGE_TARNAME=\"\" -DPACKAGE_VERSION=\"\" -DPACKAGE_STRING=\"\" -DPACKAGE_BUGREPORT=\"\" -DPACKAGE_URL=\"\" -DPACKAGE=\"libapparmor1\" -DVERSION=\"2.13.4\" -DYYTEXT_POINTER=1 -DSTDC_HEADERS=1 -DHAVE_SYS_TYPES_H=1 -DHAVE_SYS_STAT_H=1 -DHAVE_STDLIB_H=1 -DHAVE_STRING_H=1 -DHAVE_MEMORY_H=1 -DHAVE_STRINGS_H=1 -DHAVE_INTTYPES_H=1 -DHAVE_STDINT_H=1 -DHAVE_UNISTD_H=1 -DHAVE_UNISTD_H=1 -DHAVE_STDINT_H=1 -DHAVE_SYSLOG_H=1 -DHAVE_ASPRINTF=1 -DHAVE_SECURE_GETENV=1 -DHAVE_REALLOCARRAY=1 -DHAVE_DLFCN_H=1 -DLT_OBJDIR=\".libs/\" -I. -D_GNU_SOURCE -I../include/ -D_FORTIFY_SOURCE=2 -Wall -march=x86-64 -mtune=generic -O2 -pipe -fno-plt -MT kernel_interface.lo -MD -MP -MF .deps/kernel_interface.Tpo -c kernel_interface.c  -fPIC -DPIC -o .libs/kernel_interface.o
[2020-06-21T19:08:30.771Z] libtool: compile:  gcc -DPACKAGE_NAME=\"\" -DPACKAGE_TARNAME=\"\" -DPACKAGE_VERSION=\"\" -DPACKAGE_STRING=\"\" -DPACKAGE_BUGREPORT=\"\" -DPACKAGE_URL=\"\" -DPACKAGE=\"libapparmor1\" -DVERSION=\"2.13.4\" -DYYTEXT_POINTER=1 -DSTDC_HEADERS=1 -DHAVE_SYS_TYPES_H=1 -DHAVE_SYS_STAT_H=1 -DHAVE_STDLIB_H=1 -DHAVE_STRING_H=1 -DHAVE_MEMORY_H=1 -DHAVE_STRINGS_H=1 -DHAVE_INTTYPES_H=1 -DHAVE_STDINT_H=1 -DHAVE_UNISTD_H=1 -DHAVE_UNISTD_H=1 -DHAVE_STDINT_H=1 -DHAVE_SYSLOG_H=1 -DHAVE_ASPRINTF=1 -DHAVE_SECURE_GETENV=1 -DHAVE_REALLOCARRAY=1 -DHAVE_DLFCN_H=1 -DLT_OBJDIR=\".libs/\" -I. -D_GNU_SOURCE -I../include/ -D_FORTIFY_SOURCE=2 -Wall -march=x86-64 -mtune=generic -O2 -pipe -fno-plt -MT PMurHash.lo -MD -MP -MF .deps/PMurHash.Tpo -c PMurHash.c  -fPIC -DPIC -o .libs/PMurHash.o
[2020-06-21T19:08:30.771Z] libtool: compile:  gcc -DPACKAGE_NAME=\"\" -DPACKAGE_TARNAME=\"\" -DPACKAGE_VERSION=\"\" -DPACKAGE_STRING=\"\" -DPACKAGE_BUGREPORT=\"\" -DPACKAGE_URL=\"\" -DPACKAGE=\"libapparmor1\" -DVERSION=\"2.13.4\" -DYYTEXT_POINTER=1 -DSTDC_HEADERS=1 -DHAVE_SYS_TYPES_H=1 -DHAVE_SYS_STAT_H=1 -DHAVE_STDLIB_H=1 -DHAVE_STRING_H=1 -DHAVE_MEMORY_H=1 -DHAVE_STRINGS_H=1 -DHAVE_INTTYPES_H=1 -DHAVE_STDINT_H=1 -DHAVE_UNISTD_H=1 -DHAVE_UNISTD_H=1 -DHAVE_STDINT_H=1 -DHAVE_SYSLOG_H=1 -DHAVE_ASPRINTF=1 -DHAVE_SECURE_GETENV=1 -DHAVE_REALLOCARRAY=1 -DHAVE_DLFCN_H=1 -DLT_OBJDIR=\".libs/\" -I. -D_GNU_SOURCE -I../include/ -D_FORTIFY_SOURCE=2 -Wall -march=x86-64 -mtune=generic -O2 -pipe -fno-plt -MT scanner.lo -MD -MP -MF .deps/scanner.Tpo -c scanner.c  -fPIC -DPIC -o .libs/scanner.o
[2020-06-21T19:08:30.771Z] libtool: compile:  gcc -DPACKAGE_NAME=\"\" -DPACKAGE_TARNAME=\"\" -DPACKAGE_VERSION=\"\" -DPACKAGE_STRING=\"\" -DPACKAGE_BUGREPORT=\"\" -DPACKAGE_URL=\"\" -DPACKAGE=\"libapparmor1\" -DVERSION=\"2.13.4\" -DYYTEXT_POINTER=1 -DSTDC_HEADERS=1 -DHAVE_SYS_TYPES_H=1 -DHAVE_SYS_STAT_H=1 -DHAVE_STDLIB_H=1 -DHAVE_STRING_H=1 -DHAVE_MEMORY_H=1 -DHAVE_STRINGS_H=1 -DHAVE_INTTYPES_H=1 -DHAVE_STDINT_H=1 -DHAVE_UNISTD_H=1 -DHAVE_UNISTD_H=1 -DHAVE_STDINT_H=1 -DHAVE_SYSLOG_H=1 -DHAVE_ASPRINTF=1 -DHAVE_SECURE_GETENV=1 -DHAVE_REALLOCARRAY=1 -DHAVE_DLFCN_H=1 -DLT_OBJDIR=\".libs/\" -I. -D_GNU_SOURCE -I../include/ -D_FORTIFY_SOURCE=2 -Wall -march=x86-64 -mtune=generic -O2 -pipe -fno-plt -MT private.lo -MD -MP -MF .deps/private.Tpo -c private.c  -fPIC -DPIC -o .libs/private.o
[2020-06-21T19:08:30.771Z] libtool: compile:  gcc -DPACKAGE_NAME=\"\" -DPACKAGE_TARNAME=\"\" -DPACKAGE_VERSION=\"\" -DPACKAGE_STRING=\"\" -DPACKAGE_BUGREPORT=\"\" -DPACKAGE_URL=\"\" -DPACKAGE=\"libapparmor1\" -DVERSION=\"2.13.4\" -DYYTEXT_POINTER=1 -DSTDC_HEADERS=1 -DHAVE_SYS_TYPES_H=1 -DHAVE_SYS_STAT_H=1 -DHAVE_STDLIB_H=1 -DHAVE_STRING_H=1 -DHAVE_MEMORY_H=1 -DHAVE_STRINGS_H=1 -DHAVE_INTTYPES_H=1 -DHAVE_STDINT_H=1 -DHAVE_UNISTD_H=1 -DHAVE_UNISTD_H=1 -DHAVE_STDINT_H=1 -DHAVE_SYSLOG_H=1 -DHAVE_ASPRINTF=1 -DHAVE_SECURE_GETENV=1 -DHAVE_REALLOCARRAY=1 -DHAVE_DLFCN_H=1 -DLT_OBJDIR=\".libs/\" -I. -D_GNU_SOURCE -I../include/ -D_FORTIFY_SOURCE=2 -Wall -march=x86-64 -mtune=generic -O2 -pipe -fno-plt -MT grammar.lo -MD -MP -MF .deps/grammar.Tpo -c grammar.c  -fPIC -DPIC -o .libs/grammar.o
[2020-06-21T19:08:30.771Z] libtool: compile:  gcc -DPACKAGE_NAME=\"\" -DPACKAGE_TARNAME=\"\" -DPACKAGE_VERSION=\"\" -DPACKAGE_STRING=\"\" -DPACKAGE_BUGREPORT=\"\" -DPACKAGE_URL=\"\" -DPACKAGE=\"libapparmor1\" -DVERSION=\"2.13.4\" -DYYTEXT_POINTER=1 -DSTDC_HEADERS=1 -DHAVE_SYS_TYPES_H=1 -DHAVE_SYS_STAT_H=1 -DHAVE_STDLIB_H=1 -DHAVE_STRING_H=1 -DHAVE_MEMORY_H=1 -DHAVE_STRINGS_H=1 -DHAVE_INTTYPES_H=1 -DHAVE_STDINT_H=1 -DHAVE_UNISTD_H=1 -DHAVE_UNISTD_H=1 -DHAVE_STDINT_H=1 -DHAVE_SYSLOG_H=1 -DHAVE_ASPRINTF=1 -DHAVE_SECURE_GETENV=1 -DHAVE_REALLOCARRAY=1 -DHAVE_DLFCN_H=1 -DLT_OBJDIR=\".libs/\" -I. -D_GNU_SOURCE -I../include/ -D_FORTIFY_SOURCE=2 -Wall -march=x86-64 -mtune=generic -O2 -pipe -fno-plt -MT features.lo -MD -MP -MF .deps/features.Tpo -c features.c  -fPIC -DPIC -o .libs/features.o
[2020-06-21T19:08:30.771Z] libtool: compile:  gcc -DPACKAGE_NAME=\"\" -DPACKAGE_TARNAME=\"\" -DPACKAGE_VERSION=\"\" -DPACKAGE_STRING=\"\" -DPACKAGE_BUGREPORT=\"\" -DPACKAGE_URL=\"\" -DPACKAGE=\"libapparmor1\" -DVERSION=\"2.13.4\" -DYYTEXT_POINTER=1 -DSTDC_HEADERS=1 -DHAVE_SYS_TYPES_H=1 -DHAVE_SYS_STAT_H=1 -DHAVE_STDLIB_H=1 -DHAVE_STRING_H=1 -DHAVE_MEMORY_H=1 -DHAVE_STRINGS_H=1 -DHAVE_INTTYPES_H=1 -DHAVE_STDINT_H=1 -DHAVE_UNISTD_H=1 -DHAVE_UNISTD_H=1 -DHAVE_STDINT_H=1 -DHAVE_SYSLOG_H=1 -DHAVE_ASPRINTF=1 -DHAVE_SECURE_GETENV=1 -DHAVE_REALLOCARRAY=1 -DHAVE_DLFCN_H=1 -DLT_OBJDIR=\".libs/\" -I. -D_GNU_SOURCE -I../include/ -D_FORTIFY_SOURCE=2 -Wall -march=x86-64 -mtune=generic -O2 -pipe -fno-plt -MT libaalogparse.lo -MD -MP -MF .deps/libaalogparse.Tpo -c libaalogparse.c  -fPIC -DPIC -o .libs/libaalogparse.o
[2020-06-21T19:08:30.772Z] libtool: compile:  gcc -DPACKAGE_NAME=\"\" -DPACKAGE_TARNAME=\"\" -DPACKAGE_VERSION=\"\" -DPACKAGE_STRING=\"\" -DPACKAGE_BUGREPORT=\"\" -DPACKAGE_URL=\"\" -DPACKAGE=\"libapparmor1\" -DVERSION=\"2.13.4\" -DYYTEXT_POINTER=1 -DSTDC_HEADERS=1 -DHAVE_SYS_TYPES_H=1 -DHAVE_SYS_STAT_H=1 -DHAVE_STDLIB_H=1 -DHAVE_STRING_H=1 -DHAVE_MEMORY_H=1 -DHAVE_STRINGS_H=1 -DHAVE_INTTYPES_H=1 -DHAVE_STDINT_H=1 -DHAVE_UNISTD_H=1 -DHAVE_UNISTD_H=1 -DHAVE_STDINT_H=1 -DHAVE_SYSLOG_H=1 -DHAVE_ASPRINTF=1 -DHAVE_SECURE_GETENV=1 -DHAVE_REALLOCARRAY=1 -DHAVE_DLFCN_H=1 -DLT_OBJDIR=\".libs/\" -I. -D_GNU_SOURCE -I../include/ -D_FORTIFY_SOURCE=2 -Wall -march=x86-64 -mtune=generic -O2 -pipe -fno-plt -MT policy_cache.lo -MD -MP -MF .deps/policy_cache.Tpo -c policy_cache.c  -fPIC -DPIC -o .libs/policy_cache.o
[2020-06-21T19:08:30.772Z] libtool: compile:  gcc -DPACKAGE_NAME=\"\" -DPACKAGE_TARNAME=\"\" -DPACKAGE_VERSION=\"\" -DPACKAGE_STRING=\"\" -DPACKAGE_BUGREPORT=\"\" -DPACKAGE_URL=\"\" -DPACKAGE=\"libapparmor1\" -DVERSION=\"2.13.4\" -DYYTEXT_POINTER=1 -DSTDC_HEADERS=1 -DHAVE_SYS_TYPES_H=1 -DHAVE_SYS_STAT_H=1 -DHAVE_STDLIB_H=1 -DHAVE_STRING_H=1 -DHAVE_MEMORY_H=1 -DHAVE_STRINGS_H=1 -DHAVE_INTTYPES_H=1 -DHAVE_STDINT_H=1 -DHAVE_UNISTD_H=1 -DHAVE_UNISTD_H=1 -DHAVE_STDINT_H=1 -DHAVE_SYSLOG_H=1 -DHAVE_ASPRINTF=1 -DHAVE_SECURE_GETENV=1 -DHAVE_REALLOCARRAY=1 -DHAVE_DLFCN_H=1 -DLT_OBJDIR=\".libs/\" -I. -D_GNU_SOURCE -I../include/ -D_FORTIFY_SOURCE=2 -Wall -march=x86-64 -mtune=generic -O2 -pipe -fno-plt -MT kernel.lo -MD -MP -MF .deps/kernel.Tpo -c kernel.c  -fPIC -DPIC -o .libs/kernel.o
[2020-06-21T19:08:30.772Z] libtool: compile:  gcc -DPACKAGE_NAME=\"\" -DPACKAGE_TARNAME=\"\" -DPACKAGE_VERSION=\"\" -DPACKAGE_STRING=\"\" -DPACKAGE_BUGREPORT=\"\" -DPACKAGE_URL=\"\" -DPACKAGE=\"libapparmor1\" -DVERSION=\"2.13.4\" -DYYTEXT_POINTER=1 -DSTDC_HEADERS=1 -DHAVE_SYS_TYPES_H=1 -DHAVE_SYS_STAT_H=1 -DHAVE_STDLIB_H=1 -DHAVE_STRING_H=1 -DHAVE_MEMORY_H=1 -DHAVE_STRINGS_H=1 -DHAVE_INTTYPES_H=1 -DHAVE_STDINT_H=1 -DHAVE_UNISTD_H=1 -DHAVE_UNISTD_H=1 -DHAVE_STDINT_H=1 -DHAVE_SYSLOG_H=1 -DHAVE_ASPRINTF=1 -DHAVE_SECURE_GETENV=1 -DHAVE_REALLOCARRAY=1 -DHAVE_DLFCN_H=1 -DLT_OBJDIR=\".libs/\" -I. -D_GNU_SOURCE -I../include/ -D_FORTIFY_SOURCE=2 -Wall -march=x86-64 -mtune=generic -O2 -pipe -fno-plt -MT PMurHash.lo -MD -MP -MF .deps/PMurHash.Tpo -c PMurHash.c -o PMurHash.o >/dev/null 2>&1
[2020-06-21T19:08:30.772Z] libtool: compile:  gcc -DPACKAGE_NAME=\"\" -DPACKAGE_TARNAME=\"\" -DPACKAGE_VERSION=\"\" -DPACKAGE_STRING=\"\" -DPACKAGE_BUGREPORT=\"\" -DPACKAGE_URL=\"\" -DPACKAGE=\"libapparmor1\" -DVERSION=\"2.13.4\" -DYYTEXT_POINTER=1 -DSTDC_HEADERS=1 -DHAVE_SYS_TYPES_H=1 -DHAVE_SYS_STAT_H=1 -DHAVE_STDLIB_H=1 -DHAVE_STRING_H=1 -DHAVE_MEMORY_H=1 -DHAVE_STRINGS_H=1 -DHAVE_INTTYPES_H=1 -DHAVE_STDINT_H=1 -DHAVE_UNISTD_H=1 -DHAVE_UNISTD_H=1 -DHAVE_STDINT_H=1 -DHAVE_SYSLOG_H=1 -DHAVE_ASPRINTF=1 -DHAVE_SECURE_GETENV=1 -DHAVE_REALLOCARRAY=1 -DHAVE_DLFCN_H=1 -DLT_OBJDIR=\".libs/\" -I. -D_GNU_SOURCE -I../include/ -D_FORTIFY_SOURCE=2 -Wall -march=x86-64 -mtune=generic -O2 -pipe -fno-plt -MT libaalogparse.lo -MD -MP -MF .deps/libaalogparse.Tpo -c libaalogparse.c -o libaalogparse.o >/dev/null 2>&1
[2020-06-21T19:08:30.772Z] libtool: compile:  gcc -DPACKAGE_NAME=\"\" -DPACKAGE_TARNAME=\"\" -DPACKAGE_VERSION=\"\" -DPACKAGE_STRING=\"\" -DPACKAGE_BUGREPORT=\"\" -DPACKAGE_URL=\"\" -DPACKAGE=\"libapparmor1\" -DVERSION=\"2.13.4\" -DYYTEXT_POINTER=1 -DSTDC_HEADERS=1 -DHAVE_SYS_TYPES_H=1 -DHAVE_SYS_STAT_H=1 -DHAVE_STDLIB_H=1 -DHAVE_STRING_H=1 -DHAVE_MEMORY_H=1 -DHAVE_STRINGS_H=1 -DHAVE_INTTYPES_H=1 -DHAVE_STDINT_H=1 -DHAVE_UNISTD_H=1 -DHAVE_UNISTD_H=1 -DHAVE_STDINT_H=1 -DHAVE_SYSLOG_H=1 -DHAVE_ASPRINTF=1 -DHAVE_SECURE_GETENV=1 -DHAVE_REALLOCARRAY=1 -DHAVE_DLFCN_H=1 -DLT_OBJDIR=\".libs/\" -I. -D_GNU_SOURCE -I../include/ -D_FORTIFY_SOURCE=2 -Wall -march=x86-64 -mtune=generic -O2 -pipe -fno-plt -MT kernel_interface.lo -MD -MP -MF .deps/kernel_interface.Tpo -c kernel_interface.c -o kernel_interface.o >/dev/null 2>&1
[2020-06-21T19:08:30.772Z] config.status: creating src/libapparmor.pc
[2020-06-21T19:08:31.023Z] mv -f .deps/PMurHash.Tpo .deps/PMurHash.Plo
[2020-06-21T19:08:31.023Z] libtool: compile:  gcc -DPACKAGE_NAME=\"\" -DPACKAGE_TARNAME=\"\" -DPACKAGE_VERSION=\"\" -DPACKAGE_STRING=\"\" -DPACKAGE_BUGREPORT=\"\" -DPACKAGE_URL=\"\" -DPACKAGE=\"libapparmor1\" -DVERSION=\"2.13.4\" -DYYTEXT_POINTER=1 -DSTDC_HEADERS=1 -DHAVE_SYS_TYPES_H=1 -DHAVE_SYS_STAT_H=1 -DHAVE_STDLIB_H=1 -DHAVE_STRING_H=1 -DHAVE_MEMORY_H=1 -DHAVE_STRINGS_H=1 -DHAVE_INTTYPES_H=1 -DHAVE_STDINT_H=1 -DHAVE_UNISTD_H=1 -DHAVE_UNISTD_H=1 -DHAVE_STDINT_H=1 -DHAVE_SYSLOG_H=1 -DHAVE_ASPRINTF=1 -DHAVE_SECURE_GETENV=1 -DHAVE_REALLOCARRAY=1 -DHAVE_DLFCN_H=1 -DLT_OBJDIR=\".libs/\" -I. -D_GNU_SOURCE -I../include/ -D_FORTIFY_SOURCE=2 -Wall -march=x86-64 -mtune=generic -O2 -pipe -fno-plt -MT private.lo -MD -MP -MF .deps/private.Tpo -c private.c -o private.o >/dev/null 2>&1
[2020-06-21T19:08:31.023Z] libtool: compile:  gcc -DPACKAGE_NAME=\"\" -DPACKAGE_TARNAME=\"\" -DPACKAGE_VERSION=\"\" -DPACKAGE_STRING=\"\" -DPACKAGE_BUGREPORT=\"\" -DPACKAGE_URL=\"\" -DPACKAGE=\"libapparmor1\" -DVERSION=\"2.13.4\" -DYYTEXT_POINTER=1 -DSTDC_HEADERS=1 -DHAVE_SYS_TYPES_H=1 -DHAVE_SYS_STAT_H=1 -DHAVE_STDLIB_H=1 -DHAVE_STRING_H=1 -DHAVE_MEMORY_H=1 -DHAVE_STRINGS_H=1 -DHAVE_INTTYPES_H=1 -DHAVE_STDINT_H=1 -DHAVE_UNISTD_H=1 -DHAVE_UNISTD_H=1 -DHAVE_STDINT_H=1 -DHAVE_SYSLOG_H=1 -DHAVE_ASPRINTF=1 -DHAVE_SECURE_GETENV=1 -DHAVE_REALLOCARRAY=1 -DHAVE_DLFCN_H=1 -DLT_OBJDIR=\".libs/\" -I. -D_GNU_SOURCE -I../include/ -D_FORTIFY_SOURCE=2 -Wall -march=x86-64 -mtune=generic -O2 -pipe -fno-plt -MT features.lo -MD -MP -MF .deps/features.Tpo -c features.c -o features.o >/dev/null 2>&1
[2020-06-21T19:08:31.023Z] libtool: compile:  gcc -DPACKAGE_NAME=\"\" -DPACKAGE_TARNAME=\"\" -DPACKAGE_VERSION=\"\" -DPACKAGE_STRING=\"\" -DPACKAGE_BUGREPORT=\"\" -DPACKAGE_URL=\"\" -DPACKAGE=\"libapparmor1\" -DVERSION=\"2.13.4\" -DYYTEXT_POINTER=1 -DSTDC_HEADERS=1 -DHAVE_SYS_TYPES_H=1 -DHAVE_SYS_STAT_H=1 -DHAVE_STDLIB_H=1 -DHAVE_STRING_H=1 -DHAVE_MEMORY_H=1 -DHAVE_STRINGS_H=1 -DHAVE_INTTYPES_H=1 -DHAVE_STDINT_H=1 -DHAVE_UNISTD_H=1 -DHAVE_UNISTD_H=1 -DHAVE_STDINT_H=1 -DHAVE_SYSLOG_H=1 -DHAVE_ASPRINTF=1 -DHAVE_SECURE_GETENV=1 -DHAVE_REALLOCARRAY=1 -DHAVE_DLFCN_H=1 -DLT_OBJDIR=\".libs/\" -I. -D_GNU_SOURCE -I../include/ -D_FORTIFY_SOURCE=2 -Wall -march=x86-64 -mtune=generic -O2 -pipe -fno-plt -MT policy_cache.lo -MD -MP -MF .deps/policy_cache.Tpo -c policy_cache.c -o policy_cache.o >/dev/null 2>&1
[2020-06-21T19:08:31.023Z] mv -f .deps/libaalogparse.Tpo .deps/libaalogparse.Plo
[2020-06-21T19:08:31.023Z] libtool: compile:  gcc -DPACKAGE_NAME=\"\" -DPACKAGE_TARNAME=\"\" -DPACKAGE_VERSION=\"\" -DPACKAGE_STRING=\"\" -DPACKAGE_BUGREPORT=\"\" -DPACKAGE_URL=\"\" -DPACKAGE=\"libapparmor1\" -DVERSION=\"2.13.4\" -DYYTEXT_POINTER=1 -DSTDC_HEADERS=1 -DHAVE_SYS_TYPES_H=1 -DHAVE_SYS_STAT_H=1 -DHAVE_STDLIB_H=1 -DHAVE_STRING_H=1 -DHAVE_MEMORY_H=1 -DHAVE_STRINGS_H=1 -DHAVE_INTTYPES_H=1 -DHAVE_STDINT_H=1 -DHAVE_UNISTD_H=1 -DHAVE_UNISTD_H=1 -DHAVE_STDINT_H=1 -DHAVE_SYSLOG_H=1 -DHAVE_ASPRINTF=1 -DHAVE_SECURE_GETENV=1 -DHAVE_REALLOCARRAY=1 -DHAVE_DLFCN_H=1 -DLT_OBJDIR=\".libs/\" -I. -D_GNU_SOURCE -I../include/ -D_FORTIFY_SOURCE=2 -Wall -march=x86-64 -mtune=generic -O2 -pipe -fno-plt -MT grammar.lo -MD -MP -MF .deps/grammar.Tpo -c grammar.c -o grammar.o >/dev/null 2>&1
[2020-06-21T19:08:31.023Z] mv -f .deps/kernel_interface.Tpo .deps/kernel_interface.Plo
[2020-06-21T19:08:31.023Z] libtool: compile:  gcc -DPACKAGE_NAME=\"\" -DPACKAGE_TARNAME=\"\" -DPACKAGE_VERSION=\"\" -DPACKAGE_STRING=\"\" -DPACKAGE_BUGREPORT=\"\" -DPACKAGE_URL=\"\" -DPACKAGE=\"libapparmor1\" -DVERSION=\"2.13.4\" -DYYTEXT_POINTER=1 -DSTDC_HEADERS=1 -DHAVE_SYS_TYPES_H=1 -DHAVE_SYS_STAT_H=1 -DHAVE_STDLIB_H=1 -DHAVE_STRING_H=1 -DHAVE_MEMORY_H=1 -DHAVE_STRINGS_H=1 -DHAVE_INTTYPES_H=1 -DHAVE_STDINT_H=1 -DHAVE_UNISTD_H=1 -DHAVE_UNISTD_H=1 -DHAVE_STDINT_H=1 -DHAVE_SYSLOG_H=1 -DHAVE_ASPRINTF=1 -DHAVE_SECURE_GETENV=1 -DHAVE_REALLOCARRAY=1 -DHAVE_DLFCN_H=1 -DLT_OBJDIR=\".libs/\" -I. -D_GNU_SOURCE -I../include/ -D_FORTIFY_SOURCE=2 -Wall -march=x86-64 -mtune=generic -O2 -pipe -fno-plt -MT kernel.lo -MD -MP -MF .deps/kernel.Tpo -c kernel.c -o kernel.o >/dev/null 2>&1
[2020-06-21T19:08:31.023Z] mv -f .deps/features.Tpo .deps/features.Plo
[2020-06-21T19:08:31.274Z] libtool: compile:  gcc -DPACKAGE_NAME=\"\" -DPACKAGE_TARNAME=\"\" -DPACKAGE_VERSION=\"\" -DPACKAGE_STRING=\"\" -DPACKAGE_BUGREPORT=\"\" -DPACKAGE_URL=\"\" -DPACKAGE=\"libapparmor1\" -DVERSION=\"2.13.4\" -DYYTEXT_POINTER=1 -DSTDC_HEADERS=1 -DHAVE_SYS_TYPES_H=1 -DHAVE_SYS_STAT_H=1 -DHAVE_STDLIB_H=1 -DHAVE_STRING_H=1 -DHAVE_MEMORY_H=1 -DHAVE_STRINGS_H=1 -DHAVE_INTTYPES_H=1 -DHAVE_STDINT_H=1 -DHAVE_UNISTD_H=1 -DHAVE_UNISTD_H=1 -DHAVE_STDINT_H=1 -DHAVE_SYSLOG_H=1 -DHAVE_ASPRINTF=1 -DHAVE_SECURE_GETENV=1 -DHAVE_REALLOCARRAY=1 -DHAVE_DLFCN_H=1 -DLT_OBJDIR=\".libs/\" -I. -D_GNU_SOURCE -I../include/ -D_FORTIFY_SOURCE=2 -Wall -march=x86-64 -mtune=generic -O2 -pipe -fno-plt -MT scanner.lo -MD -MP -MF .deps/scanner.Tpo -c scanner.c -o scanner.o >/dev/null 2>&1
[2020-06-21T19:08:31.274Z] mv -f .deps/private.Tpo .deps/private.Plo
[2020-06-21T19:08:31.274Z] mv -f .deps/policy_cache.Tpo .deps/policy_cache.Plo
[2020-06-21T19:08:31.274Z] mv -f .deps/grammar.Tpo .deps/grammar.Plo
[2020-06-21T19:08:31.274Z] mv -f .deps/kernel.Tpo .deps/kernel.Plo
[2020-06-21T19:08:31.524Z] mv -f .deps/scanner.Tpo .deps/scanner.Plo
[2020-06-21T19:08:31.524Z] /bin/sh ../libtool  --tag=CC   --mode=link gcc -Wall -march=x86-64 -mtune=generic -O2 -pipe -fno-plt -version-info 7:2:6 -XCClinker -dynamic -pthread -Wl,--version-script=../src/libapparmor.map -Wl,-O1,--sort-common,--as-needed,-z,relro,-z,now -o libapparmor.la -rpath /usr/lib grammar.lo libaalogparse.lo kernel.lo scanner.lo private.lo features.lo kernel_interface.lo policy_cache.lo PMurHash.lo  
[2020-06-21T19:08:31.774Z] libtool: link: gcc -shared  -fPIC -DPIC  .libs/grammar.o .libs/libaalogparse.o .libs/kernel.o .libs/scanner.o .libs/private.o .libs/features.o .libs/kernel_interface.o .libs/policy_cache.o .libs/PMurHash.o    -march=x86-64 -mtune=generic -O2 -dynamic -pthread -Wl,--version-script=../src/libapparmor.map -Wl,-O1 -Wl,--sort-common -Wl,--as-needed -Wl,-z -Wl,relro -Wl,-z -Wl,now   -pthread -Wl,-soname -Wl,libapparmor.so.1 -o .libs/libapparmor.so.1.6.2
[2020-06-21T19:08:31.774Z] libtool: link: (cd ".libs" && rm -f "libapparmor.so.1" && ln -s "libapparmor.so.1.6.2" "libapparmor.so.1")
[2020-06-21T19:08:31.774Z] libtool: link: (cd ".libs" && rm -f "libapparmor.so" && ln -s "libapparmor.so.1.6.2" "libapparmor.so")
[2020-06-21T19:08:31.774Z] libtool: link: ar cr .libs/libapparmor.a  grammar.o libaalogparse.o kernel.o scanner.o private.o features.o kernel_interface.o policy_cache.o PMurHash.o
[2020-06-21T19:08:31.775Z] libtool: link: ranlib .libs/libapparmor.a
[2020-06-21T19:08:31.775Z] libtool: link: ( cd ".libs" && rm -f "libapparmor.la" && ln -s "../libapparmor.la" "libapparmor.la" )
[2020-06-21T19:08:31.775Z] make[2]: Leaving directory '/build/apparmor/src/apparmor-2.13.4/libraries/libapparmor/src'
[2020-06-21T19:08:31.775Z] make[1]: Leaving directory '/build/apparmor/src/apparmor-2.13.4/libraries/libapparmor/src'
[2020-06-21T19:08:31.775Z] Making all in include
[2020-06-21T19:08:31.775Z] make[1]: Entering directory '/build/apparmor/src/apparmor-2.13.4/libraries/libapparmor/include'
[2020-06-21T19:08:31.775Z] Making all in sys
[2020-06-21T19:08:31.775Z] make[2]: Entering directory '/build/apparmor/src/apparmor-2.13.4/libraries/libapparmor/include/sys'
[2020-06-21T19:08:31.775Z] make[2]: Nothing to be done for 'all'.
[2020-06-21T19:08:31.775Z] make[2]: Leaving directory '/build/apparmor/src/apparmor-2.13.4/libraries/libapparmor/include/sys'
[2020-06-21T19:08:31.775Z] make[2]: Entering directory '/build/apparmor/src/apparmor-2.13.4/libraries/libapparmor/include'
[2020-06-21T19:08:31.775Z] make[2]: Nothing to be done for 'all-am'.
[2020-06-21T19:08:31.775Z] make[2]: Leaving directory '/build/apparmor/src/apparmor-2.13.4/libraries/libapparmor/include'
[2020-06-21T19:08:31.775Z] make[1]: Leaving directory '/build/apparmor/src/apparmor-2.13.4/libraries/libapparmor/include'
[2020-06-21T19:08:31.775Z] Making all in swig
[2020-06-21T19:08:31.775Z] make[1]: Entering directory '/build/apparmor/src/apparmor-2.13.4/libraries/libapparmor/swig'
[2020-06-21T19:08:31.775Z] Making all in perl
[2020-06-21T19:08:31.775Z] make[2]: Entering directory '/build/apparmor/src/apparmor-2.13.4/libraries/libapparmor/swig/perl'
[2020-06-21T19:08:31.775Z] /usr/bin/swig -perl -I./../../include -module LibAppArmor -o libapparmor_wrap.c ./../SWIG/libapparmor.i
[2020-06-21T19:08:32.025Z] /usr/bin/perl Makefile.PL PREFIX=/usr MAKEFILE=Makefile.perl
[2020-06-21T19:08:32.276Z] Warning: -L../../src/.libs/ changed to -L/build/apparmor/src/apparmor-2.13.4/libraries/libapparmor/swig/perl/../../src/.libs/
[2020-06-21T19:08:32.276Z] Generating a Unix-style Makefile.perl
[2020-06-21T19:08:32.276Z] Writing Makefile.perl for LibAppArmor
[2020-06-21T19:08:32.276Z] Writing MYMETA.yml and MYMETA.json
[2020-06-21T19:08:32.276Z] sed -ie 's/LD_RUN_PATH="\x24(LD_RUN_PATH)"//g' Makefile.perl
[2020-06-21T19:08:32.276Z] sed -ie 's/^LD_RUN_PATH.*//g' Makefile.perl
[2020-06-21T19:08:32.276Z] if test ! -f libapparmor_wrap.c; then cp ./libapparmor_wrap.c . ; fi
[2020-06-21T19:08:32.276Z] make -fMakefile.perl
[2020-06-21T19:08:32.276Z] make[3]: Entering directory '/build/apparmor/src/apparmor-2.13.4/libraries/libapparmor/swig/perl'
[2020-06-21T19:08:32.276Z] cc -c  -D_FORTIFY_SOURCE=2 -I../../include -march=x86-64 -mtune=generic -O2 -pipe -fno-plt -D_REENTRANT -D_GNU_SOURCE -fwrapv -fno-strict-aliasing -pipe -fstack-protector-strong -I/usr/local/include -D_LARGEFILE_SOURCE -D_FILE_OFFSET_BITS=64 -D_FORTIFY_SOURCE=2 -march=x86-64 -mtune=generic -O2 -pipe -fno-plt   -DVERSION=\"2.13.4\" -DXS_VERSION=\"2.13.4\" -fPIC "-I/usr/lib/perl5/5.32/core_perl/CORE"   libapparmor_wrap.c
[2020-06-21T19:08:32.276Z] Running Mkbootstrap for LibAppArmor ()
[2020-06-21T19:08:32.276Z] chmod 644 "LibAppArmor.bs"
[2020-06-21T19:08:32.276Z] "/usr/bin/perl" -MExtUtils::Command::MM -e 'cp_nonempty' -- LibAppArmor.bs blib/arch/auto/LibAppArmor/LibAppArmor.bs 644
[2020-06-21T19:08:32.526Z] cp LibAppArmor.pm blib/lib/LibAppArmor.pm
[2020-06-21T19:08:35.009Z] rm -f blib/arch/auto/LibAppArmor/LibAppArmor.so
[2020-06-21T19:08:35.009Z] cc  -shared -Wl,-O1,--sort-common,--as-needed,-z,relro,-z,now -L/usr/local/lib -fstack-protector-strong  libapparmor_wrap.o -Wl,-O1,--sort-common,--as-needed,-z,relro,-z,now -o blib/arch/auto/LibAppArmor/LibAppArmor.so  \
[2020-06-21T19:08:35.009Z]    -L/build/apparmor/src/apparmor-2.13.4/libraries/libapparmor/swig/perl/../../src/.libs -lapparmor   \
[2020-06-21T19:08:35.009Z]   
[2020-06-21T19:08:35.009Z] chmod 755 blib/arch/auto/LibAppArmor/LibAppArmor.so
[2020-06-21T19:08:35.009Z] make[3]: Leaving directory '/build/apparmor/src/apparmor-2.13.4/libraries/libapparmor/swig/perl'
[2020-06-21T19:08:35.009Z] if test ../.. != ../.. ; then rm -f libapparmor_wrap.c ; fi
[2020-06-21T19:08:35.009Z] make[2]: Leaving directory '/build/apparmor/src/apparmor-2.13.4/libraries/libapparmor/swig/perl'
[2020-06-21T19:08:35.009Z] Making all in python
[2020-06-21T19:08:35.009Z] make[2]: Entering directory '/build/apparmor/src/apparmor-2.13.4/libraries/libapparmor/swig/python'
[2020-06-21T19:08:35.009Z] Making all in test
[2020-06-21T19:08:35.009Z] make[3]: Entering directory '/build/apparmor/src/apparmor-2.13.4/libraries/libapparmor/swig/python/test'
[2020-06-21T19:08:35.009Z] make[3]: Nothing to be done for 'all'.
[2020-06-21T19:08:35.009Z] make[3]: Leaving directory '/build/apparmor/src/apparmor-2.13.4/libraries/libapparmor/swig/python/test'
[2020-06-21T19:08:35.009Z] make[3]: Entering directory '/build/apparmor/src/apparmor-2.13.4/libraries/libapparmor/swig/python'
[2020-06-21T19:08:35.009Z] /usr/bin/swig -python -I./../../include -module LibAppArmor -o libapparmor_wrap.c ./../SWIG/libapparmor.i
[2020-06-21T19:08:35.259Z] if test ! -f libapparmor_wrap.c; then cp ./libapparmor_wrap.c . ; fi
[2020-06-21T19:08:35.259Z] /usr/bin/python setup.py build
[2020-06-21T19:08:35.259Z] running build
[2020-06-21T19:08:35.259Z] running build_py
[2020-06-21T19:08:35.259Z] creating build
[2020-06-21T19:08:35.259Z] creating build/lib.linux-x86_64-3.8
[2020-06-21T19:08:35.259Z] creating build/lib.linux-x86_64-3.8/LibAppArmor
[2020-06-21T19:08:35.259Z] copying ./LibAppArmor.py -> build/lib.linux-x86_64-3.8/LibAppArmor
[2020-06-21T19:08:35.259Z] copying ./__init__.py -> build/lib.linux-x86_64-3.8/LibAppArmor
[2020-06-21T19:08:35.259Z] running build_ext
[2020-06-21T19:08:35.259Z] building '_LibAppArmor' extension
[2020-06-21T19:08:35.259Z] creating build/temp.linux-x86_64-3.8
[2020-06-21T19:08:35.259Z] gcc -pthread -Wno-unused-result -Wsign-compare -DNDEBUG -g -fwrapv -O3 -Wall -march=x86-64 -mtune=generic -O3 -pipe -fno-plt -fno-semantic-interposition -march=x86-64 -mtune=generic -O3 -pipe -fno-plt -march=x86-64 -mtune=generic -O3 -pipe -fno-plt -march=x86-64 -mtune=generic -O2 -pipe -fno-plt -D_FORTIFY_SOURCE=2 -fPIC -I../../include -I/usr/include/python3.8 -c libapparmor_wrap.c -o build/temp.linux-x86_64-3.8/libapparmor_wrap.o
[2020-06-21T19:08:37.826Z] gcc -pthread -shared -Wl,-O1,--sort-common,--as-needed,-z,relro,-z,now -fno-semantic-interposition -Wl,-O1,--sort-common,--as-needed,-z,relro,-z,now -Wl,-O1,--sort-common,--as-needed,-z,relro,-z,now -march=x86-64 -mtune=generic -O2 -pipe -fno-plt -D_FORTIFY_SOURCE=2 build/temp.linux-x86_64-3.8/libapparmor_wrap.o -L/usr/lib -o build/lib.linux-x86_64-3.8/LibAppArmor/_LibAppArmor.cpython-38-x86_64-linux-gnu.so -L../../src/.libs -lapparmor
[2020-06-21T19:08:37.826Z] make[3]: Leaving directory '/build/apparmor/src/apparmor-2.13.4/libraries/libapparmor/swig/python'
[2020-06-21T19:08:37.826Z] make[2]: Leaving directory '/build/apparmor/src/apparmor-2.13.4/libraries/libapparmor/swig/python'
[2020-06-21T19:08:37.826Z] Making all in ruby
[2020-06-21T19:08:37.826Z] make[2]: Entering directory '/build/apparmor/src/apparmor-2.13.4/libraries/libapparmor/swig/ruby'
[2020-06-21T19:08:37.826Z] /usr/bin/swig -ruby -module LibAppArmor -I../../include -o LibAppArmor_wrap.c ./../SWIG/libapparmor.i
[2020-06-21T19:08:37.826Z] PREFIX=/usr /usr/bin/ruby extconf.rb --with-LibAppArmor-include=../../include
[2020-06-21T19:08:38.076Z] checking for parse_record() in -lapparmor... ../../include/aalogparse.h:115: Warning 801: Wrong class name (corrected to `Aa_log_record')
[2020-06-21T19:08:38.076Z] ../../include/aalogparse.h:115: Warning 801: Wrong class name (corrected to `Aa_log_record')
[2020-06-21T19:08:38.326Z] yes
[2020-06-21T19:08:38.326Z] checking for aalogparse.h... yes
[2020-06-21T19:08:38.326Z] creating Makefile
[2020-06-21T19:08:38.326Z] make -fMakefile.ruby
[2020-06-21T19:08:38.326Z] make[3]: Entering directory '/build/apparmor/src/apparmor-2.13.4/libraries/libapparmor/swig/ruby'
[2020-06-21T19:08:38.327Z] compiling LibAppArmor_wrap.c
[2020-06-21T19:08:40.188Z] linking shared-object LibAppArmor.so
[2020-06-21T19:08:40.188Z] make[3]: Leaving directory '/build/apparmor/src/apparmor-2.13.4/libraries/libapparmor/swig/ruby'
[2020-06-21T19:08:40.188Z] make[2]: Leaving directory '/build/apparmor/src/apparmor-2.13.4/libraries/libapparmor/swig/ruby'
[2020-06-21T19:08:40.188Z] make[2]: Entering directory '/build/apparmor/src/apparmor-2.13.4/libraries/libapparmor/swig'
[2020-06-21T19:08:40.188Z] make[2]: Nothing to be done for 'all-am'.
[2020-06-21T19:08:40.188Z] make[2]: Leaving directory '/build/apparmor/src/apparmor-2.13.4/libraries/libapparmor/swig'
[2020-06-21T19:08:40.188Z] make[1]: Leaving directory '/build/apparmor/src/apparmor-2.13.4/libraries/libapparmor/swig'
[2020-06-21T19:08:40.188Z] Making all in testsuite
[2020-06-21T19:08:40.188Z] make[1]: Entering directory '/build/apparmor/src/apparmor-2.13.4/libraries/libapparmor/testsuite'
[2020-06-21T19:08:40.188Z] Making all in lib
[2020-06-21T19:08:40.188Z] make[2]: Entering directory '/build/apparmor/src/apparmor-2.13.4/libraries/libapparmor/testsuite/lib'
[2020-06-21T19:08:40.188Z] make[2]: Nothing to be done for 'all'.
[2020-06-21T19:08:40.188Z] make[2]: Leaving directory '/build/apparmor/src/apparmor-2.13.4/libraries/libapparmor/testsuite/lib'
[2020-06-21T19:08:40.188Z] Making all in config
[2020-06-21T19:08:40.188Z] make[2]: Entering directory '/build/apparmor/src/apparmor-2.13.4/libraries/libapparmor/testsuite/config'
[2020-06-21T19:08:40.188Z] make[2]: Nothing to be done for 'all'.
[2020-06-21T19:08:40.188Z] make[2]: Leaving directory '/build/apparmor/src/apparmor-2.13.4/libraries/libapparmor/testsuite/config'
[2020-06-21T19:08:40.188Z] Making all in libaalogparse.test
[2020-06-21T19:08:40.188Z] make[2]: Entering directory '/build/apparmor/src/apparmor-2.13.4/libraries/libapparmor/testsuite/libaalogparse.test'
[2020-06-21T19:08:40.188Z] make[2]: Nothing to be done for 'all'.
[2020-06-21T19:08:40.188Z] make[2]: Leaving directory '/build/apparmor/src/apparmor-2.13.4/libraries/libapparmor/testsuite/libaalogparse.test'
[2020-06-21T19:08:40.188Z] make[2]: Entering directory '/build/apparmor/src/apparmor-2.13.4/libraries/libapparmor/testsuite'
[2020-06-21T19:08:40.188Z] gcc -DPACKAGE_NAME=\"\" -DPACKAGE_TARNAME=\"\" -DPACKAGE_VERSION=\"\" -DPACKAGE_STRING=\"\" -DPACKAGE_BUGREPORT=\"\" -DPACKAGE_URL=\"\" -DPACKAGE=\"libapparmor1\" -DVERSION=\"2.13.4\" -DYYTEXT_POINTER=1 -DSTDC_HEADERS=1 -DHAVE_SYS_TYPES_H=1 -DHAVE_SYS_STAT_H=1 -DHAVE_STDLIB_H=1 -DHAVE_STRING_H=1 -DHAVE_MEMORY_H=1 -DHAVE_STRINGS_H=1 -DHAVE_INTTYPES_H=1 -DHAVE_STDINT_H=1 -DHAVE_UNISTD_H=1 -DHAVE_UNISTD_H=1 -DHAVE_STDINT_H=1 -DHAVE_SYSLOG_H=1 -DHAVE_ASPRINTF=1 -DHAVE_SECURE_GETENV=1 -DHAVE_REALLOCARRAY=1 -DHAVE_DLFCN_H=1 -DLT_OBJDIR=\".libs/\" -I. -I. -I../include  -DLOCALEDIR=\"/usr/share/locale\" -D_FORTIFY_SOURCE=2 -Wall -march=x86-64 -mtune=generic -O2 -pipe -fno-plt -MT test_multi_multi-test_multi.o -MD -MP -MF .deps/test_multi_multi-test_multi.Tpo -c -o test_multi_multi-test_multi.o `test -f 'test_multi.c' || echo './'`test_multi.c
[2020-06-21T19:08:40.188Z] mv -f .deps/test_multi_multi-test_multi.Tpo .deps/test_multi_multi-test_multi.Po
[2020-06-21T19:08:40.188Z] /bin/sh ../libtool  --tag=CC   --mode=link gcc -Wall -march=x86-64 -mtune=generic -O2 -pipe -fno-plt  -Wl,-O1,--sort-common,--as-needed,-z,relro,-z,now -o test_multi.multi test_multi_multi-test_multi.o -L../src/.libs -lapparmor 
[2020-06-21T19:08:40.188Z] libtool: link: gcc -Wall -march=x86-64 -mtune=generic -O2 -pipe -fno-plt -Wl,-O1 -Wl,--sort-common -Wl,--as-needed -Wl,-z -Wl,relro -Wl,-z -Wl,now -o .libs/test_multi.multi test_multi_multi-test_multi.o  -L../src/.libs /build/apparmor/src/apparmor-2.13.4/libraries/libapparmor/src/.libs/libapparmor.so -pthread
[2020-06-21T19:08:40.188Z] make[2]: Leaving directory '/build/apparmor/src/apparmor-2.13.4/libraries/libapparmor/testsuite'
[2020-06-21T19:08:40.188Z] make[1]: Leaving directory '/build/apparmor/src/apparmor-2.13.4/libraries/libapparmor/testsuite'
[2020-06-21T19:08:40.188Z] make[1]: Entering directory '/build/apparmor/src/apparmor-2.13.4/libraries/libapparmor'
[2020-06-21T19:08:40.188Z] make[1]: Nothing to be done for 'all-am'.
[2020-06-21T19:08:40.188Z] make[1]: Leaving directory '/build/apparmor/src/apparmor-2.13.4/libraries/libapparmor'
[2020-06-21T19:08:40.188Z] make: Entering directory '/build/apparmor/src/apparmor-2.13.4/binutils'
[2020-06-21T19:08:40.188Z] cc -Wl,-O1,--sort-common,--as-needed,-z,relro,-z,now -L../libraries/libapparmor//src/.libs -march=x86-64 -mtune=generic -O2 -pipe -fno-plt -D_FORTIFY_SOURCE=2   -DPACKAGE=\"aa-binutils\" -DLOCALEDIR=\"/usr/share/locale\" -I../libraries/libapparmor//include -o aa-enabled aa_enabled.c  -Wl,-Bstatic -lapparmor  -Wl,-Bdynamic -lpthread 
[2020-06-21T19:08:40.189Z] cc -Wl,-O1,--sort-common,--as-needed,-z,relro,-z,now -L../libraries/libapparmor//src/.libs -march=x86-64 -mtune=generic -O2 -pipe -fno-plt -D_FORTIFY_SOURCE=2   -DPACKAGE=\"aa-binutils\" -DLOCALEDIR=\"/usr/share/locale\" -I../libraries/libapparmor//include -o aa-exec aa_exec.c  -Wl,-Bstatic -lapparmor  -Wl,-Bdynamic -lpthread
[2020-06-21T19:08:40.439Z] make[1]: Entering directory '/build/apparmor/src/apparmor-2.13.4/binutils/po'
[2020-06-21T19:08:40.439Z] msgfmt -c -o de.mo de.po
[2020-06-21T19:08:40.439Z] msgfmt -c -o en_GB.mo en_GB.po
[2020-06-21T19:08:40.439Z] msgfmt -c -o es.mo es.po
[2020-06-21T19:08:40.439Z] msgfmt -c -o id.mo id.po
[2020-06-21T19:08:40.439Z] msgfmt -c -o pt.mo pt.po
[2020-06-21T19:08:40.439Z] msgfmt -c -o ru.mo ru.po
[2020-06-21T19:08:40.439Z] msgfmt -c -o sv.mo sv.po
[2020-06-21T19:08:40.439Z] msgfmt -c -o tr.mo tr.po
[2020-06-21T19:08:40.439Z] es.po:7: warning: header field 'Language' missing in header
[2020-06-21T19:08:40.439Z] sv.po:7: warning: header field 'Language' missing in header
[2020-06-21T19:08:40.439Z] tr.po:7: warning: header field 'Language' missing in header
[2020-06-21T19:08:40.439Z] make[1]: Leaving directory '/build/apparmor/src/apparmor-2.13.4/binutils/po'
[2020-06-21T19:08:40.439Z] make: Leaving directory '/build/apparmor/src/apparmor-2.13.4/binutils'
[2020-06-21T19:08:40.439Z] make: Entering directory '/build/apparmor/src/apparmor-2.13.4/parser'
[2020-06-21T19:08:40.439Z] which: no rpm in (/usr/bin:/usr/sbin:/bin:/sbin:/usr/bin:/usr/sbin:/usr/local/bin:/usr/local/sbin:/usr/bin/site_perl:/usr/bin/vendor_perl:/usr/bin/core_perl:/usr/bin/site_perl:/usr/bin/vendor_perl:/usr/bin/core_perl:/usr/bin/site_perl:/usr/bin/vendor_perl:/usr/bin/core_perl:/usr/bin/site_perl:/usr/bin/vendor_perl:/usr/bin/core_perl)
[2020-06-21T19:08:40.439Z] g++ -march=x86-64 -mtune=generic -O2 -pipe -fno-plt -D_FORTIFY_SOURCE=2 -Wall -Wsign-compare -Wmissing-field-initializers -Wformat-security -Wunused-parameter -std=gnu++0x -D_GNU_SOURCE  -DPACKAGE=\"apparmor-parser\" -DLOCALEDIR=\"/usr/share/locale\" -DSUBDOMAIN_CONFDIR=\"/etc/apparmor\" -I../libraries/libapparmor/include -c -o parser_common.o parser_common.c
[2020-06-21T19:08:40.690Z] g++ -march=x86-64 -mtune=generic -O2 -pipe -fno-plt -D_FORTIFY_SOURCE=2 -Wall -Wsign-compare -Wmissing-field-initializers -Wformat-security -Wunused-parameter -std=gnu++0x -D_GNU_SOURCE  -DPACKAGE=\"apparmor-parser\" -DLOCALEDIR=\"/usr/share/locale\" -DSUBDOMAIN_CONFDIR=\"/etc/apparmor\" -I../libraries/libapparmor/include -c -o parser_include.o parser_include.c
[2020-06-21T19:08:40.690Z] g++ -march=x86-64 -mtune=generic -O2 -pipe -fno-plt -D_FORTIFY_SOURCE=2 -Wall -Wsign-compare -Wmissing-field-initializers -Wformat-security -Wunused-parameter -std=gnu++0x -D_GNU_SOURCE  -DPACKAGE=\"apparmor-parser\" -DLOCALEDIR=\"/usr/share/locale\" -DSUBDOMAIN_CONFDIR=\"/etc/apparmor\" -I../libraries/libapparmor/include -c -o parser_interface.o parser_interface.c
[2020-06-21T19:08:40.690Z] bison -d -o parser_yacc.c parser_yacc.y
[2020-06-21T19:08:40.690Z] ../common/list_capabilities.sh | LC_ALL=C sed -n -e "s/[ \\t]\\?CAP_\\([A-Z0-9_]\\+\\)/\{\"\\L\\1\", \\UCAP_\\1\},\\n/pg" > cap_names.h
[2020-06-21T19:08:40.690Z] g++ -march=x86-64 -mtune=generic -O2 -pipe -fno-plt -D_FORTIFY_SOURCE=2 -Wall -Wsign-compare -Wmissing-field-initializers -Wformat-security -Wunused-parameter -std=gnu++0x -D_GNU_SOURCE  -DPACKAGE=\"apparmor-parser\" -DLOCALEDIR=\"/usr/share/locale\" -DSUBDOMAIN_CONFDIR=\"/etc/apparmor\" -I../libraries/libapparmor/include -c -o parser_merge.o parser_merge.c
[2020-06-21T19:08:40.690Z] g++ -march=x86-64 -mtune=generic -O2 -pipe -fno-plt -D_FORTIFY_SOURCE=2 -Wall -Wsign-compare -Wmissing-field-initializers -Wformat-security -Wunused-parameter -std=gnu++0x -D_GNU_SOURCE  -DPACKAGE=\"apparmor-parser\" -DLOCALEDIR=\"/usr/share/locale\" -DSUBDOMAIN_CONFDIR=\"/etc/apparmor\" -I../libraries/libapparmor/include -c -o parser_symtab.o parser_symtab.c
[2020-06-21T19:08:40.940Z] g++ -march=x86-64 -mtune=generic -O2 -pipe -fno-plt -D_FORTIFY_SOURCE=2 -Wall -Wsign-compare -Wmissing-field-initializers -Wformat-security -Wunused-parameter -std=gnu++0x -D_GNU_SOURCE  -DPACKAGE=\"apparmor-parser\" -DLOCALEDIR=\"/usr/share/locale\" -DSUBDOMAIN_CONFDIR=\"/etc/apparmor\" -I../libraries/libapparmor/include -c -o parser_regex.o parser_regex.c
[2020-06-21T19:08:40.940Z] g++ -march=x86-64 -mtune=generic -O2 -pipe -fno-plt -D_FORTIFY_SOURCE=2 -Wall -Wsign-compare -Wmissing-field-initializers -Wformat-security -Wunused-parameter -std=gnu++0x -D_GNU_SOURCE  -DPACKAGE=\"apparmor-parser\" -DLOCALEDIR=\"/usr/share/locale\" -DSUBDOMAIN_CONFDIR=\"/etc/apparmor\" -I../libraries/libapparmor/include -c -o parser_variable.o parser_variable.c
[2020-06-21T19:08:40.940Z] g++ -march=x86-64 -mtune=generic -O2 -pipe -fno-plt -D_FORTIFY_SOURCE=2 -Wall -Wsign-compare -Wmissing-field-initializers -Wformat-security -Wunused-parameter -std=gnu++0x -D_GNU_SOURCE  -DPACKAGE=\"apparmor-parser\" -DLOCALEDIR=\"/usr/share/locale\" -DSUBDOMAIN_CONFDIR=\"/etc/apparmor\" -I../libraries/libapparmor/include -c -o parser_alias.o parser_alias.c
[2020-06-21T19:08:40.940Z] g++ -march=x86-64 -mtune=generic -O2 -pipe -fno-plt -D_FORTIFY_SOURCE=2 -Wall -Wsign-compare -Wmissing-field-initializers -Wformat-security -Wunused-parameter -std=gnu++0x -D_GNU_SOURCE  -DPACKAGE=\"apparmor-parser\" -DLOCALEDIR=\"/usr/share/locale\" -DSUBDOMAIN_CONFDIR=\"/etc/apparmor\" -I../libraries/libapparmor/include -c -o common_optarg.o common_optarg.c
[2020-06-21T19:08:41.191Z] g++ -march=x86-64 -mtune=generic -O2 -pipe -fno-plt -D_FORTIFY_SOURCE=2 -Wall -Wsign-compare -Wmissing-field-initializers -Wformat-security -Wunused-parameter -std=gnu++0x -D_GNU_SOURCE  -DPACKAGE=\"apparmor-parser\" -DLOCALEDIR=\"/usr/share/locale\" -DSUBDOMAIN_CONFDIR=\"/etc/apparmor\" -I../libraries/libapparmor/include -c -o lib.o lib.c
[2020-06-21T19:08:41.191Z] ../common/list_af_names.sh | LC_ALL=C sed -n -e 's/[ \t]\?AF_MAX[ \t]\+[0-9]\+,//g'  -e 's/[ \t]\+\?AF_\([A-Z0-9_]\+\)[ \t]\+\([0-9]\+\),/#ifndef AF_\1\n#  define AF_\1 \2\n#endif\nAA_GEN_NET_ENT("\L\1", \UAF_\1)\n/pg' > af_names.h
[2020-06-21T19:08:41.191Z] ../common/list_af_names.sh | LC_ALL=C sed -n -e 's/AF_MAX[ \t]\+\([0-9]\+\),\?.*/\n#define AA_AF_MAX \1\n/p' >> af_names.h
[2020-06-21T19:08:41.191Z] g++ -march=x86-64 -mtune=generic -O2 -pipe -fno-plt -D_FORTIFY_SOURCE=2 -Wall -Wsign-compare -Wmissing-field-initializers -Wformat-security -Wunused-parameter -std=gnu++0x -D_GNU_SOURCE  -DPACKAGE=\"apparmor-parser\" -DLOCALEDIR=\"/usr/share/locale\" -DSUBDOMAIN_CONFDIR=\"/etc/apparmor\" -I../libraries/libapparmor/include -c -o mount.o mount.cc
[2020-06-21T19:08:41.191Z] # cat af_names.h
[2020-06-21T19:08:41.191Z] g++ -march=x86-64 -mtune=generic -O2 -pipe -fno-plt -D_FORTIFY_SOURCE=2 -Wall -Wsign-compare -Wmissing-field-initializers -Wformat-security -Wunused-parameter -std=gnu++0x -D_GNU_SOURCE  -DPACKAGE=\"apparmor-parser\" -DLOCALEDIR=\"/usr/share/locale\" -DSUBDOMAIN_CONFDIR=\"/etc/apparmor\" -I../libraries/libapparmor/include -c -o dbus.o dbus.cc
[2020-06-21T19:08:41.191Z] g++ -march=x86-64 -mtune=generic -O2 -pipe -fno-plt -D_FORTIFY_SOURCE=2 -Wall -Wsign-compare -Wmissing-field-initializers -Wformat-security -Wunused-parameter -std=gnu++0x -D_GNU_SOURCE  -DPACKAGE=\"apparmor-parser\" -DLOCALEDIR=\"/usr/share/locale\" -DSUBDOMAIN_CONFDIR=\"/etc/apparmor\" -I../libraries/libapparmor/include -c -o profile.o profile.cc
[2020-06-21T19:08:41.191Z] g++ -march=x86-64 -mtune=generic -O2 -pipe -fno-plt -D_FORTIFY_SOURCE=2 -Wall -Wsign-compare -Wmissing-field-initializers -Wformat-security -Wunused-parameter -std=gnu++0x -D_GNU_SOURCE  -DPACKAGE=\"apparmor-parser\" -DLOCALEDIR=\"/usr/share/locale\" -DSUBDOMAIN_CONFDIR=\"/etc/apparmor\" -I../libraries/libapparmor/include -c -o rule.o rule.cc
[2020-06-21T19:08:41.441Z] g++ -march=x86-64 -mtune=generic -O2 -pipe -fno-plt -D_FORTIFY_SOURCE=2 -Wall -Wsign-compare -Wmissing-field-initializers -Wformat-security -Wunused-parameter -std=gnu++0x -D_GNU_SOURCE  -DPACKAGE=\"apparmor-parser\" -DLOCALEDIR=\"/usr/share/locale\" -DSUBDOMAIN_CONFDIR=\"/etc/apparmor\" -I../libraries/libapparmor/include -c -o signal.o signal.cc
[2020-06-21T19:08:41.441Z] g++ -march=x86-64 -mtune=generic -O2 -pipe -fno-plt -D_FORTIFY_SOURCE=2 -Wall -Wsign-compare -Wmissing-field-initializers -Wformat-security -Wunused-parameter -std=gnu++0x -D_GNU_SOURCE  -DPACKAGE=\"apparmor-parser\" -DLOCALEDIR=\"/usr/share/locale\" -DSUBDOMAIN_CONFDIR=\"/etc/apparmor\" -I../libraries/libapparmor/include -c -o ptrace.o ptrace.cc
[2020-06-21T19:08:41.441Z] g++ -march=x86-64 -mtune=generic -O2 -pipe -fno-plt -D_FORTIFY_SOURCE=2 -Wall -Wsign-compare -Wmissing-field-initializers -Wformat-security -Wunused-parameter -std=gnu++0x -D_GNU_SOURCE  -DPACKAGE=\"apparmor-parser\" -DLOCALEDIR=\"/usr/share/locale\" -DSUBDOMAIN_CONFDIR=\"/etc/apparmor\" -I../libraries/libapparmor/include -c -o af_rule.o af_rule.cc
[2020-06-21T19:08:41.442Z] g++ -march=x86-64 -mtune=generic -O2 -pipe -fno-plt -D_FORTIFY_SOURCE=2 -Wall -Wsign-compare -Wmissing-field-initializers -Wformat-security -Wunused-parameter -std=gnu++0x -D_GNU_SOURCE  -DPACKAGE=\"apparmor-parser\" -DLOCALEDIR=\"/usr/share/locale\" -DSUBDOMAIN_CONFDIR=\"/etc/apparmor\" -I../libraries/libapparmor/include -c -o af_unix.o af_unix.cc
[2020-06-21T19:08:41.692Z] g++ -march=x86-64 -mtune=generic -O2 -pipe -fno-plt -D_FORTIFY_SOURCE=2 -Wall -Wsign-compare -Wmissing-field-initializers -Wformat-security -Wunused-parameter -std=gnu++0x -D_GNU_SOURCE  -DPACKAGE=\"apparmor-parser\" -DLOCALEDIR=\"/usr/share/locale\" -DSUBDOMAIN_CONFDIR=\"/etc/apparmor\" -I../libraries/libapparmor/include -c -o policy_cache.o policy_cache.c
[2020-06-21T19:08:41.692Z] make -C libapparmor_re CFLAGS="-march=x86-64 -mtune=generic -O2 -pipe -fno-plt -D_FORTIFY_SOURCE=2 -Wall -Wsign-compare -Wmissing-field-initializers -Wformat-security -Wunused-parameter -std=gnu++0x -D_GNU_SOURCE"
[2020-06-21T19:08:41.692Z] make[1]: Entering directory '/build/apparmor/src/apparmor-2.13.4/parser/libapparmor_re'
[2020-06-21T19:08:41.692Z] bison -o parse.cc parse.y
[2020-06-21T19:08:41.692Z] g++ -march=x86-64 -mtune=generic -O2 -pipe -fno-plt -D_FORTIFY_SOURCE=2 -Wall -Wsign-compare -Wmissing-field-initializers -Wformat-security -Wunused-parameter -std=gnu++0x -D_GNU_SOURCE -I../../libraries/libapparmor/include -D_FORTIFY_SOURCE=2  -c -o expr-tree.o expr-tree.cc
[2020-06-21T19:08:41.692Z] g++ -march=x86-64 -mtune=generic -O2 -pipe -fno-plt -D_FORTIFY_SOURCE=2 -Wall -Wsign-compare -Wmissing-field-initializers -Wformat-security -Wunused-parameter -std=gnu++0x -D_GNU_SOURCE -I../../libraries/libapparmor/include -D_FORTIFY_SOURCE=2  -c -o hfa.o hfa.cc
[2020-06-21T19:08:41.692Z] g++ -march=x86-64 -mtune=generic -O2 -pipe -fno-plt -D_FORTIFY_SOURCE=2 -Wall -Wsign-compare -Wmissing-field-initializers -Wformat-security -Wunused-parameter -std=gnu++0x -D_GNU_SOURCE -I../../libraries/libapparmor/include -D_FORTIFY_SOURCE=2  -c -o chfa.o chfa.cc
[2020-06-21T19:08:41.692Z] g++ -march=x86-64 -mtune=generic -O2 -pipe -fno-plt -D_FORTIFY_SOURCE=2 -Wall -Wsign-compare -Wmissing-field-initializers -Wformat-security -Wunused-parameter -std=gnu++0x -D_GNU_SOURCE -I../../libraries/libapparmor/include -D_FORTIFY_SOURCE=2  -c -o aare_rules.o aare_rules.cc
[2020-06-21T19:08:41.692Z] make[1]: Entering directory '/build/apparmor/src/apparmor-2.13.4/parser/po'
[2020-06-21T19:08:41.692Z] msgfmt -c -o af.mo af.po
[2020-06-21T19:08:41.692Z] msgfmt -c -o ar.mo ar.po
[2020-06-21T19:08:41.692Z] msgfmt -c -o bg.mo bg.po
[2020-06-21T19:08:41.692Z] msgfmt -c -o bn.mo bn.po
[2020-06-21T19:08:41.692Z] parse.y:63.1-21: warning: deprecated directive: ‘%name-prefix "regex_"’, use ‘%define api.prefix {regex_}’ [-Wdeprecated]
[2020-06-21T19:08:41.692Z]    63 | %name-prefix "regex_"
[2020-06-21T19:08:41.692Z]       | ^~~~~~~~~~~~~~~~~~~~~
[2020-06-21T19:08:41.692Z]       | %define api.prefix {regex_}
[2020-06-21T19:08:41.692Z] msgfmt -c -o bs.mo bs.po
[2020-06-21T19:08:41.692Z] msgfmt -c -o ca.mo ca.po
[2020-06-21T19:08:41.692Z] msgfmt -c -o ce.mo ce.po
[2020-06-21T19:08:41.692Z] msgfmt -c -o cs.mo cs.po
[2020-06-21T19:08:41.692Z] msgfmt -c -o cy.mo cy.po
[2020-06-21T19:08:41.692Z] msgfmt -c -o da.mo da.po
[2020-06-21T19:08:41.692Z] msgfmt -c -o de.mo de.po
[2020-06-21T19:08:41.692Z] msgfmt -c -o el.mo el.po
[2020-06-21T19:08:41.692Z] msgfmt -c -o en_AU.mo en_AU.po
[2020-06-21T19:08:41.692Z] msgfmt -c -o en_CA.mo en_CA.po
[2020-06-21T19:08:41.692Z] msgfmt -c -o en_GB.mo en_GB.po
[2020-06-21T19:08:41.692Z] msgfmt -c -o es.mo es.po
[2020-06-21T19:08:41.692Z] msgfmt -c -o et.mo et.po
[2020-06-21T19:08:41.692Z] msgfmt -c -o fi.mo fi.po
[2020-06-21T19:08:41.692Z] msgfmt -c -o fr.mo fr.po
[2020-06-21T19:08:41.692Z] msgfmt -c -o gl.mo gl.po
[2020-06-21T19:08:41.692Z] msgfmt -c -o gu.mo gu.po
[2020-06-21T19:08:41.692Z] msgfmt -c -o he.mo he.po
[2020-06-21T19:08:41.692Z] msgfmt -c -o hi.mo hi.po
[2020-06-21T19:08:41.692Z] msgfmt -c -o hr.mo hr.po
[2020-06-21T19:08:41.692Z] msgfmt -c -o hu.mo hu.po
[2020-06-21T19:08:41.692Z] msgfmt -c -o id.mo id.po
[2020-06-21T19:08:41.692Z] parse.y: warning: fix-its can be applied.  Rerun with option '--update'. [-Wother]
[2020-06-21T19:08:41.692Z] msgfmt -c -o it.mo it.po
[2020-06-21T19:08:41.692Z] g++ -march=x86-64 -mtune=generic -O2 -pipe -fno-plt -D_FORTIFY_SOURCE=2 -Wall -Wsign-compare -Wmissing-field-initializers -Wformat-security -Wunused-parameter -std=gnu++0x -D_GNU_SOURCE -I../../libraries/libapparmor/include -D_FORTIFY_SOURCE=2  -c -o parse.o parse.cc
[2020-06-21T19:08:41.692Z] msgfmt -c -o ja.mo ja.po
[2020-06-21T19:08:41.692Z] flex -B -v -oparser_lex.c parser_lex.l
[2020-06-21T19:08:41.692Z] msgfmt -c -o ka.mo ka.po
[2020-06-21T19:08:41.692Z] msgfmt -c -o km.mo km.po
[2020-06-21T19:08:41.692Z] msgfmt -c -o ko.mo ko.po
[2020-06-21T19:08:41.692Z] msgfmt -c -o lo.mo lo.po
[2020-06-21T19:08:41.692Z] msgfmt -c -o lt.mo lt.po
[2020-06-21T19:08:41.692Z] msgfmt -c -o mk.mo mk.po
[2020-06-21T19:08:41.692Z] flex version 2.6.4 usage statistics:
[2020-06-21T19:08:41.692Z]   scanner options: -vB8 -Cem -oparser_lex.c
[2020-06-21T19:08:41.692Z]   1291/2000 NFA states
[2020-06-21T19:08:41.692Z]   560/1000 DFA states (5477 words)
[2020-06-21T19:08:41.692Z]   88 rules
[2020-06-21T19:08:41.692Z]   Compressed tables always back-up
[2020-06-21T19:08:41.692Z]   22/40 start conditions
[2020-06-21T19:08:41.692Z]   659 epsilon states, 479 double epsilon states
[2020-06-21T19:08:41.692Z]   148/200 character classes needed 4684/4750 words of storage, 0 reused
[2020-06-21T19:08:41.692Z]   23792 state/nextstate pairs created
[2020-06-21T19:08:41.692Z]   2360/21432 unique/duplicate transitions
[2020-06-21T19:08:41.692Z]   716/1000 base-def entries created
[2020-06-21T19:08:41.692Z]   4866/6000 (peak 10941) nxt-chk entries created
[2020-06-21T19:08:41.692Z]   2808/10000 (peak 8736) template nxt-chk entries created
[2020-06-21T19:08:41.692Z]   466 empty table entries
[2020-06-21T19:08:41.692Z]   173 protos created
[2020-06-21T19:08:41.692Z]   156 templates created, 332 uses
[2020-06-21T19:08:41.692Z]   56/256 equivalence classes created
[2020-06-21T19:08:41.692Z]   18/256 meta-equivalence classes created
[2020-06-21T19:08:41.692Z]   1 (83 saved) hash collisions, 1845 DFAs equal
[2020-06-21T19:08:41.692Z]   23 sets of reallocations needed
[2020-06-21T19:08:41.692Z]   11476 total table entries needed
[2020-06-21T19:08:41.692Z] msgfmt -c -o mr.mo mr.po
[2020-06-21T19:08:41.692Z] msgfmt -c -o ms.mo ms.po
[2020-06-21T19:08:41.692Z] msgfmt -c -o nb.mo nb.po
[2020-06-21T19:08:41.692Z] msgfmt -c -o nl.mo nl.po
[2020-06-21T19:08:41.692Z] msgfmt -c -o oc.mo oc.po
[2020-06-21T19:08:41.692Z] msgfmt -c -o pa.mo pa.po
[2020-06-21T19:08:41.692Z] msgfmt -c -o pl.mo pl.po
[2020-06-21T19:08:41.943Z] msgfmt -c -o pt_BR.mo pt_BR.po
[2020-06-21T19:08:41.943Z] msgfmt -c -o pt.mo pt.po
[2020-06-21T19:08:41.943Z] msgfmt -c -o ro.mo ro.po
[2020-06-21T19:08:41.943Z] msgfmt -c -o ru.mo ru.po
[2020-06-21T19:08:41.943Z] msgfmt -c -o si.mo si.po
[2020-06-21T19:08:41.943Z] msgfmt -c -o sk.mo sk.po
[2020-06-21T19:08:41.943Z] msgfmt -c -o sl.mo sl.po
[2020-06-21T19:08:41.943Z] g++ -march=x86-64 -mtune=generic -O2 -pipe -fno-plt -D_FORTIFY_SOURCE=2 -Wall -Wsign-compare -Wmissing-field-initializers -Wformat-security -Wunused-parameter -std=gnu++0x -D_GNU_SOURCE  -DPACKAGE=\"apparmor-parser\" -DLOCALEDIR=\"/usr/share/locale\" -DSUBDOMAIN_CONFDIR=\"/etc/apparmor\" -I../libraries/libapparmor/include -c -o parser_main.o parser_main.c
[2020-06-21T19:08:41.943Z] msgfmt -c -o sq.mo sq.po
[2020-06-21T19:08:41.943Z] msgfmt -c -o sr.mo sr.po
[2020-06-21T19:08:41.943Z] msgfmt -c -o sv.mo sv.po
[2020-06-21T19:08:41.943Z] msgfmt -c -o ta.mo ta.po
[2020-06-21T19:08:41.943Z] msgfmt -c -o th.mo th.po
[2020-06-21T19:08:41.943Z] msgfmt -c -o tr.mo tr.po
[2020-06-21T19:08:41.943Z] msgfmt -c -o ug.mo ug.po
[2020-06-21T19:08:41.943Z] msgfmt -c -o uk.mo uk.po
[2020-06-21T19:08:41.943Z] msgfmt -c -o vi.mo vi.po
[2020-06-21T19:08:41.943Z] msgfmt -c -o wa.mo wa.po
[2020-06-21T19:08:41.943Z] msgfmt -c -o xh.mo xh.po
[2020-06-21T19:08:41.943Z] msgfmt -c -o zh_CN.mo zh_CN.po
[2020-06-21T19:08:41.943Z] msgfmt -c -o zh_TW.mo zh_TW.po
[2020-06-21T19:08:41.943Z] msgfmt -c -o zu.mo zu.po
[2020-06-21T19:08:41.943Z] make[1]: Leaving directory '/build/apparmor/src/apparmor-2.13.4/parser/po'
[2020-06-21T19:08:41.943Z] g++ -march=x86-64 -mtune=generic -O2 -pipe -fno-plt -D_FORTIFY_SOURCE=2 -Wall -Wsign-compare -Wmissing-field-initializers -Wformat-security -Wunused-parameter -std=gnu++0x -D_GNU_SOURCE  -DPACKAGE=\"apparmor-parser\" -DLOCALEDIR=\"/usr/share/locale\" -DSUBDOMAIN_CONFDIR=\"/etc/apparmor\" -I../libraries/libapparmor/include -c -o parser_misc.o parser_misc.c
[2020-06-21T19:08:41.943Z] g++ -march=x86-64 -mtune=generic -O2 -pipe -fno-plt -D_FORTIFY_SOURCE=2 -Wall -Wsign-compare -Wmissing-field-initializers -Wformat-security -Wunused-parameter -std=gnu++0x -D_GNU_SOURCE  -DPACKAGE=\"apparmor-parser\" -DLOCALEDIR=\"/usr/share/locale\" -DSUBDOMAIN_CONFDIR=\"/etc/apparmor\" -I../libraries/libapparmor/include -c -o parser_yacc.o parser_yacc.c
[2020-06-21T19:08:41.943Z] g++ -march=x86-64 -mtune=generic -O2 -pipe -fno-plt -D_FORTIFY_SOURCE=2 -Wall -Wsign-compare -Wmissing-field-initializers -Wformat-security -Wunused-parameter -std=gnu++0x -D_GNU_SOURCE  -DPACKAGE=\"apparmor-parser\" -DLOCALEDIR=\"/usr/share/locale\" -DSUBDOMAIN_CONFDIR=\"/etc/apparmor\" -I../libraries/libapparmor/include -c -o parser_policy.o parser_policy.c
[2020-06-21T19:08:42.194Z] g++ -march=x86-64 -mtune=generic -O2 -pipe -fno-plt -D_FORTIFY_SOURCE=2 -Wall -Wsign-compare -Wmissing-field-initializers -Wformat-security -Wunused-parameter -std=gnu++0x -D_GNU_SOURCE  -DPACKAGE=\"apparmor-parser\" -DLOCALEDIR=\"/usr/share/locale\" -DSUBDOMAIN_CONFDIR=\"/etc/apparmor\" -I../libraries/libapparmor/include -c -o network.o network.c
[2020-06-21T19:08:42.194Z] g++ -march=x86-64 -mtune=generic -O2 -pipe -fno-plt -D_FORTIFY_SOURCE=2 -Wall -Wsign-compare -Wmissing-field-initializers -Wformat-security -Wunused-parameter -std=gnu++0x -D_GNU_SOURCE  -DPACKAGE=\"apparmor-parser\" -DLOCALEDIR=\"/usr/share/locale\" -DSUBDOMAIN_CONFDIR=\"/etc/apparmor\" -I../libraries/libapparmor/include -c -o parser_lex.o parser_lex.c
[2020-06-21T19:08:42.444Z] In file included from chfa.cc:32:
[2020-06-21T19:08:42.444Z] hfa.h:47:16: warning: dynamic exception specifications are deprecated in C++11 [-Wdeprecated]
[2020-06-21T19:08:42.444Z]    47 |  perms_t(void) throw(int): allow(0), deny(0), audit(0), quiet(0), exact(0) { };
[2020-06-21T19:08:42.444Z]       |                ^~~~~
[2020-06-21T19:08:42.444Z] hfa.h:195:44: warning: dynamic exception specifications are deprecated in C++11 [-Wdeprecated]
[2020-06-21T19:08:42.444Z]   195 |  State(int l, ProtoState &n, State *other) throw(int):
[2020-06-21T19:08:42.444Z]       |                                            ^~~~~
[2020-06-21T19:08:42.444Z] In file included from hfa.cc:36:
[2020-06-21T19:08:42.444Z] hfa.h:47:16: warning: dynamic exception specifications are deprecated in C++11 [-Wdeprecated]
[2020-06-21T19:08:42.444Z]    47 |  perms_t(void) throw(int): allow(0), deny(0), audit(0), quiet(0), exact(0) { };
[2020-06-21T19:08:42.444Z]       |                ^~~~~
[2020-06-21T19:08:42.444Z] In file included from aare_rules.cc:33:
[2020-06-21T19:08:42.444Z] hfa.h:47:16: warning: dynamic exception specifications are deprecated in C++11 [-Wdeprecated]
[2020-06-21T19:08:42.444Z]    47 |  perms_t(void) throw(int): allow(0), deny(0), audit(0), quiet(0), exact(0) { };
[2020-06-21T19:08:42.444Z]       |                ^~~~~
[2020-06-21T19:08:42.444Z] hfa.h:195:44: warning: dynamic exception specifications are deprecated in C++11 [-Wdeprecated]
[2020-06-21T19:08:42.444Z]   195 |  State(int l, ProtoState &n, State *other) throw(int):
[2020-06-21T19:08:42.444Z]       |                                            ^~~~~
[2020-06-21T19:08:42.444Z] hfa.h:195:44: warning: dynamic exception specifications are deprecated in C++11 [-Wdeprecated]
[2020-06-21T19:08:42.444Z]   195 |  State(int l, ProtoState &n, State *other) throw(int):
[2020-06-21T19:08:42.444Z]       |                                            ^~~~~
[2020-06-21T19:08:42.995Z] parser_lex.l: In function ‘int yylex()’:
[2020-06-21T19:08:42.995Z] parser_lex.l:324:8: warning: unused variable ‘exists’ [-Wunused-variable]
[2020-06-21T19:08:42.995Z]   324 | 
[2020-06-21T19:08:42.995Z]       |        ^     
[2020-06-21T19:08:43.245Z] parser_lex.c: At global scope:
[2020-06-21T19:08:43.245Z] parser_lex.c:3925:16: warning: ‘int yy_top_state()’ defined but not used [-Wunused-function]
[2020-06-21T19:08:43.245Z]  3925 | 
[2020-06-21T19:08:43.245Z]       |                ^           
[2020-06-21T19:08:45.728Z] ar -rcs libapparmor_re.a parse.o expr-tree.o hfa.o chfa.o aare_rules.o
[2020-06-21T19:08:45.728Z] make[1]: Leaving directory '/build/apparmor/src/apparmor-2.13.4/parser/libapparmor_re'
[2020-06-21T19:08:45.728Z] g++ -Wl,-O1,--sort-common,--as-needed,-z,relro,-z,now -march=x86-64 -mtune=generic -O2 -pipe -fno-plt -D_FORTIFY_SOURCE=2 -Wall -Wsign-compare -Wmissing-field-initializers -Wformat-security -Wunused-parameter -std=gnu++0x -D_GNU_SOURCE  -DPACKAGE=\"apparmor-parser\" -DLOCALEDIR=\"/usr/share/locale\" -DSUBDOMAIN_CONFDIR=\"/etc/apparmor\" -I../libraries/libapparmor/include -o apparmor_parser parser_common.o parser_include.o parser_interface.o parser_lex.o parser_main.o parser_misc.o parser_merge.o parser_symtab.o parser_yacc.o parser_regex.o parser_variable.o parser_policy.o parser_alias.o common_optarg.o lib.o network.o  mount.o  dbus.o  profile.o  rule.o  signal.o  ptrace.o  af_rule.o  af_unix.o policy_cache.o  \
[2020-06-21T19:08:45.728Z]         libapparmor_re/libapparmor_re.a -static-libgcc -static-libstdc++ -L. -Wl,-O1,--sort-common,--as-needed,-z,relro,-z,now -L../libraries/libapparmor/src/.libs -Wl,-Bstatic -lapparmor -Wl,-Bdynamic -lpthread
[2020-06-21T19:08:45.728Z] make: Leaving directory '/build/apparmor/src/apparmor-2.13.4/parser'
[2020-06-21T19:08:45.728Z] make: Entering directory '/build/apparmor/src/apparmor-2.13.4/profiles'
[2020-06-21T19:08:45.728Z] for profile in ./apparmor.d/bin.ping ./apparmor.d/lsb_release ./apparmor.d/nvidia_modprobe ./apparmor.d/sbin.klogd ./apparmor.d/sbin.syslogd ./apparmor.d/sbin.syslog-ng ./apparmor.d/usr.lib.apache2.mpm-prefork.apache2 ./apparmor.d/usr.lib.dovecot.anvil ./apparmor.d/usr.lib.dovecot.auth ./apparmor.d/usr.lib.dovecot.config ./apparmor.d/usr.lib.dovecot.deliver ./apparmor.d/usr.lib.dovecot.dict ./apparmor.d/usr.lib.dovecot.dovecot-auth ./apparmor.d/usr.lib.dovecot.dovecot-lda ./apparmor.d/usr.lib.dovecot.imap ./apparmor.d/usr.lib.dovecot.imap-login ./apparmor.d/usr.lib.dovecot.lmtp ./apparmor.d/usr.lib.dovecot.log ./apparmor.d/usr.lib.dovecot.managesieve ./apparmor.d/usr.lib.dovecot.managesieve-login ./apparmor.d/usr.lib.dovecot.pop3 ./apparmor.d/usr.lib.dovecot.pop3-login ./apparmor.d/usr.lib.dovecot.ssl-params ./apparmor.d/usr.lib.dovecot.stats ./apparmor.d/usr.sbin.apache2 ./apparmor.d/usr.sbin.avahi-daemon ./apparmor.d/usr.sbin.dnsmasq ./apparmor.d/usr.sbin.dovecot ./apparmor.d/usr.sbin.identd ./apparmor.d/usr.sbin.mdnsd ./apparmor.d/usr.sbin.nmbd ./apparmor.d/usr.sbin.nscd ./apparmor.d/usr.sbin.ntpd ./apparmor.d/usr.sbin.smbd ./apparmor.d/usr.sbin.smbldap-useradd ./apparmor.d/usr.sbin.traceroute ./apparmor.d/usr.sbin.winbindd; do \
[2020-06-21T19:08:45.728Z] 	fn=$(basename $profile); \
[2020-06-21T19:08:45.728Z] 	echo "# Site-specific additions and overrides for '$fn'" > ./apparmor.d/local/$fn; \
[2020-06-21T19:08:45.728Z] 	grep "include[[:space:]]\\+<local/$fn>" "$profile" >/dev/null || { echo "$profile doesn't contain #include <local/$fn>" ; exit 1; } ; \
[2020-06-21T19:08:45.728Z] done; \
[2020-06-21T19:08:45.728Z] 
[2020-06-21T19:08:45.978Z] make: Leaving directory '/build/apparmor/src/apparmor-2.13.4/profiles'
[2020-06-21T19:08:45.978Z] make: Entering directory '/build/apparmor/src/apparmor-2.13.4/utils'
[2020-06-21T19:08:45.978Z] make -C po all
[2020-06-21T19:08:45.978Z] make[1]: Entering directory '/build/apparmor/src/apparmor-2.13.4/utils/po'
[2020-06-21T19:08:45.978Z] msgfmt -c -o bs.mo bs.po
[2020-06-21T19:08:45.978Z] msgfmt -c -o de.mo de.po
[2020-06-21T19:08:45.978Z] msgfmt -c -o en_GB.mo en_GB.po
[2020-06-21T19:08:45.978Z] msgfmt -c -o es.mo es.po
[2020-06-21T19:08:45.978Z] msgfmt -c -o fr.mo fr.po
[2020-06-21T19:08:45.978Z] msgfmt -c -o hi.mo hi.po
[2020-06-21T19:08:45.978Z] msgfmt -c -o id.mo id.po
[2020-06-21T19:08:45.978Z] msgfmt -c -o it.mo it.po
[2020-06-21T19:08:45.978Z] msgfmt -c -o ko.mo ko.po
[2020-06-21T19:08:45.978Z] msgfmt -c -o pl.mo pl.po
[2020-06-21T19:08:45.978Z] msgfmt -c -o pt_BR.mo pt_BR.po
[2020-06-21T19:08:45.978Z] msgfmt -c -o pt.mo pt.po
[2020-06-21T19:08:45.978Z] msgfmt -c -o ru.mo ru.po
[2020-06-21T19:08:45.978Z] msgfmt -c -o sv.mo sv.po
[2020-06-21T19:08:45.978Z] msgfmt -c -o tr.mo tr.po
[2020-06-21T19:08:45.978Z] msgfmt -c -o ug.mo ug.po
[2020-06-21T19:08:45.978Z] msgfmt -c -o uk.mo uk.po
[2020-06-21T19:08:45.978Z] pt_BR.po:7: warning: header field 'Last-Translator' still has the initial default value
[2020-06-21T19:08:45.978Z] pt_BR.po:7: warning: header field 'Language' missing in header
[2020-06-21T19:08:45.978Z] es.po:7: warning: header field 'Language' missing in header
[2020-06-21T19:08:45.978Z] make[1]: Leaving directory '/build/apparmor/src/apparmor-2.13.4/utils/po'
[2020-06-21T19:08:45.978Z] make -C vim all
[2020-06-21T19:08:45.978Z] make[1]: Entering directory '/build/apparmor/src/apparmor-2.13.4/utils/vim'
[2020-06-21T19:08:45.978Z] /usr/bin/python3 create-apparmor.vim.py > apparmor.vim || { rm -f apparmor.vim ; exit 1; }
[2020-06-21T19:08:45.978Z] /usr/bin/core_perl/pod2man apparmor.vim.pod --release="AppArmor 2.13.4" --center=AppArmor --stderr --section=5 > apparmor.vim.5
[2020-06-21T19:08:45.978Z] /usr/bin/core_perl/pod2html --header --css apparmor.css --infile=apparmor.vim.pod --outfile=apparmor.vim.5.html
[2020-06-21T19:08:45.978Z] make[1]: Leaving directory '/build/apparmor/src/apparmor-2.13.4/utils/vim'
[2020-06-21T19:08:45.978Z] make: Leaving directory '/build/apparmor/src/apparmor-2.13.4/utils'
[2020-06-21T19:08:45.978Z] make: Entering directory '/build/apparmor/src/apparmor-2.13.4/changehat/pam_apparmor'
[2020-06-21T19:08:45.978Z] cc -march=x86-64 -mtune=generic -O2 -pipe -fno-plt -D_FORTIFY_SOURCE=2 -fPIC -shared -Wall -I../../libraries/libapparmor//include -c -o pam_apparmor.o pam_apparmor.c
[2020-06-21T19:08:45.978Z] cc -march=x86-64 -mtune=generic -O2 -pipe -fno-plt -D_FORTIFY_SOURCE=2 -fPIC -shared -Wall -I../../libraries/libapparmor//include -c -o get_options.o get_options.c
[2020-06-21T19:08:46.229Z] cc -march=x86-64 -mtune=generic -O2 -pipe -fno-plt -D_FORTIFY_SOURCE=2 -fPIC -shared -Wall -I../../libraries/libapparmor//include -Xlinker -x -L../../libraries/libapparmor//src/.libs/ -Wl,-O1,--sort-common,--as-needed,-z,relro,-z,now -o pam_apparmor.so pam_apparmor.o get_options.o -lpam -lapparmor
[2020-06-21T19:08:46.229Z] make: Leaving directory '/build/apparmor/src/apparmor-2.13.4/changehat/pam_apparmor'
[2020-06-21T19:08:46.229Z] make: Entering directory '/build/apparmor/src/apparmor-2.13.4/changehat/mod_apparmor'
[2020-06-21T19:08:46.229Z] /usr/sbin/apxs  -I../../libraries/libapparmor//include -Wl,-Wl,-L../../libraries/libapparmor//src/.libs/ -c mod_apparmor.c -lapparmor
[2020-06-21T19:08:46.229Z] /usr/share/apr-1/build/libtool --silent --mode=compile gcc -prefer-pic -march=x86-64 -mtune=generic -O2 -pipe -fno-plt  -DLINUX -D_REENTRANT -D_GNU_SOURCE -pthread -I/usr/include/httpd  -I/usr/include/apr-1   -I/usr/include/apr-1 -I/usr/include -I../../libraries/libapparmor//include  -c -o mod_apparmor.lo mod_apparmor.c && touch mod_apparmor.slo
[2020-06-21T19:08:46.779Z] /usr/share/apr-1/build/libtool --silent --mode=link gcc -Wl,-O1,--sort-common,--as-needed,-z,relro,-z,now   -o mod_apparmor.la -Wl,-L../../libraries/libapparmor//src/.libs/  -rpath /usr/lib/httpd/modules -module -avoid-version    mod_apparmor.lo -lapparmor
[2020-06-21T19:08:46.779Z] mv .libs/mod_apparmor.so .
[2020-06-21T19:08:46.779Z] make: Leaving directory '/build/apparmor/src/apparmor-2.13.4/changehat/mod_apparmor'
[2020-06-21T19:08:46.779Z] make: Entering directory '/build/apparmor/src/apparmor-2.13.4/utils/vim'
[2020-06-21T19:08:46.779Z] make: Nothing to be done for 'all'.
[2020-06-21T19:08:46.779Z] make: Leaving directory '/build/apparmor/src/apparmor-2.13.4/utils/vim'
[2020-06-21T19:08:46.779Z] ==> Starting check()...
[2020-06-21T19:08:46.779Z] INFO: Running check: libraries/libapparmor
[2020-06-21T19:08:46.779Z] make: Entering directory '/build/apparmor/src/apparmor-2.13.4/libraries/libapparmor'
[2020-06-21T19:08:46.779Z] Making check in doc
[2020-06-21T19:08:46.779Z] make[1]: Entering directory '/build/apparmor/src/apparmor-2.13.4/libraries/libapparmor/doc'
[2020-06-21T19:08:46.779Z] make[1]: Nothing to be done for 'check'.
[2020-06-21T19:08:46.779Z] make[1]: Leaving directory '/build/apparmor/src/apparmor-2.13.4/libraries/libapparmor/doc'
[2020-06-21T19:08:46.779Z] Making check in src
[2020-06-21T19:08:46.779Z] make[1]: Entering directory '/build/apparmor/src/apparmor-2.13.4/libraries/libapparmor/src'
[2020-06-21T19:08:46.779Z] make  check-am
[2020-06-21T19:08:47.029Z] make[2]: Entering directory '/build/apparmor/src/apparmor-2.13.4/libraries/libapparmor/src'
[2020-06-21T19:08:47.029Z] make  tst_aalogmisc tst_features tst_kernel
[2020-06-21T19:08:47.029Z] make[3]: Entering directory '/build/apparmor/src/apparmor-2.13.4/libraries/libapparmor/src'
[2020-06-21T19:08:47.029Z] gcc -DPACKAGE_NAME=\"\" -DPACKAGE_TARNAME=\"\" -DPACKAGE_VERSION=\"\" -DPACKAGE_STRING=\"\" -DPACKAGE_BUGREPORT=\"\" -DPACKAGE_URL=\"\" -DPACKAGE=\"libapparmor1\" -DVERSION=\"2.13.4\" -DYYTEXT_POINTER=1 -DSTDC_HEADERS=1 -DHAVE_SYS_TYPES_H=1 -DHAVE_SYS_STAT_H=1 -DHAVE_STDLIB_H=1 -DHAVE_STRING_H=1 -DHAVE_MEMORY_H=1 -DHAVE_STRINGS_H=1 -DHAVE_INTTYPES_H=1 -DHAVE_STDINT_H=1 -DHAVE_UNISTD_H=1 -DHAVE_UNISTD_H=1 -DHAVE_STDINT_H=1 -DHAVE_SYSLOG_H=1 -DHAVE_ASPRINTF=1 -DHAVE_SECURE_GETENV=1 -DHAVE_REALLOCARRAY=1 -DHAVE_DLFCN_H=1 -DLT_OBJDIR=\".libs/\" -I.  -D_GNU_SOURCE -I../include/ -D_FORTIFY_SOURCE=2 -Wall -march=x86-64 -mtune=generic -O2 -pipe -fno-plt -MT tst_aalogmisc.o -MD -MP -MF .deps/tst_aalogmisc.Tpo -c -o tst_aalogmisc.o tst_aalogmisc.c
[2020-06-21T19:08:47.029Z] gcc -DPACKAGE_NAME=\"\" -DPACKAGE_TARNAME=\"\" -DPACKAGE_VERSION=\"\" -DPACKAGE_STRING=\"\" -DPACKAGE_BUGREPORT=\"\" -DPACKAGE_URL=\"\" -DPACKAGE=\"libapparmor1\" -DVERSION=\"2.13.4\" -DYYTEXT_POINTER=1 -DSTDC_HEADERS=1 -DHAVE_SYS_TYPES_H=1 -DHAVE_SYS_STAT_H=1 -DHAVE_STDLIB_H=1 -DHAVE_STRING_H=1 -DHAVE_MEMORY_H=1 -DHAVE_STRINGS_H=1 -DHAVE_INTTYPES_H=1 -DHAVE_STDINT_H=1 -DHAVE_UNISTD_H=1 -DHAVE_UNISTD_H=1 -DHAVE_STDINT_H=1 -DHAVE_SYSLOG_H=1 -DHAVE_ASPRINTF=1 -DHAVE_SECURE_GETENV=1 -DHAVE_REALLOCARRAY=1 -DHAVE_DLFCN_H=1 -DLT_OBJDIR=\".libs/\" -I.  -D_GNU_SOURCE -I../include/ -D_FORTIFY_SOURCE=2 -Wall -march=x86-64 -mtune=generic -O2 -pipe -fno-plt -MT tst_features.o -MD -MP -MF .deps/tst_features.Tpo -c -o tst_features.o tst_features.c
[2020-06-21T19:08:47.029Z] gcc -DPACKAGE_NAME=\"\" -DPACKAGE_TARNAME=\"\" -DPACKAGE_VERSION=\"\" -DPACKAGE_STRING=\"\" -DPACKAGE_BUGREPORT=\"\" -DPACKAGE_URL=\"\" -DPACKAGE=\"libapparmor1\" -DVERSION=\"2.13.4\" -DYYTEXT_POINTER=1 -DSTDC_HEADERS=1 -DHAVE_SYS_TYPES_H=1 -DHAVE_SYS_STAT_H=1 -DHAVE_STDLIB_H=1 -DHAVE_STRING_H=1 -DHAVE_MEMORY_H=1 -DHAVE_STRINGS_H=1 -DHAVE_INTTYPES_H=1 -DHAVE_STDINT_H=1 -DHAVE_UNISTD_H=1 -DHAVE_UNISTD_H=1 -DHAVE_STDINT_H=1 -DHAVE_SYSLOG_H=1 -DHAVE_ASPRINTF=1 -DHAVE_SECURE_GETENV=1 -DHAVE_REALLOCARRAY=1 -DHAVE_DLFCN_H=1 -DLT_OBJDIR=\".libs/\" -I.  -D_GNU_SOURCE -I../include/ -D_FORTIFY_SOURCE=2 -Wall -march=x86-64 -mtune=generic -O2 -pipe -fno-plt -MT tst_kernel.o -MD -MP -MF .deps/tst_kernel.Tpo -c -o tst_kernel.o tst_kernel.c
[2020-06-21T19:08:47.029Z] mv -f .deps/tst_aalogmisc.Tpo .deps/tst_aalogmisc.Po
[2020-06-21T19:08:47.029Z] /bin/sh ../libtool  --tag=CC   --mode=link gcc -Wall -march=x86-64 -mtune=generic -O2 -pipe -fno-plt  -Wl,-O1,--sort-common,--as-needed,-z,relro,-z,now -o tst_aalogmisc tst_aalogmisc.o .libs/libapparmor.a 
[2020-06-21T19:08:47.029Z] libtool: link: gcc -Wall -march=x86-64 -mtune=generic -O2 -pipe -fno-plt -Wl,-O1 -Wl,--sort-common -Wl,--as-needed -Wl,-z -Wl,relro -Wl,-z -Wl,now -o tst_aalogmisc tst_aalogmisc.o  .libs/libapparmor.a
[2020-06-21T19:08:47.280Z] mv -f .deps/tst_features.Tpo .deps/tst_features.Po
[2020-06-21T19:08:47.280Z] /bin/sh ../libtool  --tag=CC   --mode=link gcc -Wall -march=x86-64 -mtune=generic -O2 -pipe -fno-plt  -Wl,-O1,--sort-common,--as-needed,-z,relro,-z,now -o tst_features tst_features.o .libs/libapparmor.a 
[2020-06-21T19:08:47.280Z] mv -f .deps/tst_kernel.Tpo .deps/tst_kernel.Po
[2020-06-21T19:08:47.280Z] /bin/sh ../libtool  --tag=CC   --mode=link gcc -Wall -march=x86-64 -mtune=generic -O2 -pipe -fno-plt -pthread -Wl,-O1,--sort-common,--as-needed,-z,relro,-z,now -o tst_kernel tst_kernel.o .libs/libapparmor.a 
[2020-06-21T19:08:47.280Z] libtool: link: gcc -Wall -march=x86-64 -mtune=generic -O2 -pipe -fno-plt -Wl,-O1 -Wl,--sort-common -Wl,--as-needed -Wl,-z -Wl,relro -Wl,-z -Wl,now -o tst_features tst_features.o  .libs/libapparmor.a
[2020-06-21T19:08:47.530Z] libtool: link: gcc -Wall -march=x86-64 -mtune=generic -O2 -pipe -fno-plt -pthread -Wl,-O1 -Wl,--sort-common -Wl,--as-needed -Wl,-z -Wl,relro -Wl,-z -Wl,now -o tst_kernel tst_kernel.o  .libs/libapparmor.a -pthread
[2020-06-21T19:08:47.530Z] make[3]: Leaving directory '/build/apparmor/src/apparmor-2.13.4/libraries/libapparmor/src'
[2020-06-21T19:08:47.530Z] make  check-TESTS
[2020-06-21T19:08:47.530Z] make[3]: Entering directory '/build/apparmor/src/apparmor-2.13.4/libraries/libapparmor/src'
[2020-06-21T19:08:47.530Z] make[4]: Entering directory '/build/apparmor/src/apparmor-2.13.4/libraries/libapparmor/src'
[2020-06-21T19:08:47.530Z] PASS: tst_aalogmisc
[2020-06-21T19:08:47.530Z] PASS: tst_features
[2020-06-21T19:08:47.530Z] PASS: tst_kernel
[2020-06-21T19:08:47.780Z] ============================================================================
[2020-06-21T19:08:47.780Z] Testsuite summary for 
[2020-06-21T19:08:47.780Z] ============================================================================
[2020-06-21T19:08:47.780Z] # TOTAL: 3
[2020-06-21T19:08:47.780Z] # PASS:  3
[2020-06-21T19:08:47.780Z] # SKIP:  0
[2020-06-21T19:08:47.780Z] # XFAIL: 0
[2020-06-21T19:08:47.780Z] # FAIL:  0
[2020-06-21T19:08:47.780Z] # XPASS: 0
[2020-06-21T19:08:47.780Z] # ERROR: 0
[2020-06-21T19:08:47.780Z] ============================================================================
[2020-06-21T19:08:47.780Z] make[4]: Leaving directory '/build/apparmor/src/apparmor-2.13.4/libraries/libapparmor/src'
[2020-06-21T19:08:47.780Z] make[3]: Leaving directory '/build/apparmor/src/apparmor-2.13.4/libraries/libapparmor/src'
[2020-06-21T19:08:47.780Z] make[2]: Leaving directory '/build/apparmor/src/apparmor-2.13.4/libraries/libapparmor/src'
[2020-06-21T19:08:47.780Z] make[1]: Leaving directory '/build/apparmor/src/apparmor-2.13.4/libraries/libapparmor/src'
[2020-06-21T19:08:47.780Z] Making check in include
[2020-06-21T19:08:47.780Z] make[1]: Entering directory '/build/apparmor/src/apparmor-2.13.4/libraries/libapparmor/include'
[2020-06-21T19:08:47.780Z] Making check in sys
[2020-06-21T19:08:47.780Z] make[2]: Entering directory '/build/apparmor/src/apparmor-2.13.4/libraries/libapparmor/include/sys'
[2020-06-21T19:08:47.780Z] make[2]: Nothing to be done for 'check'.
[2020-06-21T19:08:47.780Z] make[2]: Leaving directory '/build/apparmor/src/apparmor-2.13.4/libraries/libapparmor/include/sys'
[2020-06-21T19:08:47.780Z] make[2]: Entering directory '/build/apparmor/src/apparmor-2.13.4/libraries/libapparmor/include'
[2020-06-21T19:08:47.780Z] make[2]: Nothing to be done for 'check-am'.
[2020-06-21T19:08:47.780Z] make[2]: Leaving directory '/build/apparmor/src/apparmor-2.13.4/libraries/libapparmor/include'
[2020-06-21T19:08:47.780Z] make[1]: Leaving directory '/build/apparmor/src/apparmor-2.13.4/libraries/libapparmor/include'
[2020-06-21T19:08:47.780Z] Making check in swig
[2020-06-21T19:08:47.780Z] make[1]: Entering directory '/build/apparmor/src/apparmor-2.13.4/libraries/libapparmor/swig'
[2020-06-21T19:08:47.780Z] Making check in perl
[2020-06-21T19:08:47.780Z] make[2]: Entering directory '/build/apparmor/src/apparmor-2.13.4/libraries/libapparmor/swig/perl'
[2020-06-21T19:08:47.780Z] if test ! -f libapparmor_wrap.c; then cp ./libapparmor_wrap.c . ; fi
[2020-06-21T19:08:47.780Z] make -fMakefile.perl
[2020-06-21T19:08:47.780Z] make[3]: Entering directory '/build/apparmor/src/apparmor-2.13.4/libraries/libapparmor/swig/perl'
[2020-06-21T19:08:47.780Z] "/usr/bin/perl" -MExtUtils::Command::MM -e 'cp_nonempty' -- LibAppArmor.bs blib/arch/auto/LibAppArmor/LibAppArmor.bs 644
[2020-06-21T19:08:47.780Z] make[3]: Leaving directory '/build/apparmor/src/apparmor-2.13.4/libraries/libapparmor/swig/perl'
[2020-06-21T19:08:47.780Z] if test ../.. != ../.. ; then rm -f libapparmor_wrap.c ; fi
[2020-06-21T19:08:47.780Z] make[2]: Leaving directory '/build/apparmor/src/apparmor-2.13.4/libraries/libapparmor/swig/perl'
[2020-06-21T19:08:47.780Z] Making check in python
[2020-06-21T19:08:47.780Z] make[2]: Entering directory '/build/apparmor/src/apparmor-2.13.4/libraries/libapparmor/swig/python'
[2020-06-21T19:08:47.780Z] Making check in test
[2020-06-21T19:08:47.780Z] make[3]: Entering directory '/build/apparmor/src/apparmor-2.13.4/libraries/libapparmor/swig/python/test'
[2020-06-21T19:08:47.780Z] make  check-TESTS
[2020-06-21T19:08:47.780Z] make[4]: Entering directory '/build/apparmor/src/apparmor-2.13.4/libraries/libapparmor/swig/python/test'
[2020-06-21T19:08:47.780Z] make[5]: Entering directory '/build/apparmor/src/apparmor-2.13.4/libraries/libapparmor/swig/python/test'
[2020-06-21T19:08:47.780Z] cd "../../.." && \
[2020-06-21T19:08:47.780Z] /bin/sh ./config.status --file="swig/python/test/test_python.py"
[2020-06-21T19:08:48.031Z] config.status: creating swig/python/test/test_python.py
[2020-06-21T19:08:48.031Z] chmod +x test_python.py
[2020-06-21T19:08:48.281Z] PASS: test_python.py
[2020-06-21T19:08:48.531Z] ============================================================================
[2020-06-21T19:08:48.531Z] Testsuite summary for 
[2020-06-21T19:08:48.531Z] ============================================================================
[2020-06-21T19:08:48.531Z] # TOTAL: 1
[2020-06-21T19:08:48.531Z] # PASS:  1
[2020-06-21T19:08:48.531Z] # SKIP:  0
[2020-06-21T19:08:48.531Z] # XFAIL: 0
[2020-06-21T19:08:48.531Z] # FAIL:  0
[2020-06-21T19:08:48.531Z] # XPASS: 0
[2020-06-21T19:08:48.531Z] # ERROR: 0
[2020-06-21T19:08:48.531Z] ============================================================================
[2020-06-21T19:08:48.531Z] make[5]: Leaving directory '/build/apparmor/src/apparmor-2.13.4/libraries/libapparmor/swig/python/test'
[2020-06-21T19:08:48.531Z] make[4]: Leaving directory '/build/apparmor/src/apparmor-2.13.4/libraries/libapparmor/swig/python/test'
[2020-06-21T19:08:48.531Z] make[3]: Leaving directory '/build/apparmor/src/apparmor-2.13.4/libraries/libapparmor/swig/python/test'
[2020-06-21T19:08:48.531Z] make[3]: Entering directory '/build/apparmor/src/apparmor-2.13.4/libraries/libapparmor/swig/python'
[2020-06-21T19:08:48.531Z] if test ! -f libapparmor_wrap.c; then cp ./libapparmor_wrap.c . ; fi
[2020-06-21T19:08:48.531Z] /usr/bin/python setup.py build
[2020-06-21T19:08:48.531Z] running build
[2020-06-21T19:08:48.531Z] running build_py
[2020-06-21T19:08:48.531Z] running build_ext
[2020-06-21T19:08:48.531Z] make[3]: Leaving directory '/build/apparmor/src/apparmor-2.13.4/libraries/libapparmor/swig/python'
[2020-06-21T19:08:48.531Z] make[2]: Leaving directory '/build/apparmor/src/apparmor-2.13.4/libraries/libapparmor/swig/python'
[2020-06-21T19:08:48.531Z] Making check in ruby
[2020-06-21T19:08:48.531Z] make[2]: Entering directory '/build/apparmor/src/apparmor-2.13.4/libraries/libapparmor/swig/ruby'
[2020-06-21T19:08:48.531Z] make[2]: Nothing to be done for 'check'.
[2020-06-21T19:08:48.531Z] make[2]: Leaving directory '/build/apparmor/src/apparmor-2.13.4/libraries/libapparmor/swig/ruby'
[2020-06-21T19:08:48.531Z] make[2]: Entering directory '/build/apparmor/src/apparmor-2.13.4/libraries/libapparmor/swig'
[2020-06-21T19:08:48.531Z] make[2]: Nothing to be done for 'check-am'.
[2020-06-21T19:08:48.531Z] make[2]: Leaving directory '/build/apparmor/src/apparmor-2.13.4/libraries/libapparmor/swig'
[2020-06-21T19:08:48.531Z] make[1]: Leaving directory '/build/apparmor/src/apparmor-2.13.4/libraries/libapparmor/swig'
[2020-06-21T19:08:48.531Z] Making check in testsuite
[2020-06-21T19:08:48.531Z] make[1]: Entering directory '/build/apparmor/src/apparmor-2.13.4/libraries/libapparmor/testsuite'
[2020-06-21T19:08:48.531Z] Making check in lib
[2020-06-21T19:08:48.531Z] make[2]: Entering directory '/build/apparmor/src/apparmor-2.13.4/libraries/libapparmor/testsuite/lib'
[2020-06-21T19:08:48.531Z] make[2]: Nothing to be done for 'check'.
[2020-06-21T19:08:48.531Z] make[2]: Leaving directory '/build/apparmor/src/apparmor-2.13.4/libraries/libapparmor/testsuite/lib'
[2020-06-21T19:08:48.531Z] Making check in config
[2020-06-21T19:08:48.531Z] make[2]: Entering directory '/build/apparmor/src/apparmor-2.13.4/libraries/libapparmor/testsuite/config'
[2020-06-21T19:08:48.531Z] make[2]: Nothing to be done for 'check'.
[2020-06-21T19:08:48.531Z] make[2]: Leaving directory '/build/apparmor/src/apparmor-2.13.4/libraries/libapparmor/testsuite/config'
[2020-06-21T19:08:48.531Z] Making check in libaalogparse.test
[2020-06-21T19:08:48.531Z] make[2]: Entering directory '/build/apparmor/src/apparmor-2.13.4/libraries/libapparmor/testsuite/libaalogparse.test'
[2020-06-21T19:08:48.531Z] make[2]: Nothing to be done for 'check'.
[2020-06-21T19:08:48.531Z] make[2]: Leaving directory '/build/apparmor/src/apparmor-2.13.4/libraries/libapparmor/testsuite/libaalogparse.test'
[2020-06-21T19:08:48.781Z] make[2]: Entering directory '/build/apparmor/src/apparmor-2.13.4/libraries/libapparmor/testsuite'
[2020-06-21T19:08:48.781Z] make  check-DEJAGNU check-local
[2020-06-21T19:08:48.781Z] make[3]: Entering directory '/build/apparmor/src/apparmor-2.13.4/libraries/libapparmor/testsuite'
[2020-06-21T19:08:48.781Z] Making a new site.exp file ...
[2020-06-21T19:08:48.781Z] srcdir='.'; export srcdir; \
[2020-06-21T19:08:48.781Z] EXPECT=expect; export EXPECT; \
[2020-06-21T19:08:48.781Z] if /bin/sh -c "runtest --version" > /dev/null 2>&1; then \
[2020-06-21T19:08:48.781Z]   exit_status=0; l='libaalogparse'; for tool in $l; do \
[2020-06-21T19:08:48.781Z]     if runtest --tool $tool --srcdir $srcdir  ; \
[2020-06-21T19:08:48.781Z]     then :; else exit_status=1; fi; \
[2020-06-21T19:08:48.781Z]   done; \
[2020-06-21T19:08:48.781Z] else echo "WARNING: could not find 'runtest'" 1>&2; :;\
[2020-06-21T19:08:48.781Z] fi; \
[2020-06-21T19:08:48.781Z] exit $exit_status
[2020-06-21T19:08:48.781Z] WARNING: Couldn't find the global config file.
[2020-06-21T19:08:49.032Z] WARNING: Couldn't find tool init file
[2020-06-21T19:08:49.032Z] Test run by builduser on Sun Jun 21 19:08:48 2020
[2020-06-21T19:08:49.032Z] Native configuration is x86_64-pc-linux-gnu
[2020-06-21T19:08:49.032Z] 
[2020-06-21T19:08:49.032Z] 		=== libaalogparse tests ===
[2020-06-21T19:08:49.032Z] 
[2020-06-21T19:08:49.032Z] Schedule of variations:
[2020-06-21T19:08:49.032Z]     unix
[2020-06-21T19:08:49.032Z] 
[2020-06-21T19:08:49.032Z] Running target unix
[2020-06-21T19:08:49.032Z] Using /usr/share/dejagnu/baseboards/unix.exp as board description file for target.
[2020-06-21T19:08:49.032Z] Using /usr/share/dejagnu/config/unix.exp as generic interface file for target.
[2020-06-21T19:08:49.032Z] Using ./config/unix.exp as tool-and-target-specific interface file.
[2020-06-21T19:08:49.032Z] Running ./libaalogparse.test/multi_test.exp ...
[2020-06-21T19:08:49.032Z] Running test_multi...
[2020-06-21T19:08:49.032Z]    ... testcase33
[2020-06-21T19:08:49.032Z]    ... testcase_dmesg_link_01
[2020-06-21T19:08:49.032Z]    ... testcase35
[2020-06-21T19:08:49.032Z]    ... file_perm_network_lp1466812
[2020-06-21T19:08:49.032Z]    ... testcase_syslog_rename_dest
[2020-06-21T19:08:49.282Z]    ... testcase_dmesg_truncate
[2020-06-21T19:08:49.282Z]    ... old_style_log_09
[2020-06-21T19:08:49.282Z]    ... testcase_syslog_read
[2020-06-21T19:08:49.282Z]    ... old_style_log_03
[2020-06-21T19:08:49.282Z]    ... testcase_dbus_06
[2020-06-21T19:08:49.282Z]    ... testcase24
[2020-06-21T19:08:49.532Z]    ... testcase04
[2020-06-21T19:08:49.532Z]    ... file_perm_network_receive_lp1577051
[2020-06-21T19:08:49.532Z]    ... syslog_other_01
[2020-06-21T19:08:49.532Z]    ... testcase_dmesg_mkdir
[2020-06-21T19:08:49.532Z]    ... syslog_datetime_17
[2020-06-21T19:08:49.532Z]    ... testcase02
[2020-06-21T19:08:49.782Z]    ... unbalanced_parenthesis
[2020-06-21T19:08:49.782Z]    ... testcase_network_03
[2020-06-21T19:08:49.782Z]    ... testcase_stack_crash
[2020-06-21T19:08:49.782Z]    ... testcase_network_01
[2020-06-21T19:08:49.782Z]    ... testcase15
[2020-06-21T19:08:49.782Z]    ... old_style_log_10
[2020-06-21T19:08:50.032Z]    ... avc_syslog_03
[2020-06-21T19:08:50.032Z]    ... testcase_network_02
[2020-06-21T19:08:50.032Z]    ... avc_audit_02
[2020-06-21T19:08:50.032Z]    ... avc_audit_01
[2020-06-21T19:08:50.032Z]    ... testcase_dbus_07
[2020-06-21T19:08:50.032Z]    ... old_style_log_13
[2020-06-21T19:08:50.282Z]    ... syslog_datetime_01
[2020-06-21T19:08:50.282Z]    ... testcase_dmesg_rename_dest
[2020-06-21T19:08:50.282Z]    ... old_style_log_01
[2020-06-21T19:08:50.282Z]    ... avc_audit_invalid_audit_id
[2020-06-21T19:08:50.282Z]    ... testcase_network_send_receive
[2020-06-21T19:08:50.533Z]    ... syslog_audit_01
[2020-06-21T19:08:50.533Z]    ... syslog_audit_02
[2020-06-21T19:08:50.533Z]    ... testcase08
[2020-06-21T19:08:50.533Z]    ... testcase10
[2020-06-21T19:08:50.533Z]    ... syslog_other_03
[2020-06-21T19:08:50.533Z]    ... old_style_log_12
[2020-06-21T19:08:50.783Z]    ... old_style_log_16
[2020-06-21T19:08:50.783Z]    ... syslog_datetime_06
[2020-06-21T19:08:50.783Z]    ... syslog_datetime_11
[2020-06-21T19:08:50.783Z]    ... syslog_datetime_04
[2020-06-21T19:08:50.783Z]    ... testcase14
[2020-06-21T19:08:50.783Z]    ... testcase_signal_01
[2020-06-21T19:08:51.033Z]    ... testcase_changehat_01
[2020-06-21T19:08:51.033Z]    ... testcase_dmesg_changehat_negative_error
[2020-06-21T19:08:51.033Z]    ... syslog_other_02
[2020-06-21T19:08:51.033Z]    ... syslog_audit_06
[2020-06-21T19:08:51.033Z]    ... testcase_dbus_08
[2020-06-21T19:08:51.033Z]    ... old_style_log_15
[2020-06-21T19:08:51.283Z]    ... testcase_dbus_04
[2020-06-21T19:08:51.283Z]    ... testcase_ptrace_01
[2020-06-21T19:08:51.283Z]    ... testcase_dbus_05
[2020-06-21T19:08:51.283Z]    ... testcase_signal_02
[2020-06-21T19:08:51.283Z]    ... testcase_dbus_03
[2020-06-21T19:08:51.283Z]    ... syslog_datetime_13
[2020-06-21T19:08:51.533Z]    ... old_style_log_08
[2020-06-21T19:08:51.533Z]    ... testcase_mount_01
[2020-06-21T19:08:51.533Z]    ... old_style_log_06
[2020-06-21T19:08:51.533Z]    ... syslog_datetime_08
[2020-06-21T19:08:51.533Z]    ... testcase_dbus_10
[2020-06-21T19:08:51.783Z]    ... syslog_datetime_03
[2020-06-21T19:08:51.783Z]    ... testcase17
[2020-06-21T19:08:51.783Z]    ... old_style_log_02
[2020-06-21T19:08:51.783Z]    ... testcase_syslog_rename_src
[2020-06-21T19:08:51.783Z]    ... testcase26
[2020-06-21T19:08:51.783Z]    ... old_style_log_17
[2020-06-21T19:08:52.034Z]    ... file_inherit_network_lp1509030
[2020-06-21T19:08:52.034Z]    ... testcase_network_05
[2020-06-21T19:08:52.034Z]    ... testcase19
[2020-06-21T19:08:52.034Z]    ... testcase_dmesg_rename_src
[2020-06-21T19:08:52.034Z]    ... testcase05
[2020-06-21T19:08:52.034Z]    ... testcase_dbus_01
[2020-06-21T19:08:52.284Z]    ... avc_syslog_02
[2020-06-21T19:08:52.284Z]    ... testcase32
[2020-06-21T19:08:52.284Z]    ... ptrace_garbage_lp1689667_1
[2020-06-21T19:08:52.284Z]    ... testcase_dbus_09
[2020-06-21T19:08:52.284Z]    ... old_style_log_04
[2020-06-21T19:08:52.284Z]    ... syslog_datetime_16
[2020-06-21T19:08:52.534Z]    ... testcase_syslog_capability
[2020-06-21T19:08:52.534Z]    ... unconfined-change_hat
[2020-06-21T19:08:52.534Z]    ... avc_syslog_01
[2020-06-21T19:08:52.534Z]    ... syslog_datetime_18
[2020-06-21T19:08:52.534Z]    ... testcase_ouid
[2020-06-21T19:08:52.784Z]    ... testcase_encoded_profile
[2020-06-21T19:08:52.784Z]    ... file_perm_network_receive_lp1582374
[2020-06-21T19:08:52.784Z]    ... testcase_encoded_comm
[2020-06-21T19:08:52.784Z]    ... avc_audit_03
[2020-06-21T19:08:52.784Z]    ... old_style_log_07
[2020-06-21T19:08:52.784Z]    ... testcase_dbus_02
[2020-06-21T19:08:53.034Z]    ... testcase01
[2020-06-21T19:08:53.034Z]    ... testcase31
[2020-06-21T19:08:53.034Z]    ... testcase21
[2020-06-21T19:08:53.034Z]    ... testcase_syslog_link_01
[2020-06-21T19:08:53.034Z]    ... syslog_datetime_07
[2020-06-21T19:08:53.034Z]    ... ptrace_garbage_lp1689667_2
[2020-06-21T19:08:53.284Z]    ... syslog_datetime_12
[2020-06-21T19:08:53.285Z]    ... ptrace_no_denied_mask
[2020-06-21T19:08:53.285Z]    ... testcase_dmesg_changeprofile_01
[2020-06-21T19:08:53.285Z]    ... testcase_dmesg_capability
[2020-06-21T19:08:53.285Z]    ... testcase16
[2020-06-21T19:08:53.285Z]    ... syslog_datetime_15
[2020-06-21T19:08:53.535Z]    ... testcase09
[2020-06-21T19:08:53.535Z]    ... testcase07
[2020-06-21T19:08:53.535Z]    ... old_style_log_14
[2020-06-21T19:08:53.535Z]    ... testcase11
[2020-06-21T19:08:53.535Z]    ... change_onexec_lp1648143
[2020-06-21T19:08:53.535Z]    ... testcase_pivotroot_01
[2020-06-21T19:08:53.785Z]    ... testcase_dmesg_status_offset
[2020-06-21T19:08:53.785Z]    ... testcase_syslog_mkdir
[2020-06-21T19:08:53.785Z]    ... testcase22
[2020-06-21T19:08:53.785Z]    ... old_style_log_05
[2020-06-21T19:08:53.785Z]    ... testcase_changeprofile_01
[2020-06-21T19:08:54.035Z]    ... syslog_audit_05
[2020-06-21T19:08:54.035Z]    ... file_chown
[2020-06-21T19:08:54.035Z]    ... testcase25
[2020-06-21T19:08:54.035Z]    ... syslog_datetime_05
[2020-06-21T19:08:54.035Z]    ... testcase_syslog_truncate
[2020-06-21T19:08:54.035Z]    ... testcase13
[2020-06-21T19:08:54.286Z]    ... syslog_other_04
[2020-06-21T19:08:54.286Z]    ... testcase18
[2020-06-21T19:08:54.286Z]    ... syslog_datetime_10
[2020-06-21T19:08:54.286Z]    ... old_style_log_18
[2020-06-21T19:08:54.286Z]    ... syslog_datetime_09
[2020-06-21T19:08:54.286Z]    ... testcase03
[2020-06-21T19:08:54.536Z]    ... syslog_datetime_02
[2020-06-21T19:08:54.536Z]    ... testcase_network_04
[2020-06-21T19:08:54.536Z]    ... old_style_log_11
[2020-06-21T19:08:54.536Z]    ... testcase_syslog_changehat_negative_error
[2020-06-21T19:08:54.536Z]    ... testcase12
[2020-06-21T19:08:54.536Z]    ... testcase06
[2020-06-21T19:08:54.786Z]    ... syslog_datetime_14
[2020-06-21T19:08:54.786Z]    ... testcase_syslog_status_offset
[2020-06-21T19:08:54.786Z]    ... syslog_hostname_with_dot
[2020-06-21T19:08:54.786Z] 
[2020-06-21T19:08:54.786Z] 		=== libaalogparse Summary ===
[2020-06-21T19:08:54.786Z] 
[2020-06-21T19:08:54.786Z] # of expected passes		136
[2020-06-21T19:08:54.786Z] make[3]: Leaving directory '/build/apparmor/src/apparmor-2.13.4/libraries/libapparmor/testsuite'
[2020-06-21T19:08:54.786Z] make[2]: Leaving directory '/build/apparmor/src/apparmor-2.13.4/libraries/libapparmor/testsuite'
[2020-06-21T19:08:54.786Z] make[1]: Leaving directory '/build/apparmor/src/apparmor-2.13.4/libraries/libapparmor/testsuite'
[2020-06-21T19:08:54.786Z] make[1]: Entering directory '/build/apparmor/src/apparmor-2.13.4/libraries/libapparmor'
[2020-06-21T19:08:54.786Z] make[1]: Nothing to be done for 'check-am'.
[2020-06-21T19:08:54.786Z] make[1]: Leaving directory '/build/apparmor/src/apparmor-2.13.4/libraries/libapparmor'
[2020-06-21T19:08:54.786Z] make: Leaving directory '/build/apparmor/src/apparmor-2.13.4/libraries/libapparmor'
[2020-06-21T19:08:54.786Z] INFO: Running check binutils
[2020-06-21T19:08:54.786Z] make: Entering directory '/build/apparmor/src/apparmor-2.13.4/binutils'
[2020-06-21T19:08:54.786Z] LANG=C podchecker -warning -warning *.pod
[2020-06-21T19:08:54.786Z] no tests atm
[2020-06-21T19:08:55.037Z] aa-enabled.pod pod syntax OK.
[2020-06-21T19:08:55.037Z] aa-exec.pod pod syntax OK.
[2020-06-21T19:08:55.037Z] make: Leaving directory '/build/apparmor/src/apparmor-2.13.4/binutils'
[2020-06-21T19:08:55.037Z] INFO: Running check parser
[2020-06-21T19:08:55.037Z] make: Entering directory '/build/apparmor/src/apparmor-2.13.4/parser'
[2020-06-21T19:08:55.037Z] which: no rpm in (/usr/bin:/usr/sbin:/bin:/sbin:/usr/bin:/usr/sbin:/usr/local/bin:/usr/local/sbin:/usr/bin/site_perl:/usr/bin/vendor_perl:/usr/bin/core_perl:/usr/bin/site_perl:/usr/bin/vendor_perl:/usr/bin/core_perl:/usr/bin/site_perl:/usr/bin/vendor_perl:/usr/bin/core_perl:/usr/bin/site_perl:/usr/bin/vendor_perl:/usr/bin/core_perl)
[2020-06-21T19:08:55.037Z] LANG=C podchecker -warning -warning *.pod
[2020-06-21T19:08:55.037Z] make -C libapparmor_re CFLAGS="-march=x86-64 -mtune=generic -O2 -pipe -fno-plt -D_FORTIFY_SOURCE=2 -Wall -Wsign-compare -Wmissing-field-initializers -Wformat-security -Wunused-parameter -std=gnu++0x -D_GNU_SOURCE"
[2020-06-21T19:08:55.037Z] make[1]: Entering directory '/build/apparmor/src/apparmor-2.13.4/parser/libapparmor_re'
[2020-06-21T19:08:55.037Z] make[1]: Nothing to be done for 'all'.
[2020-06-21T19:08:55.037Z] make[1]: Leaving directory '/build/apparmor/src/apparmor-2.13.4/parser/libapparmor_re'
[2020-06-21T19:08:55.037Z] aa-teardown.pod pod syntax OK.
[2020-06-21T19:08:55.037Z] g++ -march=x86-64 -mtune=generic -O2 -pipe -fno-plt -D_FORTIFY_SOURCE=2 -Wall -Wsign-compare -Wmissing-field-initializers -Wformat-security -Wunused-parameter -std=gnu++0x -D_GNU_SOURCE  -DPACKAGE=\"apparmor-parser\" -DLOCALEDIR=\"/usr/share/locale\" -DSUBDOMAIN_CONFDIR=\"/etc/apparmor\" -I../libraries/libapparmor/include -DUNIT_TEST -Wno-unused-result -o tst_regex parser_regex.c parser_common.o parser_include.o parser_interface.o parser_misc.o parser_merge.o parser_symtab.o parser_variable.o parser_policy.o parser_alias.o lib.o network.o mount.o dbus.o profile.o rule.o signal.o ptrace.o af_rule.o af_unix.o libapparmor_re/libapparmor_re.a -static-libgcc -static-libstdc++ -L. -Wl,-O1,--sort-common,--as-needed,-z,relro,-z,now -L../libraries/libapparmor/src/.libs -Wl,-Bstatic -lapparmor -Wl,-Bdynamic -lpthread
[2020-06-21T19:08:55.037Z] apparmor.d.pod pod syntax OK.
[2020-06-21T19:08:55.037Z] apparmor_parser.pod pod syntax OK.
[2020-06-21T19:08:55.037Z] apparmor.pod pod syntax OK.
[2020-06-21T19:08:55.037Z] subdomain.conf.pod pod syntax OK.
[2020-06-21T19:08:55.288Z] g++ -march=x86-64 -mtune=generic -O2 -pipe -fno-plt -D_FORTIFY_SOURCE=2 -Wall -Wsign-compare -Wmissing-field-initializers -Wformat-security -Wunused-parameter -std=gnu++0x -D_GNU_SOURCE  -DPACKAGE=\"apparmor-parser\" -DLOCALEDIR=\"/usr/share/locale\" -DSUBDOMAIN_CONFDIR=\"/etc/apparmor\" -I../libraries/libapparmor/include -DUNIT_TEST -Wno-unused-result -o tst_misc parser_misc.c parser_common.o parser_include.o parser_interface.o parser_merge.o parser_symtab.o parser_regex.o parser_variable.o parser_policy.o parser_alias.o lib.o network.o mount.o dbus.o profile.o rule.o signal.o ptrace.o af_rule.o af_unix.o libapparmor_re/libapparmor_re.a -static-libgcc -static-libstdc++ -L. -Wl,-O1,--sort-common,--as-needed,-z,relro,-z,now -L../libraries/libapparmor/src/.libs -Wl,-Bstatic -lapparmor -Wl,-Bdynamic -lpthread
[2020-06-21T19:08:55.288Z] g++ -march=x86-64 -mtune=generic -O2 -pipe -fno-plt -D_FORTIFY_SOURCE=2 -Wall -Wsign-compare -Wmissing-field-initializers -Wformat-security -Wunused-parameter -std=gnu++0x -D_GNU_SOURCE  -DPACKAGE=\"apparmor-parser\" -DLOCALEDIR=\"/usr/share/locale\" -DSUBDOMAIN_CONFDIR=\"/etc/apparmor\" -I../libraries/libapparmor/include -DUNIT_TEST -Wno-unused-result -o tst_symtab parser_symtab.c parser_common.o parser_include.o parser_interface.o parser_misc.o parser_merge.o parser_regex.o parser_variable.o parser_policy.o parser_alias.o lib.o network.o mount.o dbus.o profile.o rule.o signal.o ptrace.o af_rule.o af_unix.o libapparmor_re/libapparmor_re.a -static-libgcc -static-libstdc++ -L. -Wl,-O1,--sort-common,--as-needed,-z,relro,-z,now -L../libraries/libapparmor/src/.libs -Wl,-Bstatic -lapparmor -Wl,-Bdynamic -lpthread
[2020-06-21T19:08:55.288Z] g++ -march=x86-64 -mtune=generic -O2 -pipe -fno-plt -D_FORTIFY_SOURCE=2 -Wall -Wsign-compare -Wmissing-field-initializers -Wformat-security -Wunused-parameter -std=gnu++0x -D_GNU_SOURCE  -DPACKAGE=\"apparmor-parser\" -DLOCALEDIR=\"/usr/share/locale\" -DSUBDOMAIN_CONFDIR=\"/etc/apparmor\" -I../libraries/libapparmor/include -DUNIT_TEST -Wno-unused-result -o tst_variable parser_variable.c parser_common.o parser_include.o parser_interface.o parser_misc.o parser_merge.o parser_symtab.o parser_regex.o parser_policy.o parser_alias.o lib.o network.o mount.o dbus.o profile.o rule.o signal.o ptrace.o af_rule.o af_unix.o libapparmor_re/libapparmor_re.a -static-libgcc -static-libstdc++ -L. -Wl,-O1,--sort-common,--as-needed,-z,relro,-z,now -L../libraries/libapparmor/src/.libs -Wl,-Bstatic -lapparmor -Wl,-Bdynamic -lpthread
[2020-06-21T19:08:55.288Z] g++ -march=x86-64 -mtune=generic -O2 -pipe -fno-plt -D_FORTIFY_SOURCE=2 -Wall -Wsign-compare -Wmissing-field-initializers -Wformat-security -Wunused-parameter -std=gnu++0x -D_GNU_SOURCE  -DPACKAGE=\"apparmor-parser\" -DLOCALEDIR=\"/usr/share/locale\" -DSUBDOMAIN_CONFDIR=\"/etc/apparmor\" -I../libraries/libapparmor/include -DUNIT_TEST -Wno-unused-result -o tst_lib lib.c parser_common.o parser_include.o parser_interface.o parser_misc.o parser_merge.o parser_symtab.o parser_regex.o parser_variable.o parser_policy.o parser_alias.o network.o mount.o dbus.o profile.o rule.o signal.o ptrace.o af_rule.o af_unix.o libapparmor_re/libapparmor_re.a -static-libgcc -static-libstdc++ -L. -Wl,-O1,--sort-common,--as-needed,-z,relro,-z,now -L../libraries/libapparmor/src/.libs -Wl,-Bstatic -lapparmor -Wl,-Bdynamic -lpthread
[2020-06-21T19:08:59.410Z] *** running tst_regex
[2020-06-21T19:08:59.410Z] parser_common.c: Regex error: trailing '\' escape character
[2020-06-21T19:08:59.410Z] parser_common.c: Unable to parse input line '\'
[2020-06-21T19:08:59.410Z] Warning from stdin (line 1): Character b was quoted unnecessarily, dropped preceding quote ('\') character
[2020-06-21T19:08:59.410Z] Warning from stdin (line 1): Character b was quoted unnecessarily, dropped preceding quote ('\') character
[2020-06-21T19:08:59.410Z] parser_common.c: Regex error: trailing '\' escape character
[2020-06-21T19:08:59.410Z] parser_common.c: Unable to parse input line 'blort\'
[2020-06-21T19:08:59.410Z] Warning from stdin (line 1): Character . was quoted unnecessarily, dropped preceding quote ('\') character
[2020-06-21T19:08:59.410Z] Warning from stdin (line 1): Character . was quoted unnecessarily, dropped preceding quote ('\') character
[2020-06-21T19:08:59.410Z] Warning from stdin (line 1): Character + was quoted unnecessarily, dropped preceding quote ('\') character
[2020-06-21T19:08:59.410Z] Warning from stdin (line 1): Character + was quoted unnecessarily, dropped preceding quote ('\') character
[2020-06-21T19:08:59.410Z] Warning from stdin (line 1): Character | was quoted unnecessarily, dropped preceding quote ('\') character
[2020-06-21T19:08:59.410Z] Warning from stdin (line 1): Character | was quoted unnecessarily, dropped preceding quote ('\') character
[2020-06-21T19:08:59.410Z] Warning from stdin (line 1): Character ( was quoted unnecessarily, dropped preceding quote ('\') character
[2020-06-21T19:08:59.410Z] Warning from stdin (line 1): Character ( was quoted unnecessarily, dropped preceding quote ('\') character
[2020-06-21T19:08:59.410Z] Warning from stdin (line 1): Character ) was quoted unnecessarily, dropped preceding quote ('\') character
[2020-06-21T19:08:59.411Z] Warning from stdin (line 1): Character ) was quoted unnecessarily, dropped preceding quote ('\') character
[2020-06-21T19:08:59.411Z] parser_common.c: Regex grouping error: Unclosed grouping or character class, expecting close }
[2020-06-21T19:08:59.411Z] parser_common.c: Unable to parse input line '[blort'
[2020-06-21T19:08:59.411Z] parser_common.c: Regex grouping error: Unclosed grouping or character class, expecting close }
[2020-06-21T19:08:59.411Z] parser_common.c: Unable to parse input line 'b[lort'
[2020-06-21T19:08:59.411Z] parser_common.c: Regex grouping error: Unclosed grouping or character class, expecting close }
[2020-06-21T19:08:59.411Z] parser_common.c: Unable to parse input line 'blort['
[2020-06-21T19:08:59.411Z] parser_common.c: Regex grouping error: Invalid close ], no matching open [ detected
[2020-06-21T19:08:59.411Z] parser_common.c: Unable to parse input line 'blort]'
[2020-06-21T19:08:59.411Z] parser_common.c: Regex grouping error: Invalid close ], no matching open [ detected
[2020-06-21T19:08:59.411Z] parser_common.c: Unable to parse input line 'blo]rt'
[2020-06-21T19:08:59.411Z] parser_common.c: Regex grouping error: Invalid close ], no matching open [ detected
[2020-06-21T19:08:59.411Z] parser_common.c: Unable to parse input line ']blort'
[2020-06-21T19:08:59.411Z] parser_common.c: Regex grouping error: Invalid number of items between {}
[2020-06-21T19:08:59.411Z] parser_common.c: Unable to parse input line '{beta}'
[2020-06-21T19:08:59.411Z] parser_common.c: Regex grouping error: Unclosed grouping or character class, expecting close }
[2020-06-21T19:08:59.411Z] parser_common.c: Unable to parse input line 'biz{beta'
[2020-06-21T19:08:59.411Z] parser_common.c: Regex grouping error: Invalid number of items between {}
[2020-06-21T19:08:59.411Z] parser_common.c: Regex grouping error: Invalid close }, no matching open { detected
[2020-06-21T19:08:59.411Z] parser_common.c: Unable to parse input line 'biz}beta'
[2020-06-21T19:08:59.411Z] parser_common.c: Regex grouping error: Unclosed grouping or character class, expecting close }
[2020-06-21T19:08:59.411Z] parser_common.c: Unable to parse input line 'biz{be,ta'
[2020-06-21T19:08:59.411Z] parser_common.c: Regex grouping error: Invalid number of items between {}
[2020-06-21T19:08:59.411Z] parser_common.c: Regex grouping error: Invalid close }, no matching open { detected
[2020-06-21T19:08:59.411Z] parser_common.c: Unable to parse input line 'biz,be}ta'
[2020-06-21T19:08:59.411Z] parser_common.c: Regex grouping error: Invalid number of items between {}
[2020-06-21T19:08:59.411Z] parser_common.c: Unable to parse input line 'biz{}beta'
[2020-06-21T19:08:59.411Z] parser_common.c: Regex grouping error: Invalid number of items between {}
[2020-06-21T19:08:59.411Z] parser_common.c: Unable to parse input line '{{alpha,blort,nested}beta}'
[2020-06-21T19:08:59.411Z] parser_common.c: Regex grouping error: Exceeded maximum nesting of {}
[2020-06-21T19:08:59.411Z] parser_common.c: Regex grouping error: Unclosed grouping or character class, expecting close }
[2020-06-21T19:08:59.411Z] parser_common.c: Unable to parse input line '{a{a{a{a{a{a{a{a{a{a{a{a{a{a{a{a{a{a{a{a{a{a{a{a{a{a{a{a{a{a{a{a{a{a{a{a{a{a{a{a{a{a{a{a{a{a{a{a{a{a,b},b},b},b},b},b},b},b},b},b},b},b},b},b},b},b},b},b},b},b},b},b},b},b},b},b},b},b},b},b},b},b},b},b},b},b},b},b},b},b},b},b},b},b},b},b},b},b},b}b,blort}'
[2020-06-21T19:08:59.411Z] parser_common.c: Regex grouping error: Unclosed grouping or character class, expecting close }
[2020-06-21T19:08:59.411Z] parser_common.c: Unable to parse input line '\\['
[2020-06-21T19:08:59.411Z] parser_common.c: Regex grouping error: Invalid close ], no matching open [ detected
[2020-06-21T19:08:59.411Z] parser_common.c: Unable to parse input line '\\]'
[2020-06-21T19:08:59.411Z] parser_common.c: Regex grouping error: Unclosed grouping or character class, expecting close }
[2020-06-21T19:08:59.411Z] parser_common.c: Unable to parse input line '\\{'
[2020-06-21T19:08:59.411Z] parser_common.c: Regex grouping error: Invalid number of items between {}
[2020-06-21T19:08:59.411Z] parser_common.c: Regex grouping error: Invalid close }, no matching open { detected
[2020-06-21T19:08:59.411Z] parser_common.c: Unable to parse input line '\\}'
[2020-06-21T19:08:59.411Z] Warning from stdin (line 1): Character l was quoted unnecessarily, dropped preceding quote ('\') character
[2020-06-21T19:08:59.411Z] Warning from stdin (line 1): Character l was quoted unnecessarily, dropped preceding quote ('\') character
[2020-06-21T19:08:59.411Z] *** running tst_misc
[2020-06-21T19:08:59.411Z] *** running tst_symtab
[2020-06-21T19:08:59.411Z] Variable not_a_set_variable is not a set variable
[2020-06-21T19:08:59.411Z] Referenced variable not_a_set_variable is a boolean used in set context
[2020-06-21T19:08:59.411Z] Variable @{recursive_1} is referenced recursively (by @{recursive_3})
[2020-06-21T19:08:59.411Z] Variable @{defined_var} references undefined variable @{undefined_var}
[2020-06-21T19:08:59.411Z] 'test' is already defined
[2020-06-21T19:08:59.411Z] Failed to find declaration for: no_such_variable
[2020-06-21T19:08:59.411Z] 'abuse' is already defined
[2020-06-21T19:08:59.411Z] 'stereopuff' is already defined
[2020-06-21T19:08:59.411Z] Variable stereopuff is not a boolean variable
[2020-06-21T19:08:59.411Z] @set_var_1 = "set_value@{set_var_2}"
[2020-06-21T19:08:59.411Z] @set_var_1 = "set_valuesome other set_value"
[2020-06-21T19:08:59.412Z] @set_var_1 = "set_value@{set_var_2}"
[2020-06-21T19:08:59.412Z] $abuse = false
[2020-06-21T19:08:59.412Z] @eek = "Mocking@{monopuff}bir@{stereopuff}d@{stereopuff}"
[2020-06-21T19:08:59.412Z] @monopuff = "Mockingbird"
[2020-06-21T19:08:59.412Z] $shenanigan = true
[2020-06-21T19:08:59.412Z] @stereopuff = "/in/direction" "Fun to Steal" "Unsupervised"
[2020-06-21T19:08:59.412Z] @test = "test value"
[2020-06-21T19:08:59.412Z] @testing = "testing"
[2020-06-21T19:08:59.412Z] $abuse = false
[2020-06-21T19:08:59.412Z] @eek = "Mocking@{monopuff}bir@{stereopuff}d@{stereopuff}"
[2020-06-21T19:08:59.412Z] @monopuff = "Mockingbird"
[2020-06-21T19:08:59.412Z] $shenanigan = true
[2020-06-21T19:08:59.412Z] @stereopuff = "/in/direction" "Fun to Steal" "Unsupervised"
[2020-06-21T19:08:59.412Z] @test = "test value"
[2020-06-21T19:08:59.412Z] @testing = "testing"
[2020-06-21T19:08:59.412Z] $abuse = false
[2020-06-21T19:08:59.412Z] @eek = "MockingMockingbirdbirUnsuperviseddUnsupervised" "MockingMockingbirdbirUnsuperviseddFun to Steal" "MockingMockingbirdbirUnsupervisedd/in/direction" "MockingMockingbirdbirFun to StealdUnsupervised" "MockingMockingbirdbirFun to StealdFun to Steal" "MockingMockingbirdbirFun to Steald/in/direction" "MockingMockingbirdbir/in/directiondUnsupervised" "MockingMockingbirdbir/in/directiondFun to Steal" "MockingMockingbirdbir/in/directiond/in/direction"
[2020-06-21T19:08:59.412Z] @monopuff = "Mockingbird"
[2020-06-21T19:08:59.412Z] $shenanigan = true
[2020-06-21T19:08:59.412Z] @stereopuff = "Unsupervised" "Fun to Steal" "/in/direction"
[2020-06-21T19:08:59.412Z] @test = "test value"
[2020-06-21T19:08:59.412Z] @testing = "testing"
[2020-06-21T19:08:59.412Z] *** running tst_variable
[2020-06-21T19:08:59.412Z] *** running tst_lib
[2020-06-21T19:08:59.412Z] make[1]: Entering directory '/build/apparmor/src/apparmor-2.13.4/parser/tst'
[2020-06-21T19:08:59.412Z] Can't locate Locale/gettext.pm in @INC (you may need to install the Locale::gettext module) (@INC contains: /usr/lib/perl5/5.32/site_perl /usr/share/perl5/site_perl /usr/lib/perl5/5.32/vendor_perl /usr/share/perl5/vendor_perl /usr/lib/perl5/5.32/core_perl /usr/share/perl5/core_perl) at ./gen-xtrans.pl line 4.
[2020-06-21T19:08:59.412Z] BEGIN failed--compilation aborted at ./gen-xtrans.pl line 4.
[2020-06-21T19:08:59.412Z] Can't locate Locale/gettext.pm in @INC (you may need to install the Locale::gettext module) (@INC contains: /usr/lib/perl5/5.32/site_perl /usr/share/perl5/site_perl /usr/lib/perl5/5.32/vendor_perl /usr/share/perl5/vendor_perl /usr/lib/perl5/5.32/core_perl /usr/share/perl5/core_perl) at ./gen-dbus.pl line 20.
[2020-06-21T19:08:59.412Z] BEGIN failed--compilation aborted at ./gen-dbus.pl line 20.
[2020-06-21T19:08:59.412Z] make[1]: *** [Makefile:26: gen_xtrans] Error 2
[2020-06-21T19:08:59.412Z] make[1]: *** Waiting for unfinished jobs....
[2020-06-21T19:08:59.412Z] Minimize profiles basic perms make[1]: *** [Makefile:32: gen_dbus] Error 2
[2020-06-21T19:08:59.412Z] Cache read/write disabled: interface file missing. (Kernel needs AppArmor 2.4 compatibility patch.)
[2020-06-21T19:08:59.412Z] Equality Tests:
[2020-06-21T19:08:59.412Z] ok
[2020-06-21T19:08:59.412Z] Minimize profiles audit perms ok
[2020-06-21T19:08:59.412Z] Minimize profiles deny perms ok
[2020-06-21T19:08:59.412Z] Minimize profiles audit deny perms .ok
[2020-06-21T19:08:59.412Z] Minimize profiles xtrans ok
[2020-06-21T19:08:59.412Z] Minimize profiles audit xtrans ok
[2020-06-21T19:08:59.412Z] Minimize profiles deny xtrans ok
[2020-06-21T19:08:59.412Z] Minimize profiles audit deny xtrans .ok
[2020-06-21T19:08:59.412Z] .Error Output: PASS
[2020-06-21T19:09:00.163Z] ..s........s......s......s.....s................................................................................./caching.py:272: DeprecationWarning: Please use assertEqual instead.
[2020-06-21T19:09:00.163Z]   self.assertEquals(time1, time2)
[2020-06-21T19:09:00.163Z] ./caching.py:399: DeprecationWarning: Please use assertEqual instead.
[2020-06-21T19:09:00.163Z]   self.assertEquals(expected, os.stat(self.cache_file).st_mtime)
[2020-06-21T19:09:01.165Z] ............................................................................./caching.py:476: DeprecationWarning: Please use assertNotEqual instead.
[2020-06-21T19:09:01.165Z]   self.assertNotEquals(orig_stat.st_ino, stat.st_ino)
[2020-06-21T19:09:02.166Z] .........................................................................../caching.py:441: DeprecationWarning: Please use assertEqual instead.
[2020-06-21T19:09:02.166Z]   self.assertEquals(orig_stat.st_size, stat.st_size)
[2020-06-21T19:09:02.166Z] ./caching.py:442: DeprecationWarning: Please use assertEqual instead.
[2020-06-21T19:09:02.166Z]   self.assertEquals(orig_stat.st_ino, stat.st_ino)
[2020-06-21T19:09:02.166Z] ./caching.py:443: DeprecationWarning: Please use assertEqual instead.
[2020-06-21T19:09:02.166Z]   self.assertEquals(orig_stat.st_mtime, stat.st_mtime)
[2020-06-21T19:09:14.432Z] .....................................................................................................................................................................................................................................................................................................................................................................................................................................................................................................................................................................................................................................................................................................................................................................................................................................................s......................................................................................................s................................................................................................................................................................................................................./caching.py:372: DeprecationWarning: Please use assertNotEqual instead.
[2020-06-21T19:09:14.432Z]   self.assertNotEquals(orig_stat.st_size, stat.st_size, 'Expected cache file to be updated, size is not changed.')
[2020-06-21T19:09:14.432Z] ./caching.py:373: DeprecationWarning: Please use assertEqual instead.
[2020-06-21T19:09:14.432Z]   self.assertEquals(os.stat(self.profile).st_mtime, stat.st_mtime)
[2020-06-21T19:09:15.433Z] .........................................................................................................../caching.py:407: DeprecationWarning: Please use assertEqual instead.
[2020-06-21T19:09:15.433Z]   self.assertEquals(expected, os.stat(self.cache_file).st_mtime)
[2020-06-21T19:09:17.436Z] .............................................................................................................................................................................................................../caching.py:391: DeprecationWarning: Please use assertEqual instead.
[2020-06-21T19:09:17.436Z]   self.assertEquals(expected, os.stat(self.cache_file).st_mtime)
[2020-06-21T19:09:18.437Z] .........................................................................................................../caching.py:459: DeprecationWarning: Please use assertNotEqual instead.
[2020-06-21T19:09:18.437Z]   self.assertNotEquals(orig_stat.st_ino, stat.st_ino)
[2020-06-21T19:09:19.438Z] .........................................................................................................../caching.py:423: DeprecationWarning: Please use assertEqual instead.
[2020-06-21T19:09:19.438Z]   self.assertEquals(orig_stat.st_size, stat.st_size)
[2020-06-21T19:09:19.439Z] ./caching.py:424: DeprecationWarning: Please use assertEqual instead.
[2020-06-21T19:09:19.439Z]   self.assertEquals(orig_stat.st_ino, stat.st_ino)
[2020-06-21T19:09:19.439Z] ./caching.py:425: DeprecationWarning: Please use assertEqual instead.
[2020-06-21T19:09:19.439Z]   self.assertEquals(orig_stat.st_mtime, stat.st_mtime)
[2020-06-21T19:09:28.448Z] .......................................................................................................................................................................................................................................................................................................................................................................................................................................................................................................................................................................................................................................................................................................................................................................................................................................................................................................................
[2020-06-21T19:09:28.448Z] PASS
[2020-06-21T19:09:40.923Z] ....ss.......
[2020-06-21T19:09:40.923Z] ----------------------------------------------------------------------
[2020-06-21T19:09:40.923Z] Ran 66 tests in 42.077s
[2020-06-21T19:09:40.923Z] 
[2020-06-21T19:09:40.923Z] OK (skipped=9)
[2020-06-21T19:09:40.923Z] make[1]: Leaving directory '/build/apparmor/src/apparmor-2.13.4/parser/tst'
[2020-06-21T19:09:40.923Z] make: *** [Makefile:304: tests] Error 2
[2020-06-21T19:09:40.923Z] make: Leaving directory '/build/apparmor/src/apparmor-2.13.4/parser'
[2020-06-21T19:09:40.923Z] ==> ERROR: A failure occurred in check().
[2020-06-21T19:09:41.174Z]     Aborting...
[2020-06-21T19:09:42.084Z] ==> ERROR: Build failed, check /build/buildpkg/goblins-x86_64/jenkins/build
[Pipeline] }
[2020-06-21T19:09:42.088Z] ERROR: Failed to build source
[2020-06-21T19:09:42.088Z] ERROR: script returned exit code 255
[Pipeline] // catchError
[Pipeline] }
[Pipeline] // dir
Post stage
[Pipeline] emailext
[2020-06-21T19:09:42.170Z] Sending email to: artix-build-failures at artixlinux.org


More information about the artix-build-failures mailing list