[artix-build-failures] [galaxy-gremlins] Failure: broadcom-wl

jenkins at artixlinux.org jenkins at artixlinux.org
Mon Dec 21 23:59:49 CET 2020


   Failure

   Build: x86_64/community-testing

   Packages:

   broadcom-wl-6.30.223.271-251-x86_64.pkg.tar.zst

   author: artoo

   email: artoo at artixlinux.org

   [1]https://orion.artixlinux.org/job/packagesB/job/broadcom-wl/job/maste
   r/40/

References

   1. https://orion.artixlinux.org/job/packagesB/job/broadcom-wl/job/master/40/
-------------- next part --------------
Push event to branch master
Querying the current revision of branch master...
Current revision of branch master is 22b3290ccd97a91ebdc92c2f17c4991b76c1c07a
Obtained Jenkinsfile from 22b3290ccd97a91ebdc92c2f17c4991b76c1c07a
Running in Durability level: PERFORMANCE_OPTIMIZED
Loading library artix-ci at master
Attempting to resolve master from remote references...
 > git --version # timeout=10
 > git --version # 'git version 2.29.2'
 > git ls-remote -- https://gitea.artixlinux.org/artix/pipeline-libs.git # timeout=10
Found match: refs/heads/master revision cd7e2f0e0a6cbd84988a2f7d970d0bfe52e2386b
Selected Git installation does not exist. Using Default
The recommended git tool is: NONE
Warning: CredentialId "jenkins-gotea-token" could not be found.
 > git rev-parse --is-inside-work-tree # timeout=10
Fetching changes from the remote Git repository
 > git config remote.origin.url https://gitea.artixlinux.org/artix/pipeline-libs.git # timeout=10
Fetching without tags
Fetching upstream changes from https://gitea.artixlinux.org/artix/pipeline-libs.git
 > git --version # timeout=10
 > git --version # 'git version 2.29.2'
 > git fetch --no-tags --force --progress -- https://gitea.artixlinux.org/artix/pipeline-libs.git +refs/heads/master:refs/remotes/origin/master # timeout=10
Checking out Revision cd7e2f0e0a6cbd84988a2f7d970d0bfe52e2386b (master)
 > git config core.sparsecheckout # timeout=10
 > git checkout -f cd7e2f0e0a6cbd84988a2f7d970d0bfe52e2386b # timeout=10
Commit message: "update readme"
[Gitea] Notifying branch build status: PENDING Build started...
[Gitea] Notified
[Pipeline] Start of Pipeline
[Pipeline] node
Still waiting to schedule task
Waiting for next available executor
Running on Jenkins in /var/lib/jenkins/workspace/packagesB_broadcom-wl_master
[Pipeline] {
[Pipeline] timestamps
[Pipeline] {
[Pipeline] stage
[Pipeline] { (Prepare)
[Pipeline] catchError
[Pipeline] {
[Pipeline] checkout
[2020-12-21T22:59:32.159Z] The recommended git tool is: NONE
[2020-12-21T22:59:32.159Z] Warning: CredentialId "jenkins-gotea-token" could not be found.
[2020-12-21T22:59:32.159Z]  > git rev-parse --is-inside-work-tree # timeout=10
[2020-12-21T22:59:32.164Z] Fetching changes from the remote Git repository
[2020-12-21T22:59:32.164Z]  > git config remote.origin.url https://237b7412742b4068af4173944de150f12959f4d3@gitea.artixlinux.org/packagesB/broadcom-wl.git # timeout=10
[2020-12-21T22:59:32.167Z] Cleaning workspace
[2020-12-21T22:59:32.167Z]  > git rev-parse --verify HEAD # timeout=10
[2020-12-21T22:59:32.171Z] Resetting working tree
[2020-12-21T22:59:32.171Z]  > git reset --hard # timeout=10
[2020-12-21T22:59:32.177Z]  > git clean -fdx # timeout=10
[2020-12-21T22:59:32.180Z] Fetching without tags
[2020-12-21T22:59:32.180Z] Fetching upstream changes from https://237b7412742b4068af4173944de150f12959f4d3@gitea.artixlinux.org/packagesB/broadcom-wl.git
[2020-12-21T22:59:32.180Z]  > git --version # timeout=10
[2020-12-21T22:59:32.182Z]  > git --version # 'git version 2.29.2'
[2020-12-21T22:59:32.182Z]  > git fetch --no-tags --force --progress -- https://237b7412742b4068af4173944de150f12959f4d3@gitea.artixlinux.org/packagesB/broadcom-wl.git +refs/heads/master:refs/remotes/origin/master # timeout=10
[2020-12-21T22:59:32.435Z] Checking out Revision 22b3290ccd97a91ebdc92c2f17c4991b76c1c07a (master)
[2020-12-21T22:59:32.435Z]  > git config core.sparsecheckout # timeout=10
[2020-12-21T22:59:32.441Z]  > git checkout -f 22b3290ccd97a91ebdc92c2f17c4991b76c1c07a # timeout=10
[2020-12-21T22:59:32.451Z] Commit message: "[trunk] -> [community-testing] 'broadcom-wl-6.30.223.271-251' add"
[2020-12-21T22:59:32.451Z]  > git rev-list --no-walk bc584fc46b8788af92e3fc4cb457d11a94ade23d # timeout=10
[2020-12-21T22:59:32.462Z] Cleaning workspace
[2020-12-21T22:59:32.462Z]  > git rev-parse --verify HEAD # timeout=10
[2020-12-21T22:59:32.467Z] Resetting working tree
[2020-12-21T22:59:32.467Z]  > git reset --hard # timeout=10
[2020-12-21T22:59:32.473Z]  > git clean -fdx # timeout=10
[2020-12-21T22:59:32.479Z] [Gitea] Notifying branch build status: PENDING Build started...
[2020-12-21T22:59:32.667Z] [Gitea] Notified
[Pipeline] libraryResource
[Pipeline] readYaml
[Pipeline] sh
[2020-12-21T22:59:32.940Z] + git show -s --format=%an 22b3290ccd97a91ebdc92c2f17c4991b76c1c07a
[Pipeline] sh
[2020-12-21T22:59:33.197Z] + git show -s --format=%ae 22b3290ccd97a91ebdc92c2f17c4991b76c1c07a
[Pipeline] sh
[2020-12-21T22:59:33.454Z] + git show --pretty=format: --name-status 22b3290ccd97a91ebdc92c2f17c4991b76c1c07a
[Pipeline] fileExists
[Pipeline] sh
[2020-12-21T22:59:33.724Z] + pkg2yaml -d x86_64/community-testing
[Pipeline] readYaml
[Pipeline] }
[Pipeline] // catchError
[Pipeline] }
[Pipeline] // stage
[Pipeline] stage
[Pipeline] { (Build)
[Pipeline] withCredentials
[2020-12-21T22:59:33.895Z] Masking supported pattern matches of $BUILDBOT_GPGP
[Pipeline] {
[Pipeline] dir
[2020-12-21T22:59:33.920Z] Running in /var/lib/jenkins/workspace/packagesB_broadcom-wl_master/x86_64/community-testing
[Pipeline] {
[Pipeline] catchError
[Pipeline] {
[Pipeline] sh
[2020-12-21T22:59:34.187Z] + buildpkg -C -d galaxy-gremlins
[2020-12-21T22:59:37.415Z] :: Synchronizing package databases...
[2020-12-21T22:59:37.415Z]  gremlins is up to date
[2020-12-21T22:59:37.415Z]  system is up to date
[2020-12-21T22:59:37.415Z]  world is up to date
[2020-12-21T22:59:37.415Z] downloading galaxy-gremlins.db...
[2020-12-21T22:59:37.415Z]  galaxy is up to date
[2020-12-21T22:59:37.415Z] :: Starting full system upgrade...
[2020-12-21T22:59:37.415Z]  there is nothing to do
[2020-12-21T22:59:38.758Z] ==> Building in chroot for [gremlins] (x86_64)...
[2020-12-21T22:59:39.669Z] ==> Synchronizing chroot copy [/build/buildpkg/gremlins-x86_64/root] -> [jenkins]...done
[2020-12-21T22:59:40.580Z] ==> Making package: broadcom-wl 6.30.223.271-251 (Mon Dec 21 23:59:40 2020)
[2020-12-21T22:59:40.580Z] ==> Retrieving sources...
[2020-12-21T22:59:45.775Z] ==> Making package: broadcom-wl 6.30.223.271-251 (Mon 21 Dec 2020 10:59:45 PM UTC)
[2020-12-21T22:59:45.775Z] ==> Checking runtime dependencies...
[2020-12-21T22:59:45.775Z] ==> Checking buildtime dependencies...
[2020-12-21T22:59:45.775Z] ==> Installing missing dependencies...
[2020-12-21T22:59:45.775Z] resolving dependencies...
[2020-12-21T22:59:45.775Z] looking for conflicting packages...
[2020-12-21T22:59:45.775Z] 
[2020-12-21T22:59:45.775Z] Package (4)                       New Version      Net Change  Download Size
[2020-12-21T22:59:45.775Z] 
[2020-12-21T22:59:45.775Z] world/dkms                        2.8.4-1            0.17 MiB               
[2020-12-21T22:59:45.775Z] system/kmod                       27-2               0.28 MiB               
[2020-12-21T22:59:45.775Z] galaxy-gremlins/broadcom-wl-dkms  6.30.223.271-25    7.61 MiB       1.68 MiB
[2020-12-21T22:59:45.775Z] gremlins/linux-headers            5.10.2.artix1-1  126.75 MiB               
[2020-12-21T22:59:45.775Z] 
[2020-12-21T22:59:45.775Z] Total Download Size:     1.68 MiB
[2020-12-21T22:59:45.775Z] Total Installed Size:  134.81 MiB
[2020-12-21T22:59:45.775Z] 
[2020-12-21T22:59:45.775Z] :: Proceed with installation? [Y/n] 
[2020-12-21T22:59:45.775Z] :: Retrieving packages...
[2020-12-21T22:59:45.775Z] downloading broadcom-wl-dkms-6.30.223.271-25-x86_64.pkg.tar.zst...
[2020-12-21T22:59:45.775Z] checking keyring...
[2020-12-21T22:59:45.775Z] checking package integrity...
[2020-12-21T22:59:46.026Z] loading package files...
[2020-12-21T22:59:46.276Z] checking for file conflicts...
[2020-12-21T22:59:46.276Z] checking available disk space...
[2020-12-21T22:59:46.276Z] :: Processing package changes...
[2020-12-21T22:59:46.276Z] installing linux-headers...
[2020-12-21T22:59:47.619Z] installing kmod...
[2020-12-21T22:59:47.619Z] installing dkms...
[2020-12-21T22:59:47.619Z] Optional dependencies for dkms
[2020-12-21T22:59:47.619Z]     linux-headers: build modules against the Arch kernel [installed]
[2020-12-21T22:59:47.619Z]     linux-lts-headers: build modules against the LTS kernel
[2020-12-21T22:59:47.619Z]     linux-zen-headers: build modules against the ZEN kernel
[2020-12-21T22:59:47.619Z]     linux-hardened-headers: build modules against the HARDENED kernel
[2020-12-21T22:59:47.619Z] installing broadcom-wl-dkms...
[2020-12-21T22:59:47.619Z] 
[2020-12-21T22:59:47.619Z] To load the new module, run the following commands as root:
[2020-12-21T22:59:47.619Z] 
[2020-12-21T22:59:47.619Z]   rmmod b43 b43legacy bcm43xx bcma brcm80211 brcmfmac brcmsmac ssb wl
[2020-12-21T22:59:47.619Z]   modprobe wl
[2020-12-21T22:59:47.619Z] 
[2020-12-21T22:59:47.619Z] Or just reboot the system.
[2020-12-21T22:59:47.619Z] 
[2020-12-21T22:59:47.870Z] :: Running post-transaction hooks...
[2020-12-21T22:59:47.870Z] (1/2) Updating module dependencies...
[2020-12-21T22:59:47.870Z] (2/2) Install DKMS modules
[2020-12-21T22:59:47.870Z] ==> Unable to install module broadcom-wl/6.30.223.271 for kernel 5.10.2-artix1-1: Missing kernel modules tree.
[2020-12-21T22:59:47.870Z] ==> Retrieving sources...
[2020-12-21T22:59:47.870Z] ==> WARNING: Skipping all source file integrity checks.
[2020-12-21T22:59:47.870Z] ==> Extracting sources...
[2020-12-21T22:59:47.870Z] ==> Starting build()...
[2020-12-21T22:59:48.120Z] 
[2020-12-21T22:59:48.120Z] Creating symlink /build/broadcom-wl/src/broadcom-wl/6.30.223.271/source ->
[2020-12-21T22:59:48.120Z]                  /usr/src/broadcom-wl-6.30.223.271
[2020-12-21T22:59:48.120Z] 
[2020-12-21T22:59:48.120Z] DKMS: add completed.
[2020-12-21T22:59:48.120Z] 
[2020-12-21T22:59:48.120Z] Kernel preparation unnecessary for this kernel.  Skipping...
[2020-12-21T22:59:48.120Z] applying patch 001-null-pointer-fix.patch...patching file src/wl/sys/wl_linux.c
[2020-12-21T22:59:48.120Z] Hunk #1 succeeded at 2165 (offset 8 lines).
[2020-12-21T22:59:48.120Z] 
[2020-12-21T22:59:48.120Z] applying patch 002-rdtscl.patch...patching file src/shared/linux_osl.c
[2020-12-21T22:59:48.120Z] 
[2020-12-21T22:59:48.371Z] applying patch 003-linux47.patch...patching file src/wl/sys/wl_cfg80211_hybrid.c
[2020-12-21T22:59:48.371Z] 
[2020-12-21T22:59:48.371Z] applying patch 004-linux48.patch...patching file src/wl/sys/wl_cfg80211_hybrid.c
[2020-12-21T22:59:48.371Z] Hunk #1 succeeded at 2386 (offset -2 lines).
[2020-12-21T22:59:48.371Z] Hunk #2 succeeded at 2496 (offset -2 lines).
[2020-12-21T22:59:48.371Z] Hunk #3 succeeded at 2928 (offset 4 lines).
[2020-12-21T22:59:48.371Z] 
[2020-12-21T22:59:48.371Z] applying patch 005-debian-fix-kernel-warnings.patch...patching file src/wl/sys/wl_cfg80211_hybrid.c
[2020-12-21T22:59:48.371Z] 
[2020-12-21T22:59:48.371Z] applying patch 006-linux411.patch...patching file src/wl/sys/wl_cfg80211_hybrid.c
[2020-12-21T22:59:48.371Z] patching file src/wl/sys/wl_linux.c
[2020-12-21T22:59:48.371Z] 
[2020-12-21T22:59:48.371Z] applying patch 007-linux412.patch...patching file src/wl/sys/wl_cfg80211_hybrid.c
[2020-12-21T22:59:48.371Z] Hunk #1 succeeded at 54 (offset 1 line).
[2020-12-21T22:59:48.371Z] Hunk #2 succeeded at 471 (offset 1 line).
[2020-12-21T22:59:48.371Z] Hunk #3 succeeded at 2396 with fuzz 1 (offset 27 lines).
[2020-12-21T22:59:48.371Z] Hunk #4 succeeded at 2424 with fuzz 2 (offset 34 lines).
[2020-12-21T22:59:48.371Z] 
[2020-12-21T22:59:48.371Z] applying patch 008-linux415.patch...patching file src/wl/sys/wl_linux.c
[2020-12-21T22:59:48.371Z] 
[2020-12-21T22:59:48.371Z] applying patch 010-linux56.patch...patching file src/shared/linux_osl.c
[2020-12-21T22:59:48.371Z] Hunk #1 FAILED at 942.
[2020-12-21T22:59:48.371Z] 1 out of 1 hunk FAILED -- saving rejects to file src/shared/linux_osl.c.rej
[2020-12-21T22:59:48.371Z] patching file src/wl/sys/wl_linux.c
[2020-12-21T22:59:48.371Z] Hunk #1 FAILED at 582.
[2020-12-21T22:59:48.371Z] Hunk #2 FAILED at 772.
[2020-12-21T22:59:48.371Z] Hunk #3 succeeded at 3352 (offset 17 lines).
[2020-12-21T22:59:48.371Z] 2 out of 3 hunks FAILED -- saving rejects to file src/wl/sys/wl_linux.c.rej
[2020-12-21T22:59:48.371Z] (bad exit status: 1)
[2020-12-21T22:59:48.371Z] Error! Application of patch 010-linux56.patch failed.
[2020-12-21T22:59:48.371Z] Check /build/broadcom-wl/src/broadcom-wl/6.30.223.271/build/ for more information.
[2020-12-21T22:59:48.371Z] ==> ERROR: A failure occurred in build().
[2020-12-21T22:59:48.371Z]     Aborting...
[2020-12-21T22:59:49.282Z] ==> ERROR: Build failed, check /build/buildpkg/gremlins-x86_64/jenkins/build
[Pipeline] }
[2020-12-21T22:59:49.285Z] ERROR: Failed to build source
[2020-12-21T22:59:49.285Z] ERROR: script returned exit code 255
[Pipeline] // catchError
[Pipeline] }
[Pipeline] // dir
Post stage
[Pipeline] emailext
[2020-12-21T22:59:49.358Z] Sending email to: artix-build-failures at artixlinux.org


More information about the artix-build-failures mailing list