[artix-build-failures] [galaxy] Failure: python-pyudev

jenkins at artixlinux.org jenkins at artixlinux.org
Sat Dec 19 13:41:27 CET 2020


   Failure

   Build: x86_64/community

   Packages:

   python-pyudev-0.22-5-any.pkg.tar.zst

   author: alium

   email: alium at artixlinux.org

   [1]https://orion.artixlinux.org/job/packagesPython/job/python-pyudev/jo
   b/master/1/

References

   1. https://orion.artixlinux.org/job/packagesPython/job/python-pyudev/job/master/1/
-------------- next part --------------
Branch indexing
Querying the current revision of branch master...
Current revision of branch master is a7fd603eee60e06a5a7839ca19371f1181d7151a
Obtained Jenkinsfile from a7fd603eee60e06a5a7839ca19371f1181d7151a
Running in Durability level: PERFORMANCE_OPTIMIZED
Loading library artix-ci at master
Attempting to resolve master from remote references...
 > git --version # timeout=10
 > git --version # 'git version 2.29.2'
 > git ls-remote -- https://gitea.artixlinux.org/artix/pipeline-libs.git # timeout=10
Found match: refs/heads/master revision cd7e2f0e0a6cbd84988a2f7d970d0bfe52e2386b
Selected Git installation does not exist. Using Default
The recommended git tool is: NONE
Warning: CredentialId "jenkins-gotea-token" could not be found.
Cloning the remote Git repository
Cloning with configured refspecs honoured and without tags
Cloning repository https://gitea.artixlinux.org/artix/pipeline-libs.git
 > git init /var/lib/jenkins/workspace/kagesPython_python-pyudev_master at libs/artix-ci # timeout=10
Fetching upstream changes from https://gitea.artixlinux.org/artix/pipeline-libs.git
 > git --version # timeout=10
 > git --version # 'git version 2.29.2'
 > git fetch --no-tags --force --progress -- https://gitea.artixlinux.org/artix/pipeline-libs.git +refs/heads/master:refs/remotes/origin/master # timeout=10
 > git config remote.origin.url https://gitea.artixlinux.org/artix/pipeline-libs.git # timeout=10
 > git config --add remote.origin.fetch +refs/heads/master:refs/remotes/origin/master # timeout=10
Avoid second fetch
Checking out Revision cd7e2f0e0a6cbd84988a2f7d970d0bfe52e2386b (master)
 > git config core.sparsecheckout # timeout=10
 > git checkout -f cd7e2f0e0a6cbd84988a2f7d970d0bfe52e2386b # timeout=10
Commit message: "update readme"
 > git --version # timeout=10
 > git --version # 'git version 2.29.2'
[Gitea] Notifying branch build status: PENDING Build started...
[Gitea] Notified
[Pipeline] Start of Pipeline
[Pipeline] node
Running on Jenkins in /var/lib/jenkins/workspace/kagesPython_python-pyudev_master
[Pipeline] {
[Pipeline] timestamps
[Pipeline] {
[Pipeline] stage
[Pipeline] { (Prepare)
[Pipeline] catchError
[Pipeline] {
[Pipeline] checkout
[2020-12-19T12:41:02.560Z] The recommended git tool is: NONE
[2020-12-19T12:41:02.560Z] Warning: CredentialId "jenkins-gotea-token" could not be found.
[2020-12-19T12:41:02.561Z] Cloning the remote Git repository
[2020-12-19T12:41:02.561Z] Cloning with configured refspecs honoured and without tags
[2020-12-19T12:41:02.561Z] Cloning repository https://237b7412742b4068af4173944de150f12959f4d3@gitea.artixlinux.org/packagesPython/python-pyudev.git
[2020-12-19T12:41:02.561Z]  > git init /var/lib/jenkins/workspace/kagesPython_python-pyudev_master # timeout=10
[2020-12-19T12:41:02.566Z] Fetching upstream changes from https://237b7412742b4068af4173944de150f12959f4d3@gitea.artixlinux.org/packagesPython/python-pyudev.git
[2020-12-19T12:41:02.566Z]  > git --version # timeout=10
[2020-12-19T12:41:02.570Z]  > git --version # 'git version 2.29.2'
[2020-12-19T12:41:02.570Z]  > git fetch --no-tags --force --progress -- https://237b7412742b4068af4173944de150f12959f4d3@gitea.artixlinux.org/packagesPython/python-pyudev.git +refs/heads/master:refs/remotes/origin/master # timeout=10
[2020-12-19T12:41:02.744Z]  > git config remote.origin.url https://237b7412742b4068af4173944de150f12959f4d3@gitea.artixlinux.org/packagesPython/python-pyudev.git # timeout=10
[2020-12-19T12:41:02.749Z]  > git config --add remote.origin.fetch +refs/heads/master:refs/remotes/origin/master # timeout=10
[2020-12-19T12:41:02.754Z] Avoid second fetch
[2020-12-19T12:41:02.754Z] Checking out Revision a7fd603eee60e06a5a7839ca19371f1181d7151a (master)
[2020-12-19T12:41:02.754Z]  > git config core.sparsecheckout # timeout=10
[2020-12-19T12:41:02.758Z]  > git checkout -f a7fd603eee60e06a5a7839ca19371f1181d7151a # timeout=10
[2020-12-19T12:41:02.767Z] Commit message: "[trunk] -> [community] 'python-pyudev-0.22-5' add"
[2020-12-19T12:41:02.768Z] First time build. Skipping changelog.
[2020-12-19T12:41:02.768Z] Cleaning workspace
[2020-12-19T12:41:02.768Z]  > git rev-parse --verify HEAD # timeout=10
[2020-12-19T12:41:02.772Z] Resetting working tree
[2020-12-19T12:41:02.772Z]  > git reset --hard # timeout=10
[2020-12-19T12:41:02.778Z]  > git clean -fdx # timeout=10
[2020-12-19T12:41:02.783Z]  > git --version # timeout=10
[2020-12-19T12:41:02.787Z]  > git --version # 'git version 2.29.2'
[2020-12-19T12:41:02.791Z] fatal: bad object cd7e2f0e0a6cbd84988a2f7d970d0bfe52e2386b
[2020-12-19T12:41:02.793Z] [Gitea] Notifying branch build status: PENDING Build started...
[2020-12-19T12:41:02.917Z] [Gitea] Notified
[Pipeline] libraryResource
[Pipeline] readYaml
[Pipeline] sh
[2020-12-19T12:41:03.188Z] + git show -s --format=%an a7fd603eee60e06a5a7839ca19371f1181d7151a
[Pipeline] sh
[2020-12-19T12:41:03.444Z] + git show -s --format=%ae a7fd603eee60e06a5a7839ca19371f1181d7151a
[Pipeline] sh
[2020-12-19T12:41:03.701Z] + git show --pretty=format: --name-status a7fd603eee60e06a5a7839ca19371f1181d7151a
[Pipeline] fileExists
[Pipeline] sh
[2020-12-19T12:41:03.973Z] + pkg2yaml -d x86_64/community
[Pipeline] readYaml
[Pipeline] }
[Pipeline] // catchError
[Pipeline] }
[Pipeline] // stage
[Pipeline] stage
[Pipeline] { (Build)
[Pipeline] withCredentials
[2020-12-19T12:41:04.137Z] Masking supported pattern matches of $BUILDBOT_GPGP
[Pipeline] {
[Pipeline] dir
[2020-12-19T12:41:04.152Z] Running in /var/lib/jenkins/workspace/kagesPython_python-pyudev_master/x86_64/community
[Pipeline] {
[Pipeline] catchError
[Pipeline] {
[Pipeline] sh
[2020-12-19T12:41:04.415Z] + buildpkg -C -d galaxy
[2020-12-19T12:41:07.643Z] :: Synchronizing package databases...
[2020-12-19T12:41:07.643Z]  system is up to date
[2020-12-19T12:41:07.643Z]  world is up to date
[2020-12-19T12:41:07.643Z] downloading galaxy.db...
[2020-12-19T12:41:07.643Z] :: Starting full system upgrade...
[2020-12-19T12:41:07.643Z]  there is nothing to do
[2020-12-19T12:41:08.554Z] ==> Building in chroot for [default] (x86_64)...
[2020-12-19T12:41:09.356Z] ==> Synchronizing chroot copy [/build/buildpkg/default-x86_64/root] -> [jenkins]...done
[2020-12-19T12:41:10.267Z] ==> Making package: python-pyudev 0.22-5 (Sat Dec 19 13:41:10 2020)
[2020-12-19T12:41:10.267Z] ==> Retrieving sources...
[2020-12-19T12:41:10.267Z]   -> Downloading pyudev-0.22.tar.gz...
[2020-12-19T12:41:10.267Z]   % Total    % Received % Xferd  Average Speed   Time    Time     Time  Current
[2020-12-19T12:41:10.267Z]                                  Dload  Upload   Total   Spent    Left  Speed
[2020-12-19T12:41:10.517Z] 
  0     0    0     0    0     0      0      0 --:--:-- --:--:-- --:--:--     0
100   120  100   120    0     0    603      0 --:--:-- --:--:-- --:--:--   603
[2020-12-19T12:41:10.767Z] 
  0     0    0     0    0     0      0      0 --:--:-- --:--:-- --:--:--     0
100 83541    0 83541    0     0   163k      0 --:--:-- --:--:-- --:--:--  313k
[2020-12-19T12:41:10.767Z] ==> Validating source files with sha512sums...
[2020-12-19T12:41:10.767Z]     pyudev-0.22.tar.gz ... Passed
[2020-12-19T12:41:15.962Z] ==> Making package: python-pyudev 0.22-5 (Sat 19 Dec 2020 12:41:15 PM UTC)
[2020-12-19T12:41:15.962Z] ==> Checking runtime dependencies...
[2020-12-19T12:41:15.962Z] ==> Installing missing dependencies...
[2020-12-19T12:41:15.962Z] resolving dependencies...
[2020-12-19T12:41:15.962Z] looking for conflicting packages...
[2020-12-19T12:41:15.962Z] 
[2020-12-19T12:41:15.962Z] Package (4)        New Version  Net Change
[2020-12-19T12:41:15.962Z] 
[2020-12-19T12:41:15.962Z] system/libnsl      1.3.0-1        0.19 MiB
[2020-12-19T12:41:15.962Z] world/python       3.9.1-1       79.39 MiB
[2020-12-19T12:41:15.962Z] system/libelogind  243.7-4        0.54 MiB
[2020-12-19T12:41:15.962Z] world/python-six   1.15.0-3       0.09 MiB
[2020-12-19T12:41:15.962Z] 
[2020-12-19T12:41:15.962Z] Total Installed Size:  80.22 MiB
[2020-12-19T12:41:15.962Z] 
[2020-12-19T12:41:15.962Z] :: Proceed with installation? [Y/n] 
[2020-12-19T12:41:15.962Z] checking keyring...
[2020-12-19T12:41:15.962Z] checking package integrity...
[2020-12-19T12:41:16.219Z] loading package files...
[2020-12-19T12:41:16.219Z] checking for file conflicts...
[2020-12-19T12:41:16.219Z] checking available disk space...
[2020-12-19T12:41:16.219Z] :: Processing package changes...
[2020-12-19T12:41:16.219Z] installing libnsl...
[2020-12-19T12:41:16.219Z] installing python...
[2020-12-19T12:41:16.469Z] Optional dependencies for python
[2020-12-19T12:41:16.469Z]     python-setuptools
[2020-12-19T12:41:16.469Z]     python-pip
[2020-12-19T12:41:16.469Z]     sqlite [installed]
[2020-12-19T12:41:16.469Z]     mpdecimal: for decimal
[2020-12-19T12:41:16.469Z]     xz: for lzma [installed]
[2020-12-19T12:41:16.469Z]     tk: for tkinter
[2020-12-19T12:41:16.470Z] installing python-six...
[2020-12-19T12:41:16.470Z] installing libelogind...
[2020-12-19T12:41:16.470Z] ==> Checking buildtime dependencies...
[2020-12-19T12:41:16.470Z] ==> Installing missing dependencies...
[2020-12-19T12:41:17.020Z] resolving dependencies...
[2020-12-19T12:41:17.020Z] looking for conflicting packages...
[2020-12-19T12:41:17.020Z] 
[2020-12-19T12:41:17.020Z] Package (40)                                 New Version  Net Change
[2020-12-19T12:41:17.020Z] 
[2020-12-19T12:41:17.020Z] galaxy/python-apipkg                         1.5-5          0.02 MiB
[2020-12-19T12:41:17.020Z] world/python-appdirs                         1.4.4-3        0.07 MiB
[2020-12-19T12:41:17.020Z] world/python-attrs                           20.3.0-3       0.37 MiB
[2020-12-19T12:41:17.020Z] galaxy/python-babel                          2.9.0-1       27.10 MiB
[2020-12-19T12:41:17.020Z] world/python-chardet                         3.0.4-7        1.11 MiB
[2020-12-19T12:41:17.020Z] world/python-idna                            2.10-3         0.61 MiB
[2020-12-19T12:41:17.020Z] galaxy/python-imagesize                      1.2.0-4        0.03 MiB
[2020-12-19T12:41:17.020Z] galaxy/python-importlib-metadata             3.3.0-1        0.08 MiB
[2020-12-19T12:41:17.020Z] galaxy/python-iniconfig                      1.1.1-1        0.02 MiB
[2020-12-19T12:41:17.020Z] galaxy/python-jinja                          2.11.2-4       1.61 MiB
[2020-12-19T12:41:17.020Z] world/python-markupsafe                      1.1.1-6        0.08 MiB
[2020-12-19T12:41:17.020Z] galaxy/python-more-itertools                 8.6.0-3        0.27 MiB
[2020-12-19T12:41:17.020Z] world/python-ordered-set                     4.0.2-3        0.06 MiB
[2020-12-19T12:41:17.020Z] world/python-packaging                       20.7-1         0.17 MiB
[2020-12-19T12:41:17.020Z] galaxy/python-pbr                            5.5.1-3        0.65 MiB
[2020-12-19T12:41:17.020Z] galaxy/python-pluggy                         0.13.1-4       0.12 MiB
[2020-12-19T12:41:17.020Z] galaxy/python-py                             1.9.0-3        0.72 MiB
[2020-12-19T12:41:17.020Z] galaxy/python-pygments                       2.7.3-1        9.71 MiB
[2020-12-19T12:41:17.020Z] world/python-pyparsing                       2.4.7-3        0.73 MiB
[2020-12-19T12:41:17.020Z] galaxy/python-pytest                         6.1.2-3        3.02 MiB
[2020-12-19T12:41:17.020Z] galaxy/python-pytz                           2020.4-4       0.14 MiB
[2020-12-19T12:41:17.020Z] world/python-requests                        2.25.1-1       0.44 MiB
[2020-12-19T12:41:17.020Z] galaxy/python-snowballstemmer                2.0.0-6        1.44 MiB
[2020-12-19T12:41:17.020Z] galaxy/python-sortedcontainers               2.3.0-3        0.33 MiB
[2020-12-19T12:41:17.020Z] galaxy/python-sphinx-alabaster-theme         0.7.12-6       0.04 MiB
[2020-12-19T12:41:17.020Z] galaxy/python-sphinxcontrib-applehelp        1.0.2-3        0.24 MiB
[2020-12-19T12:41:17.020Z] galaxy/python-sphinxcontrib-devhelp          1.0.2-3        0.12 MiB
[2020-12-19T12:41:17.020Z] galaxy/python-sphinxcontrib-htmlhelp         1.0.3-3        0.16 MiB
[2020-12-19T12:41:17.020Z] galaxy/python-sphinxcontrib-jsmath           1.0.1-6        0.01 MiB
[2020-12-19T12:41:17.021Z] galaxy/python-sphinxcontrib-qthelp           1.0.3-3        0.15 MiB
[2020-12-19T12:41:17.021Z] galaxy/python-sphinxcontrib-serializinghtml  1.1.4-3        0.12 MiB
[2020-12-19T12:41:17.021Z] galaxy/python-toml                           0.10.2-3       0.14 MiB
[2020-12-19T12:41:17.021Z] world/python-urllib3                         1.25.10-4      0.64 MiB
[2020-12-19T12:41:17.021Z] galaxy/python-zipp                           3.4.0-3        0.03 MiB
[2020-12-19T12:41:17.021Z] galaxy/python-docutils                       0.16-4         4.21 MiB
[2020-12-19T12:41:17.021Z] galaxy/python-hypothesis                     5.43.3-1       2.43 MiB
[2020-12-19T12:41:17.021Z] galaxy/python-mock                           3.0.5-5        0.21 MiB
[2020-12-19T12:41:17.021Z] galaxy/python-pytest-runner                  5.2-3          0.03 MiB
[2020-12-19T12:41:17.021Z] world/python-setuptools                      1:51.0.0-1     2.98 MiB
[2020-12-19T12:41:17.021Z] galaxy/python-sphinx                         3.3.1-3       15.09 MiB
[2020-12-19T12:41:17.021Z] 
[2020-12-19T12:41:17.021Z] Total Installed Size:  75.49 MiB
[2020-12-19T12:41:17.021Z] 
[2020-12-19T12:41:17.021Z] :: Proceed with installation? [Y/n] 
[2020-12-19T12:41:17.021Z] checking keyring...
[2020-12-19T12:41:17.021Z] checking package integrity...
[2020-12-19T12:41:18.882Z] loading package files...
[2020-12-19T12:41:18.882Z] checking for file conflicts...
[2020-12-19T12:41:18.882Z] checking available disk space...
[2020-12-19T12:41:18.882Z] :: Processing package changes...
[2020-12-19T12:41:18.882Z] installing python-appdirs...
[2020-12-19T12:41:18.882Z] installing python-pyparsing...
[2020-12-19T12:41:18.882Z] installing python-packaging...
[2020-12-19T12:41:18.882Z] installing python-ordered-set...
[2020-12-19T12:41:18.882Z] installing python-setuptools...
[2020-12-19T12:41:18.882Z] installing python-pytz...
[2020-12-19T12:41:18.882Z] installing python-babel...
[2020-12-19T12:41:19.132Z] installing python-docutils...
[2020-12-19T12:41:19.133Z] installing python-imagesize...
[2020-12-19T12:41:19.133Z] installing python-markupsafe...
[2020-12-19T12:41:19.133Z] installing python-jinja...
[2020-12-19T12:41:19.133Z] Optional dependencies for python-jinja
[2020-12-19T12:41:19.133Z]     python-babel: for i18n support [installed]
[2020-12-19T12:41:19.133Z] installing python-pygments...
[2020-12-19T12:41:19.133Z] installing python-urllib3...
[2020-12-19T12:41:19.133Z] Optional dependencies for python-urllib3
[2020-12-19T12:41:19.133Z]     python-pysocks: SOCKS support
[2020-12-19T12:41:19.133Z]     python-brotli: Brotli support
[2020-12-19T12:41:19.133Z]     python-pyopenssl: security support
[2020-12-19T12:41:19.133Z] installing python-chardet...
[2020-12-19T12:41:19.383Z] installing python-idna...
[2020-12-19T12:41:19.383Z] installing python-requests...
[2020-12-19T12:41:19.383Z] Optional dependencies for python-requests
[2020-12-19T12:41:19.383Z]     python-pysocks: SOCKS proxy support
[2020-12-19T12:41:19.383Z] installing python-snowballstemmer...
[2020-12-19T12:41:19.383Z] Optional dependencies for python-snowballstemmer
[2020-12-19T12:41:19.383Z]     python-pystemmer: for improved performance
[2020-12-19T12:41:19.383Z] installing python-sphinx-alabaster-theme...
[2020-12-19T12:41:19.383Z] installing python-sphinxcontrib-applehelp...
[2020-12-19T12:41:19.383Z] installing python-sphinxcontrib-devhelp...
[2020-12-19T12:41:19.383Z] installing python-sphinxcontrib-htmlhelp...
[2020-12-19T12:41:19.383Z] installing python-sphinxcontrib-jsmath...
[2020-12-19T12:41:19.383Z] installing python-sphinxcontrib-qthelp...
[2020-12-19T12:41:19.383Z] installing python-sphinxcontrib-serializinghtml...
[2020-12-19T12:41:19.383Z] installing python-sphinx...
[2020-12-19T12:41:19.383Z] Optional dependencies for python-sphinx
[2020-12-19T12:41:19.383Z]     imagemagick: for ext.imgconverter
[2020-12-19T12:41:19.383Z]     texlive-latexextra: for generation of PDF documentation
[2020-12-19T12:41:19.383Z] installing python-pbr...
[2020-12-19T12:41:19.383Z] installing python-mock...
[2020-12-19T12:41:19.383Z] installing python-attrs...
[2020-12-19T12:41:19.383Z] installing python-iniconfig...
[2020-12-19T12:41:19.383Z] installing python-more-itertools...
[2020-12-19T12:41:19.383Z] installing python-zipp...
[2020-12-19T12:41:19.383Z] installing python-importlib-metadata...
[2020-12-19T12:41:19.383Z] installing python-pluggy...
[2020-12-19T12:41:19.383Z] installing python-apipkg...
[2020-12-19T12:41:19.383Z] installing python-py...
[2020-12-19T12:41:19.383Z] installing python-toml...
[2020-12-19T12:41:19.383Z] installing python-pytest...
[2020-12-19T12:41:19.383Z] installing python-pytest-runner...
[2020-12-19T12:41:19.383Z] installing python-sortedcontainers...
[2020-12-19T12:41:19.383Z] installing python-hypothesis...
[2020-12-19T12:41:19.383Z] Optional dependencies for python-hypothesis
[2020-12-19T12:41:19.383Z]     python-pytz: for datetime and django module [installed]
[2020-12-19T12:41:19.383Z]     python-faker: for fakefactory and django module
[2020-12-19T12:41:19.383Z]     python-django: for django module
[2020-12-19T12:41:19.383Z]     python-numpy: for numpy module
[2020-12-19T12:41:19.383Z]     python-pytest: for pytest module [installed]
[2020-12-19T12:41:19.383Z]     python-lark-parser: for lark module
[2020-12-19T12:41:19.634Z] ==> Retrieving sources...
[2020-12-19T12:41:19.634Z]   -> Found pyudev-0.22.tar.gz
[2020-12-19T12:41:19.634Z] ==> WARNING: Skipping all source file integrity checks.
[2020-12-19T12:41:19.634Z] ==> Extracting sources...
[2020-12-19T12:41:19.634Z]   -> Extracting pyudev-0.22.tar.gz with bsdtar
[2020-12-19T12:41:19.634Z] ==> Starting prepare()...
[2020-12-19T12:41:19.634Z] ==> Starting build()...
[2020-12-19T12:41:19.884Z] running build
[2020-12-19T12:41:19.884Z] running build_py
[2020-12-19T12:41:19.884Z] creating build
[2020-12-19T12:41:19.884Z] creating build/lib
[2020-12-19T12:41:19.884Z] creating build/lib/pyudev
[2020-12-19T12:41:19.884Z] copying src/pyudev/__init__.py -> build/lib/pyudev
[2020-12-19T12:41:19.884Z] copying src/pyudev/_compat.py -> build/lib/pyudev
[2020-12-19T12:41:19.884Z] copying src/pyudev/core.py -> build/lib/pyudev
[2020-12-19T12:41:19.884Z] copying src/pyudev/glib.py -> build/lib/pyudev
[2020-12-19T12:41:19.884Z] copying src/pyudev/pyside.py -> build/lib/pyudev
[2020-12-19T12:41:19.884Z] copying src/pyudev/discover.py -> build/lib/pyudev
[2020-12-19T12:41:19.884Z] copying src/pyudev/_qt_base.py -> build/lib/pyudev
[2020-12-19T12:41:19.884Z] copying src/pyudev/_errors.py -> build/lib/pyudev
[2020-12-19T12:41:19.884Z] copying src/pyudev/_util.py -> build/lib/pyudev
[2020-12-19T12:41:19.884Z] copying src/pyudev/wx.py -> build/lib/pyudev
[2020-12-19T12:41:19.884Z] copying src/pyudev/pyqt5.py -> build/lib/pyudev
[2020-12-19T12:41:19.884Z] copying src/pyudev/version.py -> build/lib/pyudev
[2020-12-19T12:41:19.884Z] copying src/pyudev/pyqt4.py -> build/lib/pyudev
[2020-12-19T12:41:19.884Z] copying src/pyudev/monitor.py -> build/lib/pyudev
[2020-12-19T12:41:19.884Z] creating build/lib/pyudev/_ctypeslib
[2020-12-19T12:41:19.884Z] copying src/pyudev/_ctypeslib/libudev.py -> build/lib/pyudev/_ctypeslib
[2020-12-19T12:41:19.884Z] copying src/pyudev/_ctypeslib/__init__.py -> build/lib/pyudev/_ctypeslib
[2020-12-19T12:41:19.884Z] copying src/pyudev/_ctypeslib/libc.py -> build/lib/pyudev/_ctypeslib
[2020-12-19T12:41:19.884Z] copying src/pyudev/_ctypeslib/utils.py -> build/lib/pyudev/_ctypeslib
[2020-12-19T12:41:19.884Z] copying src/pyudev/_ctypeslib/_errorcheckers.py -> build/lib/pyudev/_ctypeslib
[2020-12-19T12:41:19.884Z] creating build/lib/pyudev/_os
[2020-12-19T12:41:19.884Z] copying src/pyudev/_os/__init__.py -> build/lib/pyudev/_os
[2020-12-19T12:41:19.884Z] copying src/pyudev/_os/pipe.py -> build/lib/pyudev/_os
[2020-12-19T12:41:19.884Z] copying src/pyudev/_os/poll.py -> build/lib/pyudev/_os
[2020-12-19T12:41:19.884Z] creating build/lib/pyudev/device
[2020-12-19T12:41:19.884Z] copying src/pyudev/device/__init__.py -> build/lib/pyudev/device
[2020-12-19T12:41:19.884Z] copying src/pyudev/device/_device.py -> build/lib/pyudev/device
[2020-12-19T12:41:20.435Z] Creating file doc/pyudev.rst.
[2020-12-19T12:41:20.435Z] Creating file doc/pyudev.core.rst.
[2020-12-19T12:41:20.435Z] Creating file doc/pyudev.discover.rst.
[2020-12-19T12:41:20.435Z] Creating file doc/pyudev.glib.rst.
[2020-12-19T12:41:20.435Z] Creating file doc/pyudev.monitor.rst.
[2020-12-19T12:41:20.435Z] Creating file doc/pyudev.pyqt4.rst.
[2020-12-19T12:41:20.435Z] Creating file doc/pyudev.pyqt5.rst.
[2020-12-19T12:41:20.435Z] Creating file doc/pyudev.pyside.rst.
[2020-12-19T12:41:20.435Z] Creating file doc/pyudev.version.rst.
[2020-12-19T12:41:20.435Z] Creating file doc/pyudev.wx.rst.
[2020-12-19T12:41:20.435Z] Creating file doc/pyudev.device.rst.
[2020-12-19T12:41:20.435Z] Creating file doc/modules.rst.
[2020-12-19T12:41:20.685Z] Running Sphinx v3.3.1
[2020-12-19T12:41:20.936Z] making output directory... done
[2020-12-19T12:41:20.936Z] loading intersphinx inventory from http://docs.python.org/objects.inv...
[2020-12-19T12:41:20.936Z] loading intersphinx inventory from http://pytest.org/latest/objects.inv...
[2020-12-19T12:41:20.936Z] intersphinx inventory has moved: http://docs.python.org/objects.inv -> https://docs.python.org/3/objects.inv
[2020-12-19T12:41:22.279Z] intersphinx inventory has moved: http://pytest.org/latest/objects.inv -> https://docs.pytest.org/en/stable/objects.inv
[2020-12-19T12:41:22.279Z] building [mo]: all of 0 po files
[2020-12-19T12:41:22.279Z] building [html]: all source files
[2020-12-19T12:41:22.279Z] updating environment: [new config] 29 added, 0 changed, 0 removed
[2020-12-19T12:41:22.279Z] reading sources... [  3%] api/index
[2020-12-19T12:41:22.279Z] reading sources... [  6%] api/pyudev
[2020-12-19T12:41:23.190Z] reading sources... [ 10%] api/pyudev.glib
[2020-12-19T12:41:23.190Z] reading sources... [ 13%] api/pyudev.pyqt4
[2020-12-19T12:41:23.190Z] reading sources... [ 17%] api/pyudev.pyqt5
[2020-12-19T12:41:23.190Z] reading sources... [ 20%] api/pyudev.pyside
[2020-12-19T12:41:23.190Z] reading sources... [ 24%] api/pyudev.wx
[2020-12-19T12:41:23.190Z] reading sources... [ 27%] changes
[2020-12-19T12:41:23.190Z] reading sources... [ 31%] contribute
[2020-12-19T12:41:23.190Z] reading sources... [ 34%] endorsements
[2020-12-19T12:41:23.190Z] reading sources... [ 37%] guide
[2020-12-19T12:41:23.440Z] reading sources... [ 41%] index
[2020-12-19T12:41:23.440Z] reading sources... [ 44%] install
[2020-12-19T12:41:23.440Z] reading sources... [ 48%] licencing
[2020-12-19T12:41:23.440Z] reading sources... [ 51%] modules
[2020-12-19T12:41:23.440Z] reading sources... [ 55%] pyudev
[2020-12-19T12:41:23.440Z] reading sources... [ 58%] pyudev.core
[2020-12-19T12:41:23.440Z] reading sources... [ 62%] pyudev.device
[2020-12-19T12:41:23.440Z] reading sources... [ 65%] pyudev.discover
[2020-12-19T12:41:23.690Z] reading sources... [ 68%] pyudev.glib
[2020-12-19T12:41:23.690Z] reading sources... [ 72%] pyudev.monitor
[2020-12-19T12:41:23.941Z] reading sources... [ 75%] pyudev.pyqt4
[2020-12-19T12:41:23.941Z] reading sources... [ 79%] pyudev.pyqt5
[2020-12-19T12:41:23.941Z] reading sources... [ 82%] pyudev.pyside
[2020-12-19T12:41:23.941Z] reading sources... [ 86%] pyudev.version
[2020-12-19T12:41:23.941Z] reading sources... [ 89%] pyudev.wx
[2020-12-19T12:41:24.191Z] reading sources... [ 93%] tests/index
[2020-12-19T12:41:24.191Z] reading sources... [ 96%] tests/plugins
[2020-12-19T12:41:24.191Z] reading sources... [100%] tests/running
[2020-12-19T12:41:24.191Z] 
[2020-12-19T12:41:24.191Z] /build/python-pyudev/src/pyudev-0.22/doc/api/index.rst.rst:7: WARNING: autosummary: failed to import pyudev.pyqt4
[2020-12-19T12:41:24.191Z] /build/python-pyudev/src/pyudev-0.22/doc/api/index.rst.rst:7: WARNING: autosummary: failed to import pyudev.pyqt5
[2020-12-19T12:41:24.191Z] /build/python-pyudev/src/pyudev-0.22/doc/api/index.rst.rst:7: WARNING: autosummary: failed to import pyudev.pyside
[2020-12-19T12:41:24.191Z] WARNING: autodoc: failed to import method 'Attributes.__iter__' from module 'pyudev'; the following exception was raised:
[2020-12-19T12:41:24.191Z] Traceback (most recent call last):
[2020-12-19T12:41:24.191Z]   File "/usr/lib/python3.9/site-packages/sphinx/util/inspect.py", line 334, in safe_getattr
[2020-12-19T12:41:24.191Z]     return getattr(obj, name, *defargs)
[2020-12-19T12:41:24.192Z] AttributeError: type object 'Attributes' has no attribute '__iter__'
[2020-12-19T12:41:24.192Z] 
[2020-12-19T12:41:24.192Z] The above exception was the direct cause of the following exception:
[2020-12-19T12:41:24.192Z] 
[2020-12-19T12:41:24.192Z] Traceback (most recent call last):
[2020-12-19T12:41:24.192Z]   File "/usr/lib/python3.9/site-packages/sphinx/ext/autodoc/importer.py", line 106, in import_object
[2020-12-19T12:41:24.192Z]     obj = attrgetter(obj, mangled_name)
[2020-12-19T12:41:24.192Z]   File "/usr/lib/python3.9/site-packages/sphinx/ext/autodoc/__init__.py", line 292, in get_attr
[2020-12-19T12:41:24.192Z]     return autodoc_attrgetter(self.env.app, obj, name, *defargs)
[2020-12-19T12:41:24.192Z]   File "/usr/lib/python3.9/site-packages/sphinx/ext/autodoc/__init__.py", line 2242, in autodoc_attrgetter
[2020-12-19T12:41:24.192Z]     return safe_getattr(obj, name, *defargs)
[2020-12-19T12:41:24.192Z]   File "/usr/lib/python3.9/site-packages/sphinx/util/inspect.py", line 350, in safe_getattr
[2020-12-19T12:41:24.192Z]     raise AttributeError(name) from exc
[2020-12-19T12:41:24.192Z] AttributeError: __iter__
[2020-12-19T12:41:24.192Z] 
[2020-12-19T12:41:24.192Z] WARNING: autodoc: failed to import method 'Attributes.__len__' from module 'pyudev'; the following exception was raised:
[2020-12-19T12:41:24.192Z] Traceback (most recent call last):
[2020-12-19T12:41:24.192Z]   File "/usr/lib/python3.9/site-packages/sphinx/util/inspect.py", line 334, in safe_getattr
[2020-12-19T12:41:24.192Z]     return getattr(obj, name, *defargs)
[2020-12-19T12:41:24.192Z] AttributeError: type object 'Attributes' has no attribute '__len__'
[2020-12-19T12:41:24.192Z] 
[2020-12-19T12:41:24.192Z] The above exception was the direct cause of the following exception:
[2020-12-19T12:41:24.192Z] 
[2020-12-19T12:41:24.192Z] Traceback (most recent call last):
[2020-12-19T12:41:24.192Z]   File "/usr/lib/python3.9/site-packages/sphinx/ext/autodoc/importer.py", line 106, in import_object
[2020-12-19T12:41:24.192Z]     obj = attrgetter(obj, mangled_name)
[2020-12-19T12:41:24.192Z]   File "/usr/lib/python3.9/site-packages/sphinx/ext/autodoc/__init__.py", line 292, in get_attr
[2020-12-19T12:41:24.192Z]     return autodoc_attrgetter(self.env.app, obj, name, *defargs)
[2020-12-19T12:41:24.192Z]   File "/usr/lib/python3.9/site-packages/sphinx/ext/autodoc/__init__.py", line 2242, in autodoc_attrgetter
[2020-12-19T12:41:24.192Z]     return safe_getattr(obj, name, *defargs)
[2020-12-19T12:41:24.192Z]   File "/usr/lib/python3.9/site-packages/sphinx/util/inspect.py", line 350, in safe_getattr
[2020-12-19T12:41:24.192Z]     raise AttributeError(name) from exc
[2020-12-19T12:41:24.192Z] AttributeError: __len__
[2020-12-19T12:41:24.192Z] 
[2020-12-19T12:41:24.192Z] WARNING: autodoc: failed to import method 'Attributes.__getitem__' from module 'pyudev'; the following exception was raised:
[2020-12-19T12:41:24.192Z] Traceback (most recent call last):
[2020-12-19T12:41:24.192Z]   File "/usr/lib/python3.9/site-packages/sphinx/util/inspect.py", line 334, in safe_getattr
[2020-12-19T12:41:24.192Z]     return getattr(obj, name, *defargs)
[2020-12-19T12:41:24.192Z] AttributeError: type object 'Attributes' has no attribute '__getitem__'
[2020-12-19T12:41:24.192Z] 
[2020-12-19T12:41:24.192Z] The above exception was the direct cause of the following exception:
[2020-12-19T12:41:24.192Z] 
[2020-12-19T12:41:24.192Z] Traceback (most recent call last):
[2020-12-19T12:41:24.192Z]   File "/usr/lib/python3.9/site-packages/sphinx/ext/autodoc/importer.py", line 106, in import_object
[2020-12-19T12:41:24.192Z]     obj = attrgetter(obj, mangled_name)
[2020-12-19T12:41:24.192Z]   File "/usr/lib/python3.9/site-packages/sphinx/ext/autodoc/__init__.py", line 292, in get_attr
[2020-12-19T12:41:24.192Z]     return autodoc_attrgetter(self.env.app, obj, name, *defargs)
[2020-12-19T12:41:24.192Z]   File "/usr/lib/python3.9/site-packages/sphinx/ext/autodoc/__init__.py", line 2242, in autodoc_attrgetter
[2020-12-19T12:41:24.192Z]     return safe_getattr(obj, name, *defargs)
[2020-12-19T12:41:24.192Z]   File "/usr/lib/python3.9/site-packages/sphinx/util/inspect.py", line 350, in safe_getattr
[2020-12-19T12:41:24.192Z]     raise AttributeError(name) from exc
[2020-12-19T12:41:24.192Z] AttributeError: __getitem__
[2020-12-19T12:41:24.192Z] 
[2020-12-19T12:41:24.192Z] WARNING: autodoc: failed to import module 'pyqt4' from module 'pyudev'; the following exception was raised:
[2020-12-19T12:41:24.192Z] Traceback (most recent call last):
[2020-12-19T12:41:24.192Z]   File "/usr/lib/python3.9/site-packages/sphinx/ext/autodoc/importer.py", line 66, in import_module
[2020-12-19T12:41:24.192Z]     return importlib.import_module(modname)
[2020-12-19T12:41:24.192Z]   File "/usr/lib/python3.9/importlib/__init__.py", line 127, in import_module
[2020-12-19T12:41:24.192Z]     return _bootstrap._gcd_import(name[level:], package, level)
[2020-12-19T12:41:24.192Z]   File "<frozen importlib._bootstrap>", line 1030, in _gcd_import
[2020-12-19T12:41:24.192Z]   File "<frozen importlib._bootstrap>", line 1007, in _find_and_load
[2020-12-19T12:41:24.192Z]   File "<frozen importlib._bootstrap>", line 986, in _find_and_load_unlocked
[2020-12-19T12:41:24.192Z]   File "<frozen importlib._bootstrap>", line 680, in _load_unlocked
[2020-12-19T12:41:24.192Z]   File "<frozen importlib._bootstrap_external>", line 790, in exec_module
[2020-12-19T12:41:24.192Z]   File "<frozen importlib._bootstrap>", line 228, in _call_with_frames_removed
[2020-12-19T12:41:24.192Z]   File "/build/python-pyudev/src/pyudev-0.22/src/pyudev/pyqt4.py", line 48, in <module>
[2020-12-19T12:41:24.192Z]     QtCore.QObject, QtCore.pyqtSignal, QtCore.QSocketNotifier)
[2020-12-19T12:41:24.192Z] AttributeError: type object 'Mock' has no attribute 'QObject'
[2020-12-19T12:41:24.192Z] 
[2020-12-19T12:41:24.192Z] WARNING: don't know which module to import for autodocumenting 'MonitorObserver' (try placing a "module" or "currentmodule" directive in the document, or giving an explicit module name)
[2020-12-19T12:41:24.192Z] WARNING: don't know which module to import for autodocumenting 'QUDevMonitorObserver' (try placing a "module" or "currentmodule" directive in the document, or giving an explicit module name)
[2020-12-19T12:41:24.192Z] /build/python-pyudev/src/pyudev-0.22/doc/api/pyudev.pyqt4.rst:2: WARNING: Unknown target name: "pyqt4".
[2020-12-19T12:41:24.193Z] WARNING: autodoc: failed to import module 'pyqt5' from module 'pyudev'; the following exception was raised:
[2020-12-19T12:41:24.193Z] Traceback (most recent call last):
[2020-12-19T12:41:24.193Z]   File "/usr/lib/python3.9/site-packages/sphinx/ext/autodoc/importer.py", line 66, in import_module
[2020-12-19T12:41:24.193Z]     return importlib.import_module(modname)
[2020-12-19T12:41:24.193Z]   File "/usr/lib/python3.9/importlib/__init__.py", line 127, in import_module
[2020-12-19T12:41:24.193Z]     return _bootstrap._gcd_import(name[level:], package, level)
[2020-12-19T12:41:24.193Z]   File "<frozen importlib._bootstrap>", line 1030, in _gcd_import
[2020-12-19T12:41:24.193Z]   File "<frozen importlib._bootstrap>", line 1007, in _find_and_load
[2020-12-19T12:41:24.193Z]   File "<frozen importlib._bootstrap>", line 986, in _find_and_load_unlocked
[2020-12-19T12:41:24.193Z]   File "<frozen importlib._bootstrap>", line 680, in _load_unlocked
[2020-12-19T12:41:24.193Z]   File "<frozen importlib._bootstrap_external>", line 790, in exec_module
[2020-12-19T12:41:24.193Z]   File "<frozen importlib._bootstrap>", line 228, in _call_with_frames_removed
[2020-12-19T12:41:24.193Z]   File "/build/python-pyudev/src/pyudev-0.22/src/pyudev/pyqt5.py", line 43, in <module>
[2020-12-19T12:41:24.193Z]     QtCore.QObject, QtCore.pyqtSignal, QtCore.QSocketNotifier)
[2020-12-19T12:41:24.193Z] AttributeError: type object 'Mock' has no attribute 'QObject'
[2020-12-19T12:41:24.193Z] 
[2020-12-19T12:41:24.193Z] WARNING: don't know which module to import for autodocumenting 'MonitorObserver' (try placing a "module" or "currentmodule" directive in the document, or giving an explicit module name)
[2020-12-19T12:41:24.193Z] WARNING: autodoc: failed to import module 'pyside' from module 'pyudev'; the following exception was raised:
[2020-12-19T12:41:24.193Z] Traceback (most recent call last):
[2020-12-19T12:41:24.193Z]   File "/usr/lib/python3.9/site-packages/sphinx/ext/autodoc/importer.py", line 66, in import_module
[2020-12-19T12:41:24.193Z]     return importlib.import_module(modname)
[2020-12-19T12:41:24.193Z]   File "/usr/lib/python3.9/importlib/__init__.py", line 127, in import_module
[2020-12-19T12:41:24.193Z]     return _bootstrap._gcd_import(name[level:], package, level)
[2020-12-19T12:41:24.193Z]   File "<frozen importlib._bootstrap>", line 1030, in _gcd_import
[2020-12-19T12:41:24.193Z]   File "<frozen importlib._bootstrap>", line 1007, in _find_and_load
[2020-12-19T12:41:24.193Z]   File "<frozen importlib._bootstrap>", line 986, in _find_and_load_unlocked
[2020-12-19T12:41:24.193Z]   File "<frozen importlib._bootstrap>", line 680, in _load_unlocked
[2020-12-19T12:41:24.193Z]   File "<frozen importlib._bootstrap_external>", line 790, in exec_module
[2020-12-19T12:41:24.193Z]   File "<frozen importlib._bootstrap>", line 228, in _call_with_frames_removed
[2020-12-19T12:41:24.193Z]   File "/build/python-pyudev/src/pyudev-0.22/src/pyudev/pyside.py", line 49, in <module>
[2020-12-19T12:41:24.193Z]     QtCore.QObject, QtCore.Signal, QtCore.QSocketNotifier)
[2020-12-19T12:41:24.193Z] AttributeError: type object 'Mock' has no attribute 'QObject'
[2020-12-19T12:41:24.193Z] 
[2020-12-19T12:41:24.193Z] WARNING: don't know which module to import for autodocumenting 'MonitorObserver' (try placing a "module" or "currentmodule" directive in the document, or giving an explicit module name)
[2020-12-19T12:41:24.193Z] WARNING: don't know which module to import for autodocumenting 'QUDevMonitorObserver' (try placing a "module" or "currentmodule" directive in the document, or giving an explicit module name)
[2020-12-19T12:41:24.193Z] /build/python-pyudev/src/pyudev-0.22/doc/api/pyudev.pyside.rst:2: WARNING: Unknown target name: "pyside".
[2020-12-19T12:41:24.193Z] CHANGES.rst:38: WARNING: Title underline too short.
[2020-12-19T12:41:24.193Z] 
[2020-12-19T12:41:24.193Z] 0.19.0 (Feb 3, 2016)
[2020-12-19T12:41:24.193Z] ==================
[2020-12-19T12:41:24.193Z] CHANGES.rst:38: WARNING: Title underline too short.
[2020-12-19T12:41:24.193Z] 
[2020-12-19T12:41:24.193Z] 0.19.0 (Feb 3, 2016)
[2020-12-19T12:41:24.193Z] ==================
[2020-12-19T12:41:24.193Z] /build/python-pyudev/src/pyudev-0.22/src/pyudev/__init__.py:docstring of pyudev:1: WARNING: duplicate object description of pyudev, other instance in api/pyudev, use :noindex: for one of them
[2020-12-19T12:41:24.193Z] /build/python-pyudev/src/pyudev-0.22/src/pyudev/glib.py:docstring of pyudev.glib:1: WARNING: duplicate object description of pyudev.glib, other instance in api/pyudev.glib, use :noindex: for one of them
[2020-12-19T12:41:24.193Z] /build/python-pyudev/src/pyudev-0.22/src/pyudev/glib.py:docstring of pyudev.glib.GUDevMonitorObserver:1: WARNING: duplicate object description of pyudev.glib.GUDevMonitorObserver, other instance in api/pyudev.glib, use :noindex: for one of them
[2020-12-19T12:41:24.193Z] /build/python-pyudev/src/pyudev-0.22/src/pyudev/glib.py:docstring of pyudev.glib.MonitorObserver:1: WARNING: duplicate object description of pyudev.glib.MonitorObserver, other instance in api/pyudev.glib, use :noindex: for one of them
[2020-12-19T12:41:24.193Z] WARNING: autodoc: failed to import module 'pyqt4' from module 'pyudev'; the following exception was raised:
[2020-12-19T12:41:24.193Z] Traceback (most recent call last):
[2020-12-19T12:41:24.193Z]   File "/usr/lib/python3.9/site-packages/sphinx/ext/autodoc/importer.py", line 66, in import_module
[2020-12-19T12:41:24.193Z]     return importlib.import_module(modname)
[2020-12-19T12:41:24.193Z]   File "/usr/lib/python3.9/importlib/__init__.py", line 127, in import_module
[2020-12-19T12:41:24.193Z]     return _bootstrap._gcd_import(name[level:], package, level)
[2020-12-19T12:41:24.193Z]   File "<frozen importlib._bootstrap>", line 1030, in _gcd_import
[2020-12-19T12:41:24.193Z]   File "<frozen importlib._bootstrap>", line 1007, in _find_and_load
[2020-12-19T12:41:24.193Z]   File "<frozen importlib._bootstrap>", line 986, in _find_and_load_unlocked
[2020-12-19T12:41:24.193Z]   File "<frozen importlib._bootstrap>", line 680, in _load_unlocked
[2020-12-19T12:41:24.193Z]   File "<frozen importlib._bootstrap_external>", line 790, in exec_module
[2020-12-19T12:41:24.194Z]   File "<frozen importlib._bootstrap>", line 228, in _call_with_frames_removed
[2020-12-19T12:41:24.194Z]   File "/build/python-pyudev/src/pyudev-0.22/src/pyudev/pyqt4.py", line 48, in <module>
[2020-12-19T12:41:24.194Z]     QtCore.QObject, QtCore.pyqtSignal, QtCore.QSocketNotifier)
[2020-12-19T12:41:24.194Z] AttributeError: type object 'Mock' has no attribute 'QObject'
[2020-12-19T12:41:24.194Z] 
[2020-12-19T12:41:24.194Z] WARNING: autodoc: failed to import module 'pyqt5' from module 'pyudev'; the following exception was raised:
[2020-12-19T12:41:24.194Z] Traceback (most recent call last):
[2020-12-19T12:41:24.194Z]   File "/usr/lib/python3.9/site-packages/sphinx/ext/autodoc/importer.py", line 66, in import_module
[2020-12-19T12:41:24.194Z]     return importlib.import_module(modname)
[2020-12-19T12:41:24.194Z]   File "/usr/lib/python3.9/importlib/__init__.py", line 127, in import_module
[2020-12-19T12:41:24.194Z]     return _bootstrap._gcd_import(name[level:], package, level)
[2020-12-19T12:41:24.194Z]   File "<frozen importlib._bootstrap>", line 1030, in _gcd_import
[2020-12-19T12:41:24.194Z]   File "<frozen importlib._bootstrap>", line 1007, in _find_and_load
[2020-12-19T12:41:24.194Z]   File "<frozen importlib._bootstrap>", line 986, in _find_and_load_unlocked
[2020-12-19T12:41:24.194Z]   File "<frozen importlib._bootstrap>", line 680, in _load_unlocked
[2020-12-19T12:41:24.194Z]   File "<frozen importlib._bootstrap_external>", line 790, in exec_module
[2020-12-19T12:41:24.194Z]   File "<frozen importlib._bootstrap>", line 228, in _call_with_frames_removed
[2020-12-19T12:41:24.194Z]   File "/build/python-pyudev/src/pyudev-0.22/src/pyudev/pyqt5.py", line 43, in <module>
[2020-12-19T12:41:24.194Z]     QtCore.QObject, QtCore.pyqtSignal, QtCore.QSocketNotifier)
[2020-12-19T12:41:24.194Z] AttributeError: type object 'Mock' has no attribute 'QObject'
[2020-12-19T12:41:24.194Z] 
[2020-12-19T12:41:24.194Z] WARNING: autodoc: failed to import module 'pyside' from module 'pyudev'; the following exception was raised:
[2020-12-19T12:41:24.194Z] Traceback (most recent call last):
[2020-12-19T12:41:24.194Z]   File "/usr/lib/python3.9/site-packages/sphinx/ext/autodoc/importer.py", line 66, in import_module
[2020-12-19T12:41:24.194Z]     return importlib.import_module(modname)
[2020-12-19T12:41:24.194Z]   File "/usr/lib/python3.9/importlib/__init__.py", line 127, in import_module
[2020-12-19T12:41:24.194Z]     return _bootstrap._gcd_import(name[level:], package, level)
[2020-12-19T12:41:24.194Z]   File "<frozen importlib._bootstrap>", line 1030, in _gcd_import
[2020-12-19T12:41:24.194Z]   File "<frozen importlib._bootstrap>", line 1007, in _find_and_load
[2020-12-19T12:41:24.194Z]   File "<frozen importlib._bootstrap>", line 986, in _find_and_load_unlocked
[2020-12-19T12:41:24.194Z]   File "<frozen importlib._bootstrap>", line 680, in _load_unlocked
[2020-12-19T12:41:24.194Z]   File "<frozen importlib._bootstrap_external>", line 790, in exec_module
[2020-12-19T12:41:24.194Z]   File "<frozen importlib._bootstrap>", line 228, in _call_with_frames_removed
[2020-12-19T12:41:24.194Z]   File "/build/python-pyudev/src/pyudev-0.22/src/pyudev/pyside.py", line 49, in <module>
[2020-12-19T12:41:24.194Z]     QtCore.QObject, QtCore.Signal, QtCore.QSocketNotifier)
[2020-12-19T12:41:24.194Z] AttributeError: type object 'Mock' has no attribute 'QObject'
[2020-12-19T12:41:24.194Z] 
[2020-12-19T12:41:24.194Z] /build/python-pyudev/src/pyudev-0.22/src/pyudev/wx.py:docstring of pyudev.wx:1: WARNING: duplicate object description of pyudev.wx, other instance in api/pyudev.wx, use :noindex: for one of them
[2020-12-19T12:41:24.194Z] /build/python-pyudev/src/pyudev-0.22/src/pyudev/wx.py:docstring of pyudev.wx.MonitorObserver:1: WARNING: duplicate object description of pyudev.wx.MonitorObserver, other instance in api/pyudev.wx, use :noindex: for one of them
[2020-12-19T12:41:24.194Z] /build/python-pyudev/src/pyudev-0.22/src/pyudev/wx.py:docstring of pyudev.wx.MonitorObserver.enabled:1: WARNING: duplicate object description of pyudev.wx.MonitorObserver.enabled, other instance in api/pyudev.wx, use :noindex: for one of them
[2020-12-19T12:41:24.194Z] /build/python-pyudev/src/pyudev-0.22/src/pyudev/wx.py:docstring of pyudev.wx.WxUDevMonitorObserver:1: WARNING: duplicate object description of pyudev.wx.WxUDevMonitorObserver, other instance in api/pyudev.wx, use :noindex: for one of them
[2020-12-19T12:41:24.194Z] WARNING: autodoc: failed to import function 'load_dummy' from module 'plugins'; the following exception was raised:
[2020-12-19T12:41:24.194Z] Traceback (most recent call last):
[2020-12-19T12:41:24.194Z]   File "/usr/lib/python3.9/site-packages/sphinx/util/inspect.py", line 334, in safe_getattr
[2020-12-19T12:41:24.194Z]     return getattr(obj, name, *defargs)
[2020-12-19T12:41:24.194Z] AttributeError: module 'plugins' has no attribute 'load_dummy'
[2020-12-19T12:41:24.194Z] 
[2020-12-19T12:41:24.194Z] The above exception was the direct cause of the following exception:
[2020-12-19T12:41:24.194Z] 
[2020-12-19T12:41:24.194Z] Traceback (most recent call last):
[2020-12-19T12:41:24.194Z]   File "/usr/lib/python3.9/site-packages/sphinx/ext/autodoc/importer.py", line 106, in import_object
[2020-12-19T12:41:24.194Z]     obj = attrgetter(obj, mangled_name)
[2020-12-19T12:41:24.194Z]   File "/usr/lib/python3.9/site-packages/sphinx/ext/autodoc/__init__.py", line 292, in get_attr
[2020-12-19T12:41:24.194Z]     return autodoc_attrgetter(self.env.app, obj, name, *defargs)
[2020-12-19T12:41:24.194Z]   File "/usr/lib/python3.9/site-packages/sphinx/ext/autodoc/__init__.py", line 2242, in autodoc_attrgetter
[2020-12-19T12:41:24.194Z]     return safe_getattr(obj, name, *defargs)
[2020-12-19T12:41:24.194Z]   File "/usr/lib/python3.9/site-packages/sphinx/util/inspect.py", line 350, in safe_getattr
[2020-12-19T12:41:24.194Z]     raise AttributeError(name) from exc
[2020-12-19T12:41:24.194Z] AttributeError: load_dummy
[2020-12-19T12:41:24.194Z] 
[2020-12-19T12:41:24.194Z] WARNING: autodoc: failed to import function 'unload_dummy' from module 'plugins'; the following exception was raised:
[2020-12-19T12:41:24.194Z] Traceback (most recent call last):
[2020-12-19T12:41:24.194Z]   File "/usr/lib/python3.9/site-packages/sphinx/util/inspect.py", line 334, in safe_getattr
[2020-12-19T12:41:24.194Z]     return getattr(obj, name, *defargs)
[2020-12-19T12:41:24.195Z] AttributeError: module 'plugins' has no attribute 'unload_dummy'
[2020-12-19T12:41:24.195Z] 
[2020-12-19T12:41:24.195Z] The above exception was the direct cause of the following exception:
[2020-12-19T12:41:24.195Z] 
[2020-12-19T12:41:24.195Z] Traceback (most recent call last):
[2020-12-19T12:41:24.195Z]   File "/usr/lib/python3.9/site-packages/sphinx/ext/autodoc/importer.py", line 106, in import_object
[2020-12-19T12:41:24.195Z]     obj = attrgetter(obj, mangled_name)
[2020-12-19T12:41:24.195Z]   File "/usr/lib/python3.9/site-packages/sphinx/ext/autodoc/__init__.py", line 292, in get_attr
[2020-12-19T12:41:24.195Z]     return autodoc_attrgetter(self.env.app, obj, name, *defargs)
[2020-12-19T12:41:24.195Z]   File "/usr/lib/python3.9/site-packages/sphinx/ext/autodoc/__init__.py", line 2242, in autodoc_attrgetter
[2020-12-19T12:41:24.195Z]     return safe_getattr(obj, name, *defargs)
[2020-12-19T12:41:24.195Z]   File "/usr/lib/python3.9/site-packages/sphinx/util/inspect.py", line 350, in safe_getattr
[2020-12-19T12:41:24.195Z]     raise AttributeError(name) from exc
[2020-12-19T12:41:24.195Z] AttributeError: unload_dummy
[2020-12-19T12:41:24.195Z] 
[2020-12-19T12:41:24.195Z] /build/python-pyudev/src/pyudev-0.22/doc/tests/running.rst:6: WARNING: Unknown target name: "tox".
[2020-12-19T12:41:24.195Z] /build/python-pyudev/src/pyudev-0.22/doc/tests/running.rst:8: WARNING: Unknown target name: "tox".
[2020-12-19T12:41:24.195Z] /build/python-pyudev/src/pyudev-0.22/doc/tests/running.rst:8: WARNING: Unknown target name: "virtualenv".
[2020-12-19T12:41:24.195Z] looking for now-outdated files... none found
[2020-12-19T12:41:24.195Z] pickling environment... done
[2020-12-19T12:41:24.195Z] checking consistency... /build/python-pyudev/src/pyudev-0.22/doc/api/pyudev.pyqt4.rst: WARNING: document isn't included in any toctree
[2020-12-19T12:41:24.195Z] /build/python-pyudev/src/pyudev-0.22/doc/api/pyudev.pyqt5.rst: WARNING: document isn't included in any toctree
[2020-12-19T12:41:24.195Z] /build/python-pyudev/src/pyudev-0.22/doc/api/pyudev.pyside.rst: WARNING: document isn't included in any toctree
[2020-12-19T12:41:24.195Z] /build/python-pyudev/src/pyudev-0.22/doc/modules.rst: WARNING: document isn't included in any toctree
[2020-12-19T12:41:24.195Z] done
[2020-12-19T12:41:24.195Z] preparing documents... done
[2020-12-19T12:41:24.195Z] writing output... [  3%] api/index
[2020-12-19T12:41:24.195Z] writing output... [  6%] api/pyudev
[2020-12-19T12:41:24.746Z] writing output... [ 10%] api/pyudev.glib
[2020-12-19T12:41:24.746Z] writing output... [ 13%] api/pyudev.pyqt4
[2020-12-19T12:41:24.746Z] writing output... [ 17%] api/pyudev.pyqt5
[2020-12-19T12:41:24.746Z] writing output... [ 20%] api/pyudev.pyside
[2020-12-19T12:41:24.746Z] writing output... [ 24%] api/pyudev.wx
[2020-12-19T12:41:24.746Z] writing output... [ 27%] changes
[2020-12-19T12:41:24.746Z] writing output... [ 31%] contribute
[2020-12-19T12:41:24.746Z] writing output... [ 34%] endorsements
[2020-12-19T12:41:24.746Z] writing output... [ 37%] guide
[2020-12-19T12:41:24.746Z] writing output... [ 41%] index
[2020-12-19T12:41:24.996Z] writing output... [ 44%] install
[2020-12-19T12:41:24.996Z] writing output... [ 48%] licencing
[2020-12-19T12:41:24.996Z] writing output... [ 51%] modules
[2020-12-19T12:41:24.996Z] writing output... [ 55%] pyudev
[2020-12-19T12:41:24.996Z] writing output... [ 58%] pyudev.core
[2020-12-19T12:41:24.996Z] writing output... [ 62%] pyudev.device
[2020-12-19T12:41:24.996Z] writing output... [ 65%] pyudev.discover
[2020-12-19T12:41:25.246Z] writing output... [ 68%] pyudev.glib
[2020-12-19T12:41:25.246Z] writing output... [ 72%] pyudev.monitor
[2020-12-19T12:41:25.247Z] writing output... [ 75%] pyudev.pyqt4
[2020-12-19T12:41:25.247Z] writing output... [ 79%] pyudev.pyqt5
[2020-12-19T12:41:25.247Z] writing output... [ 82%] pyudev.pyside
[2020-12-19T12:41:25.247Z] writing output... [ 86%] pyudev.version
[2020-12-19T12:41:25.247Z] writing output... [ 89%] pyudev.wx
[2020-12-19T12:41:25.247Z] writing output... [ 93%] tests/index
[2020-12-19T12:41:25.247Z] writing output... [ 96%] tests/plugins
[2020-12-19T12:41:25.247Z] writing output... [100%] tests/running
[2020-12-19T12:41:25.497Z] 
[2020-12-19T12:41:25.497Z] /build/python-pyudev/src/pyudev-0.22/src/pyudev/discover.py:docstring of pyudev.discover.DeviceFileHypothesis.get_link_dirs:: WARNING: more than one target found for cross-reference 'Context': pyudev.Context, pyudev.core.Context
[2020-12-19T12:41:25.497Z] /build/python-pyudev/src/pyudev-0.22/src/pyudev/discover.py:docstring of pyudev.discover.DeviceFileHypothesis.lookup:: WARNING: more than one target found for cross-reference 'Context': pyudev.Context, pyudev.core.Context
[2020-12-19T12:41:25.497Z] /build/python-pyudev/src/pyudev-0.22/src/pyudev/discover.py:docstring of pyudev.discover.DeviceFileHypothesis.setup:: WARNING: more than one target found for cross-reference 'Context': pyudev.Context, pyudev.core.Context
[2020-12-19T12:41:25.497Z] /build/python-pyudev/src/pyudev-0.22/src/pyudev/discover.py:docstring of pyudev.discover.DeviceNameHypothesis.find_subsystems:: WARNING: more than one target found for cross-reference 'Context': pyudev.Context, pyudev.core.Context
[2020-12-19T12:41:25.497Z] /build/python-pyudev/src/pyudev-0.22/src/pyudev/discover.py:docstring of pyudev.discover.DeviceNameHypothesis.lookup:: WARNING: more than one target found for cross-reference 'Context': pyudev.Context, pyudev.core.Context
[2020-12-19T12:41:25.497Z] /build/python-pyudev/src/pyudev-0.22/src/pyudev/discover.py:docstring of pyudev.discover.DeviceNumberHypothesis.find_subsystems:: WARNING: more than one target found for cross-reference 'Context': pyudev.Context, pyudev.core.Context
[2020-12-19T12:41:25.497Z] /build/python-pyudev/src/pyudev-0.22/src/pyudev/discover.py:docstring of pyudev.discover.DeviceNumberHypothesis.lookup:: WARNING: more than one target found for cross-reference 'Context': pyudev.Context, pyudev.core.Context
[2020-12-19T12:41:25.497Z] /build/python-pyudev/src/pyudev-0.22/src/pyudev/discover.py:docstring of pyudev.discover.DevicePathHypothesis.lookup:: WARNING: more than one target found for cross-reference 'Context': pyudev.Context, pyudev.core.Context
[2020-12-19T12:41:25.497Z] /build/python-pyudev/src/pyudev-0.22/src/pyudev/discover.py:docstring of pyudev.discover.Discovery.get_devices:: WARNING: more than one target found for cross-reference 'Context': pyudev.Context, pyudev.core.Context
[2020-12-19T12:41:25.497Z] /build/python-pyudev/src/pyudev-0.22/src/pyudev/discover.py:docstring of pyudev.discover.Discovery.setup:: WARNING: more than one target found for cross-reference 'Context': pyudev.Context, pyudev.core.Context
[2020-12-19T12:41:25.497Z] /build/python-pyudev/src/pyudev-0.22/src/pyudev/discover.py:docstring of pyudev.discover.Hypothesis.get_devices:: WARNING: more than one target found for cross-reference 'Context': pyudev.Context, pyudev.core.Context
[2020-12-19T12:41:25.497Z] /build/python-pyudev/src/pyudev-0.22/src/pyudev/discover.py:docstring of pyudev.discover.Hypothesis.lookup:: WARNING: more than one target found for cross-reference 'Context': pyudev.Context, pyudev.core.Context
[2020-12-19T12:41:25.498Z] /build/python-pyudev/src/pyudev-0.22/src/pyudev/discover.py:docstring of pyudev.discover.Hypothesis.setup:: WARNING: more than one target found for cross-reference 'Context': pyudev.Context, pyudev.core.Context
[2020-12-19T12:41:25.498Z] generating indices... genindex py-modindex done
[2020-12-19T12:41:25.498Z] writing additional pages... search done
[2020-12-19T12:41:25.498Z] copying static files... done
[2020-12-19T12:41:25.498Z] copying extra files... done
[2020-12-19T12:41:25.498Z] dumping search index in English (code: en)... done
[2020-12-19T12:41:25.498Z] dumping object inventory... done
[2020-12-19T12:41:25.498Z] build succeeded, 51 warnings.
[2020-12-19T12:41:25.498Z] 
[2020-12-19T12:41:25.498Z] The HTML pages are in doc/html.
[2020-12-19T12:41:25.748Z] ==> Starting check()...
[2020-12-19T12:41:25.998Z] running pytest
[2020-12-19T12:41:25.998Z] running egg_info
[2020-12-19T12:41:25.998Z] creating src/pyudev.egg-info
[2020-12-19T12:41:25.998Z] writing src/pyudev.egg-info/PKG-INFO
[2020-12-19T12:41:25.998Z] writing dependency_links to src/pyudev.egg-info/dependency_links.txt
[2020-12-19T12:41:25.998Z] writing requirements to src/pyudev.egg-info/requires.txt
[2020-12-19T12:41:25.998Z] writing top-level names to src/pyudev.egg-info/top_level.txt
[2020-12-19T12:41:25.998Z] writing manifest file 'src/pyudev.egg-info/SOURCES.txt'
[2020-12-19T12:41:25.998Z] reading manifest file 'src/pyudev.egg-info/SOURCES.txt'
[2020-12-19T12:41:25.998Z] reading manifest template 'MANIFEST.in'
[2020-12-19T12:41:25.998Z] warning: no previously-included files matching '*.py' found under directory 'tests/.hypothesis'
[2020-12-19T12:41:25.998Z] writing manifest file 'src/pyudev.egg-info/SOURCES.txt'
[2020-12-19T12:41:25.998Z] running build_ext
[2020-12-19T12:41:26.909Z] ============================= test session starts ==============================
[2020-12-19T12:41:26.909Z] platform linux -- Python 3.9.1, pytest-6.1.2, py-1.9.0, pluggy-0.13.1
[2020-12-19T12:41:26.909Z] rootdir: /build/python-pyudev/src/pyudev-0.22, configfile: pytest.ini
[2020-12-19T12:41:26.909Z] plugins: hypothesis-5.43.3
[2020-12-19T12:41:26.909Z] collected 22 items / 1 error / 21 selected
[2020-12-19T12:41:26.909Z] 
[2020-12-19T12:41:26.909Z] ==================================== ERRORS ====================================
[2020-12-19T12:41:26.909Z] _____________________ ERROR collecting tests/test_core.py ______________________
[2020-12-19T12:41:26.909Z] tests/test_core.py:28: in <module>
[2020-12-19T12:41:26.909Z]     from tests._constants import _UDEV_TEST
[2020-12-19T12:41:26.909Z] tests/_constants.py:55: in <module>
[2020-12-19T12:41:26.909Z]     _DEVICE_DATA = [d for d in udev.DeviceDatabase.db()]
[2020-12-19T12:41:26.909Z] E   TypeError: 'NoneType' object is not iterable
[2020-12-19T12:41:26.909Z] =========================== short test summary info ============================
[2020-12-19T12:41:26.910Z] ERROR tests/test_core.py - TypeError: 'NoneType' object is not iterable
[2020-12-19T12:41:26.910Z] !!!!!!!!!!!!!!!!!!!! Interrupted: 1 error during collection !!!!!!!!!!!!!!!!!!!!
[2020-12-19T12:41:26.910Z] =============================== 1 error in 0.18s ===============================
[2020-12-19T12:41:26.910Z] ==> ERROR: A failure occurred in check().
[2020-12-19T12:41:26.910Z]     Aborting...
[2020-12-19T12:41:27.820Z] ==> ERROR: Build failed, check /build/buildpkg/default-x86_64/jenkins/build
[Pipeline] }
[2020-12-19T12:41:27.823Z] ERROR: Failed to build source
[2020-12-19T12:41:27.823Z] ERROR: script returned exit code 255
[Pipeline] // catchError
[Pipeline] }
[Pipeline] // dir
Post stage
[Pipeline] emailext
[2020-12-19T12:41:27.899Z] Sending email to: artix-build-failures at artixlinux.org


More information about the artix-build-failures mailing list