[artix-build-failures] [goblins] Failure: libical

jenkins at artixlinux.org jenkins at artixlinux.org
Mon Apr 27 17:17:27 CEST 2020


   Failure

   Build: repos/staging-x86_64

   Packages:

   [libical-3.0.8-2-x86_64.pkg.tar.xz]

   authorName: Nathan Owens

   authorEmail: ndowens at artixlinux.org

   [1]https://orion.artixlinux.org/job/packagesL/job/libical/job/master/13
   /

References

   1. https://orion.artixlinux.org/job/packagesL/job/libical/job/master/13/
-------------- next part --------------
Push event to branch master
Querying the current revision of branch master...
Current revision of branch master is 17abc565fd10e7b5ea4c1f680098c2178e915aa5
Obtained Jenkinsfile from 17abc565fd10e7b5ea4c1f680098c2178e915aa5
Running in Durability level: PERFORMANCE_OPTIMIZED
Loading library artix-ci at master
Attempting to resolve master from remote references...
 > git --version # timeout=10
 > git ls-remote -- https://gitea.artixlinux.org/artix/pipeline-libs.git # timeout=10
Found match: refs/heads/master revision 77f77ff85eedb6eb60b64faf8c328ab86dbb479c
Warning: CredentialId "gitea-ci" could not be found.
 > git rev-parse --is-inside-work-tree # timeout=10
Fetching changes from the remote Git repository
 > git config remote.origin.url https://gitea.artixlinux.org/artix/pipeline-libs.git # timeout=10
Fetching without tags
Fetching upstream changes from https://gitea.artixlinux.org/artix/pipeline-libs.git
 > git --version # timeout=10
 > git fetch --no-tags --force --progress -- https://gitea.artixlinux.org/artix/pipeline-libs.git +refs/heads/master:refs/remotes/origin/master # timeout=10
Checking out Revision 77f77ff85eedb6eb60b64faf8c328ab86dbb479c (master)
 > git config core.sparsecheckout # timeout=10
 > git checkout -f 77f77ff85eedb6eb60b64faf8c328ab86dbb479c # timeout=10
Commit message: "Notify: remove fail condition"
[Gitea] Notifying branch build status: PENDING Build started...
[Gitea] Notified
[Pipeline] Start of Pipeline
[Pipeline] node
Still waiting to schedule task
Waiting for next available executor
Running on Jenkins in /build/jenkins/workspace/packagesL_libical_master
[Pipeline] {
[Pipeline] timestamps
[Pipeline] {
[Pipeline] stage
[Pipeline] { (Prepare)
[Pipeline] checkout
[2020-04-27T15:16:05.877Z] Warning: CredentialId "jenkins-ci" could not be found.
[2020-04-27T15:16:05.878Z] Cloning the remote Git repository
[2020-04-27T15:16:05.878Z] Cloning with configured refspecs honoured and without tags
[2020-04-27T15:16:05.878Z] Cloning repository https://237b7412742b4068af4173944de150f12959f4d3@gitea.artixlinux.org/packagesL/libical.git
[2020-04-27T15:16:05.878Z]  > git init /build/jenkins/workspace/packagesL_libical_master # timeout=10
[2020-04-27T15:16:05.891Z] Fetching upstream changes from https://237b7412742b4068af4173944de150f12959f4d3@gitea.artixlinux.org/packagesL/libical.git
[2020-04-27T15:16:05.891Z]  > git --version # timeout=10
[2020-04-27T15:16:05.896Z]  > git fetch --no-tags --force --progress -- https://237b7412742b4068af4173944de150f12959f4d3@gitea.artixlinux.org/packagesL/libical.git +refs/heads/master:refs/remotes/origin/master # timeout=10
[2020-04-27T15:16:06.060Z]  > git config remote.origin.url https://237b7412742b4068af4173944de150f12959f4d3@gitea.artixlinux.org/packagesL/libical.git # timeout=10
[2020-04-27T15:16:06.066Z]  > git config --add remote.origin.fetch +refs/heads/master:refs/remotes/origin/master # timeout=10
[2020-04-27T15:16:06.071Z]  > git config remote.origin.url https://237b7412742b4068af4173944de150f12959f4d3@gitea.artixlinux.org/packagesL/libical.git # timeout=10
[2020-04-27T15:16:06.076Z] Cleaning workspace
[2020-04-27T15:16:06.076Z]  > git rev-parse --verify HEAD # timeout=10
[2020-04-27T15:16:06.081Z] No valid HEAD. Skipping the resetting
[2020-04-27T15:16:06.081Z]  > git clean -fdx # timeout=10
[2020-04-27T15:16:06.085Z] Fetching without tags
[2020-04-27T15:16:06.085Z] Fetching upstream changes from https://237b7412742b4068af4173944de150f12959f4d3@gitea.artixlinux.org/packagesL/libical.git
[2020-04-27T15:16:06.085Z]  > git fetch --no-tags --force --progress -- https://237b7412742b4068af4173944de150f12959f4d3@gitea.artixlinux.org/packagesL/libical.git +refs/heads/master:refs/remotes/origin/master # timeout=10
[2020-04-27T15:16:06.179Z] Checking out Revision 17abc565fd10e7b5ea4c1f680098c2178e915aa5 (master)
[2020-04-27T15:16:06.179Z]  > git config core.sparsecheckout # timeout=10
[2020-04-27T15:16:06.184Z]  > git checkout -f 17abc565fd10e7b5ea4c1f680098c2178e915aa5 # timeout=10
[2020-04-27T15:16:06.193Z] Commit message: "[trunk] -> [staging] 'libical-3.0.8-2' add"
[2020-04-27T15:16:06.193Z]  > git rev-list --no-walk 9522a2b75fc6b840d0147fdcb7425ae463e95a05 # timeout=10
[2020-04-27T15:16:06.207Z] [Gitea] Notifying branch build status: PENDING Build started...
[2020-04-27T15:16:06.399Z] [Gitea] Notified
[Pipeline] libraryResource
[Pipeline] readYaml
[Pipeline] sh
[2020-04-27T15:16:06.672Z] + git rev-parse @
[Pipeline] sh
[2020-04-27T15:16:06.929Z] + git show -s --format=%an 17abc565fd10e7b5ea4c1f680098c2178e915aa5
[Pipeline] sh
[2020-04-27T15:16:07.187Z] + git show -s --format=%ae 17abc565fd10e7b5ea4c1f680098c2178e915aa5
[Pipeline] sh
[2020-04-27T15:16:07.444Z] + git show --pretty=format: --name-status 17abc565fd10e7b5ea4c1f680098c2178e915aa5
[Pipeline] fileExists
[Pipeline] sh
[2020-04-27T15:16:07.708Z] + pkg2yaml repos/staging-x86_64
[Pipeline] readYaml
[Pipeline] }
[Pipeline] // stage
[Pipeline] stage
[Pipeline] { (Build)
[Pipeline] input
[2020-04-27T15:16:07.771Z] Input requested
[2020-04-27T15:16:48.843Z] Approved by Nathan Owens
[Pipeline] echo
[2020-04-27T15:16:48.884Z] isRebuild: false
[Pipeline] dir
[2020-04-27T15:16:48.887Z] Running in /build/jenkins/workspace/packagesL_libical_master/repos/staging-x86_64
[Pipeline] {
[Pipeline] sh
[2020-04-27T15:16:49.148Z] + buildpkg-goblins
[2020-04-27T15:16:52.376Z] :: Synchronizing package databases...
[2020-04-27T15:16:52.376Z]  goblins is up to date
[2020-04-27T15:16:52.376Z]  gremlins is up to date
[2020-04-27T15:16:52.376Z]  system is up to date
[2020-04-27T15:16:52.376Z]  world is up to date
[2020-04-27T15:16:52.376Z]  galaxy-goblins is up to date
[2020-04-27T15:16:52.376Z]  galaxy-gremlins is up to date
[2020-04-27T15:16:52.376Z]  galaxy is up to date
[2020-04-27T15:16:52.376Z]  staging is up to date
[2020-04-27T15:16:52.376Z]  testing is up to date
[2020-04-27T15:16:52.376Z]  extra is up to date
[2020-04-27T15:16:52.376Z]  community-staging is up to date
[2020-04-27T15:16:52.376Z]  community-testing is up to date
[2020-04-27T15:16:52.376Z]  community is up to date
[2020-04-27T15:16:52.376Z] :: Starting full system upgrade...
[2020-04-27T15:16:52.376Z]  there is nothing to do
[2020-04-27T15:16:53.287Z] ==> Building in chroot for [goblins] (x86_64)...
[2020-04-27T15:16:53.838Z] ==> Synchronizing chroot copy [/build/buildpkg/goblins-x86_64/root] -> [jenkins]...done
[2020-04-27T15:16:54.388Z] ==> Making package: libical 3.0.8-2 (Mon Apr 27 17:16:54 2020)
[2020-04-27T15:16:54.388Z] ==> Retrieving sources...
[2020-04-27T15:16:54.388Z]   -> Found libical-3.0.8.tar.gz
[2020-04-27T15:16:54.388Z] ==> Validating source files with sha512sums...
[2020-04-27T15:16:54.639Z]     libical-3.0.8.tar.gz ... Passed
[2020-04-27T15:16:59.833Z] ==> Making package: libical 3.0.8-2 (Mon 27 Apr 2020 03:16:58 PM UTC)
[2020-04-27T15:16:59.833Z] ==> Checking runtime dependencies...
[2020-04-27T15:16:59.833Z] ==> Checking buildtime dependencies...
[2020-04-27T15:16:59.833Z] ==> Installing missing dependencies...
[2020-04-27T15:16:59.833Z] resolving dependencies...
[2020-04-27T15:16:59.833Z] :: There are 2 providers available for libjpeg:
[2020-04-27T15:16:59.833Z] :: Repository world
[2020-04-27T15:16:59.833Z]    1) libjpeg-turbo
[2020-04-27T15:16:59.833Z] :: Repository extra
[2020-04-27T15:16:59.833Z]    2) libjpeg-turbo
[2020-04-27T15:16:59.833Z] 
[2020-04-27T15:16:59.833Z] Enter a number (default=1): 
[2020-04-27T15:16:59.833Z] :: There are 14 providers available for ttf-font:
[2020-04-27T15:16:59.833Z] :: Repository world
[2020-04-27T15:16:59.833Z]    1) noto-fonts  2) ttf-bitstream-vera  3) ttf-croscore  4) ttf-dejavu
[2020-04-27T15:16:59.833Z] :: Repository galaxy
[2020-04-27T15:16:59.833Z]    5) ttf-droid  6) ttf-liberation
[2020-04-27T15:16:59.833Z] :: Repository extra
[2020-04-27T15:16:59.833Z]    7) gnu-free-fonts  8) noto-fonts  9) ttf-bitstream-vera  10) ttf-croscore  11) ttf-dejavu
[2020-04-27T15:16:59.833Z] :: Repository community
[2020-04-27T15:16:59.833Z]    12) ttf-droid  13) ttf-ibm-plex  14) ttf-liberation
[2020-04-27T15:16:59.833Z] 
[2020-04-27T15:16:59.833Z] Enter a number (default=1): 
[2020-04-27T15:16:59.833Z] looking for conflicting packages...
[2020-04-27T15:16:59.833Z] warning: dependency cycle detected:
[2020-04-27T15:16:59.833Z] warning: harfbuzz will be installed before its freetype2 dependency
[2020-04-27T15:16:59.833Z] 
[2020-04-27T15:16:59.833Z] Package (83)                         New Version              Net Change
[2020-04-27T15:16:59.833Z] 
[2020-04-27T15:16:59.833Z] world/avahi                          0.8+15+ge8a3dd0-1          1.83 MiB
[2020-04-27T15:16:59.833Z] world/cairo                          1.17.2+17+g52a7c79fd-2     3.47 MiB
[2020-04-27T15:16:59.833Z] system/dbus                          1.12.16-5                  0.91 MiB
[2020-04-27T15:16:59.833Z] world/docbook-xml                    4.5-8                      2.04 MiB
[2020-04-27T15:16:59.833Z] world/docbook-xsl                    1.79.2-5                  26.59 MiB
[2020-04-27T15:16:59.833Z] world/fontconfig                     2:2.13.91+24+g75eadca-2    2.09 MiB
[2020-04-27T15:16:59.833Z] world/freetype2                      2.10.1-2                   1.56 MiB
[2020-04-27T15:16:59.833Z] world/fribidi                        1.0.9-1                    0.22 MiB
[2020-04-27T15:16:59.833Z] world/gd                             2.3.0-1                    0.67 MiB
[2020-04-27T15:16:59.834Z] world/gdk-pixbuf2                    2.40.0-2                   4.02 MiB
[2020-04-27T15:16:59.834Z] world/ghostscript                    9.52-1                    48.63 MiB
[2020-04-27T15:16:59.834Z] world/giflib                         5.2.1-1                    0.33 MiB
[2020-04-27T15:16:59.834Z] system/glib2-docs                    2.64.2-1                  19.86 MiB
[2020-04-27T15:16:59.834Z] world/gobject-introspection-runtime  1.64.1-2                   0.81 MiB
[2020-04-27T15:16:59.834Z] world/graphite                       1:1.3.14-1                 0.67 MiB
[2020-04-27T15:16:59.834Z] world/graphviz                       2.44.0-1                  15.71 MiB
[2020-04-27T15:16:59.834Z] world/gsfonts                        20180524-2                 3.13 MiB
[2020-04-27T15:16:59.834Z] world/gts                            0.7.6.121130-1             0.67 MiB
[2020-04-27T15:16:59.834Z] world/harfbuzz                       2.6.5-1                    4.61 MiB
[2020-04-27T15:16:59.834Z] world/ijs                            0.35-2                     0.17 MiB
[2020-04-27T15:16:59.834Z] world/jbig2dec                       0.18-1                     0.15 MiB
[2020-04-27T15:16:59.834Z] world/jsoncpp                        1.9.2-1                    1.60 MiB
[2020-04-27T15:16:59.834Z] world/lcms2                          2.9-2                      0.67 MiB
[2020-04-27T15:16:59.834Z] world/libcups                        2.3.1-1                    0.84 MiB
[2020-04-27T15:16:59.834Z] world/libdaemon                      0.14-4                     0.09 MiB
[2020-04-27T15:16:59.834Z] world/libdatrie                      0.2.12-1                   0.11 MiB
[2020-04-27T15:16:59.834Z] world/libice                         1.0.10-2                   0.35 MiB
[2020-04-27T15:16:59.834Z] system/libidn                        1.35-2                     0.67 MiB
[2020-04-27T15:16:59.834Z] world/libjpeg-turbo                  2.0.4-1                    2.10 MiB
[2020-04-27T15:16:59.834Z] system/libnsl                        1.2.0-2                    0.19 MiB
[2020-04-27T15:16:59.834Z] world/libpaper                       1.1.28-1                   0.09 MiB
[2020-04-27T15:16:59.834Z] world/libpng                         1.6.37-1                   0.61 MiB
[2020-04-27T15:16:59.834Z] world/librsvg                        2:2.48.4-1                 4.78 MiB
[2020-04-27T15:16:59.834Z] world/libsm                          1.2.3-1                    0.31 MiB
[2020-04-27T15:16:59.834Z] world/libthai                        0.1.28-1                   0.67 MiB
[2020-04-27T15:16:59.834Z] world/libtiff                        4.1.0-1                    2.72 MiB
[2020-04-27T15:16:59.834Z] system/libusb                        1.0.23-2                   0.17 MiB
[2020-04-27T15:16:59.834Z] world/libuv                          1.37.0-1                   0.51 MiB
[2020-04-27T15:16:59.834Z] world/libwebp                        1.1.0-1                    1.06 MiB
[2020-04-27T15:16:59.834Z] world/libx11                         1.6.9-6                   10.15 MiB
[2020-04-27T15:16:59.834Z] world/libxau                         1.0.9-2                    0.02 MiB
[2020-04-27T15:16:59.834Z] world/libxaw                         1.0.13-2                   1.71 MiB
[2020-04-27T15:16:59.834Z] world/libxcb                         1.14-1                     3.73 MiB
[2020-04-27T15:16:59.834Z] world/libxdmcp                       1.1.3-2                    0.13 MiB
[2020-04-27T15:16:59.834Z] world/libxext                        1.3.4-2                    0.30 MiB
[2020-04-27T15:16:59.834Z] world/libxft                         2.3.3-1                    0.16 MiB
[2020-04-27T15:16:59.834Z] world/libxmu                         1.1.3-1                    0.38 MiB
[2020-04-27T15:16:59.834Z] world/libxpm                         3.5.13-1                   0.15 MiB
[2020-04-27T15:16:59.834Z] world/libxrender                     0.9.10-3                   0.08 MiB
[2020-04-27T15:16:59.834Z] world/libxslt                        1.1.34-2                   2.30 MiB
[2020-04-27T15:16:59.834Z] world/libxt                          1.2.0-1                    2.09 MiB
[2020-04-27T15:16:59.834Z] system/lzo                           2.10-3                     0.39 MiB
[2020-04-27T15:16:59.834Z] world/netpbm                         10.73.31-1                 7.42 MiB
[2020-04-27T15:16:59.834Z] world/noto-fonts                     20190926-4                91.19 MiB
[2020-04-27T15:16:59.834Z] world/openjpeg2                      2.3.1-1                   12.63 MiB
[2020-04-27T15:16:59.834Z] world/pango                          1:1.44.7+11+g73b46b04-1    4.36 MiB
[2020-04-27T15:16:59.834Z] world/pixman                         0.40.0-1                   0.70 MiB
[2020-04-27T15:16:59.834Z] world/pygobject-devel                3.36.0-2                   0.02 MiB
[2020-04-27T15:16:59.834Z] world/python                         3.8.2-2                   80.70 MiB
[2020-04-27T15:16:59.834Z] world/python-anytree                 2.8.0-1                    0.31 MiB
[2020-04-27T15:16:59.834Z] world/python-appdirs                 1.4.3-5                    0.07 MiB
[2020-04-27T15:16:59.834Z] world/python-beaker                  1.11.0-3                   0.47 MiB
[2020-04-27T15:16:59.834Z] world/python-lxml                    4.5.0-1                    4.99 MiB
[2020-04-27T15:16:59.834Z] world/python-mako                    1.1.2-1                    0.68 MiB
[2020-04-27T15:16:59.834Z] galaxy/python-markdown               3.1.1-4                    0.45 MiB
[2020-04-27T15:16:59.834Z] world/python-markupsafe              1.1.1-3                    0.08 MiB
[2020-04-27T15:16:59.834Z] world/python-ordered-set             3.1.1-1                    0.05 MiB
[2020-04-27T15:16:59.834Z] world/python-packaging               20.3-1                     0.17 MiB
[2020-04-27T15:16:59.834Z] galaxy/python-pygments               2.6.1-2                    9.42 MiB
[2020-04-27T15:16:59.834Z] world/python-pyparsing               2.4.7-1                    0.73 MiB
[2020-04-27T15:16:59.834Z] world/python-setuptools              1:46.1.3-1                 1.53 MiB
[2020-04-27T15:16:59.834Z] world/python-six                     1.14.0-1                   0.09 MiB
[2020-04-27T15:16:59.834Z] world/rhash                          1.3.9-1                    0.29 MiB
[2020-04-27T15:16:59.834Z] system/run-parts                     4.8.6.1-2                  0.04 MiB
[2020-04-27T15:16:59.834Z] world/shared-mime-info               1.15-2                     4.25 MiB
[2020-04-27T15:16:59.834Z] world/xcb-proto                      1.14-1                     0.83 MiB
[2020-04-27T15:16:59.834Z] world/xorgproto                      2020.1-1                   1.40 MiB
[2020-04-27T15:16:59.834Z] world/cmake                          3.17.1-2                  39.25 MiB
[2020-04-27T15:16:59.834Z] world/doxygen                        1.8.17-1                  17.92 MiB
[2020-04-27T15:16:59.834Z] world/gobject-introspection          1.64.1-2                  12.86 MiB
[2020-04-27T15:16:59.834Z] world/gtk-doc                        1.32+37+gefc3644-1         2.78 MiB
[2020-04-27T15:16:59.834Z] world/python-gobject                 3.36.0-2                   1.09 MiB
[2020-04-27T15:16:59.834Z] world/vala                           0.48.5-1                  13.05 MiB
[2020-04-27T15:16:59.834Z] 
[2020-04-27T15:16:59.834Z] Total Installed Size:  487.09 MiB
[2020-04-27T15:16:59.834Z] 
[2020-04-27T15:16:59.834Z] :: Proceed with installation? [Y/n] 
[2020-04-27T15:16:59.834Z] checking keyring...
[2020-04-27T15:16:59.834Z] checking package integrity...
[2020-04-27T15:17:05.029Z] loading package files...
[2020-04-27T15:17:05.029Z] checking for file conflicts...
[2020-04-27T15:17:05.029Z] checking available disk space...
[2020-04-27T15:17:05.029Z] :: Processing package changes...
[2020-04-27T15:17:05.029Z] installing shared-mime-info...
[2020-04-27T15:17:05.029Z] installing jsoncpp...
[2020-04-27T15:17:05.029Z] Optional dependencies for jsoncpp
[2020-04-27T15:17:05.029Z]     jsoncpp-doc: documentation
[2020-04-27T15:17:05.029Z] installing libnsl...
[2020-04-27T15:17:05.029Z] installing libuv...
[2020-04-27T15:17:05.029Z] installing rhash...
[2020-04-27T15:17:05.029Z] installing cmake...
[2020-04-27T15:17:05.940Z] Optional dependencies for cmake
[2020-04-27T15:17:05.940Z]     qt5-base: cmake-gui
[2020-04-27T15:17:05.940Z] installing libxslt...
[2020-04-27T15:17:05.940Z] installing docbook-xml...
[2020-04-27T15:17:05.940Z] xmlcatalog: error while loading shared libraries: libicuuc.so.65: cannot open shared object file: No such file or directory
[2020-04-27T15:17:05.940Z] xmlcatalog: error while loading shared libraries: libicuuc.so.65: cannot open shared object file: No such file or directory
[2020-04-27T15:17:05.940Z] xmlcatalog: error while loading shared libraries: libicuuc.so.65: cannot open shared object file: No such file or directory
[2020-04-27T15:17:05.940Z] xmlcatalog: error while loading shared libraries: libicuuc.so.65: cannot open shared object file: No such file or directory
[2020-04-27T15:17:05.940Z] xmlcatalog: error while loading shared libraries: libicuuc.so.65: cannot open shared object file: No such file or directory
[2020-04-27T15:17:05.940Z] error: command failed to execute correctly
[2020-04-27T15:17:05.940Z] installing docbook-xsl...
[2020-04-27T15:17:06.201Z] xmlcatalog: error while loading shared libraries: libicuuc.so.65: cannot open shared object file: No such file or directory
[2020-04-27T15:17:06.201Z] xmlcatalog: error while loading shared libraries: libicuuc.so.65: cannot open shared object file: No such file or directory
[2020-04-27T15:17:06.201Z] xmlcatalog: error while loading shared libraries: libicuuc.so.65: cannot open shared object file: No such file or directory
[2020-04-27T15:17:06.201Z] xmlcatalog: error while loading shared libraries: libicuuc.so.65: cannot open shared object file: No such file or directory
[2020-04-27T15:17:06.201Z] xmlcatalog: error while loading shared libraries: libicuuc.so.65: cannot open shared object file: No such file or directory
[2020-04-27T15:17:06.201Z] xmlcatalog: error while loading shared libraries: libicuuc.so.65: cannot open shared object file: No such file or directory
[2020-04-27T15:17:06.201Z] xmlcatalog: error while loading shared libraries: libicuuc.so.65: cannot open shared object file: No such file or directory
[2020-04-27T15:17:06.201Z] xmlcatalog: error while loading shared libraries: libicuuc.so.65: cannot open shared object file: No such file or directory
[2020-04-27T15:17:06.201Z] xmlcatalog: error while loading shared libraries: libicuuc.so.65: cannot open shared object file: No such file or directory
[2020-04-27T15:17:06.201Z] xmlcatalog: error while loading shared libraries: libicuuc.so.65: cannot open shared object file: No such file or directory
[2020-04-27T15:17:06.201Z] xmlcatalog: error while loading shared libraries: libicuuc.so.65: cannot open shared object file: No such file or directory
[2020-04-27T15:17:06.201Z] xmlcatalog: error while loading shared libraries: libicuuc.so.65: cannot open shared object file: No such file or directory
[2020-04-27T15:17:06.201Z] xmlcatalog: error while loading shared libraries: libicuuc.so.65: cannot open shared object file: No such file or directory
[2020-04-27T15:17:06.201Z] error: command failed to execute correctly
[2020-04-27T15:17:06.201Z] installing glib2-docs...
[2020-04-27T15:17:06.201Z] installing python...
[2020-04-27T15:17:08.684Z] Optional dependencies for python
[2020-04-27T15:17:08.684Z]     python-setuptools [pending]
[2020-04-27T15:17:08.684Z]     python-pip
[2020-04-27T15:17:08.684Z]     sqlite [installed]
[2020-04-27T15:17:08.684Z]     mpdecimal: for decimal
[2020-04-27T15:17:08.684Z]     xz: for lzma [installed]
[2020-04-27T15:17:08.684Z]     tk: for tkinter
[2020-04-27T15:17:08.684Z] installing python-lxml...
[2020-04-27T15:17:08.684Z] Optional dependencies for python-lxml
[2020-04-27T15:17:08.684Z]     python-beautifulsoup4: support for beautifulsoup parser to parse not well formed HTML
[2020-04-27T15:17:08.684Z]     python-cssselect: support for cssselect
[2020-04-27T15:17:08.684Z]     python-html5lib: support for html5lib parser
[2020-04-27T15:17:08.684Z]     python-lxml-docs: offline docs
[2020-04-27T15:17:08.684Z] installing python-appdirs...
[2020-04-27T15:17:08.684Z] installing python-pyparsing...
[2020-04-27T15:17:08.684Z] installing python-six...
[2020-04-27T15:17:08.684Z] installing python-packaging...
[2020-04-27T15:17:08.684Z] installing python-ordered-set...
[2020-04-27T15:17:08.684Z] installing python-setuptools...
[2020-04-27T15:17:08.684Z] installing python-pygments...
[2020-04-27T15:17:08.934Z] installing python-anytree...
[2020-04-27T15:17:08.934Z] installing gtk-doc...
[2020-04-27T15:17:08.934Z] Optional dependencies for gtk-doc
[2020-04-27T15:17:08.934Z]     dblatex: PDF support
[2020-04-27T15:17:08.934Z] installing doxygen...
[2020-04-27T15:17:09.485Z] Optional dependencies for doxygen
[2020-04-27T15:17:09.485Z]     graphviz: for caller/callee graph generation [pending]
[2020-04-27T15:17:09.485Z]     qt5-base: for doxywizard
[2020-04-27T15:17:09.485Z] installing libpng...
[2020-04-27T15:17:09.485Z] installing graphite...
[2020-04-27T15:17:09.485Z] installing harfbuzz...
[2020-04-27T15:17:09.485Z] Optional dependencies for harfbuzz
[2020-04-27T15:17:09.485Z]     cairo: hb-view program [pending]
[2020-04-27T15:17:09.485Z] installing freetype2...
[2020-04-27T15:17:09.485Z] installing fontconfig...
[2020-04-27T15:17:09.735Z]   
[2020-04-27T15:17:09.735Z]   Fontconfig configuration is done via /etc/fonts/conf.avail and conf.d.
[2020-04-27T15:17:09.735Z]   Read /etc/fonts/conf.d/README for more information.
[2020-04-27T15:17:09.735Z] 
[2020-04-27T15:17:09.735Z]   Configuration via /etc/fonts/local.conf is still possible,
[2020-04-27T15:17:09.735Z]   but is no longer recommended for options available in conf.avail.
[2020-04-27T15:17:09.735Z] 
[2020-04-27T15:17:09.735Z]   Main systemwide configuration should be done by symlinks
[2020-04-27T15:17:09.735Z]   (especially for autohinting, sub-pixel and lcdfilter):
[2020-04-27T15:17:09.735Z]   
[2020-04-27T15:17:09.735Z]   cd /etc/fonts/conf.d
[2020-04-27T15:17:09.735Z]   ln -s ../conf.avail/XX-foo.conf
[2020-04-27T15:17:09.735Z]   
[2020-04-27T15:17:09.735Z]   Check also https://wiki.archlinux.org/index.php/Font_Configuration
[2020-04-27T15:17:09.735Z]   and https://wiki.archlinux.org/index.php/Fonts.
[2020-04-27T15:17:09.735Z] 
[2020-04-27T15:17:09.735Z] Rebuilding fontconfig cache... done.
[2020-04-27T15:17:09.735Z] installing libice...
[2020-04-27T15:17:09.735Z] installing libsm...
[2020-04-27T15:17:09.735Z] installing xcb-proto...
[2020-04-27T15:17:09.735Z] installing libxdmcp...
[2020-04-27T15:17:09.735Z] installing libxau...
[2020-04-27T15:17:09.735Z] installing libxcb...
[2020-04-27T15:17:09.985Z] installing xorgproto...
[2020-04-27T15:17:09.985Z] installing libx11...
[2020-04-27T15:17:10.236Z] installing libxt...
[2020-04-27T15:17:10.236Z] installing libxext...
[2020-04-27T15:17:10.236Z] installing libxpm...
[2020-04-27T15:17:10.236Z] installing libjpeg-turbo...
[2020-04-27T15:17:10.236Z] installing libtiff...
[2020-04-27T15:17:10.236Z] Optional dependencies for libtiff
[2020-04-27T15:17:10.236Z]     freeglut: for using tiffgt
[2020-04-27T15:17:10.236Z] installing giflib...
[2020-04-27T15:17:10.486Z] installing libwebp...
[2020-04-27T15:17:10.486Z] Optional dependencies for libwebp
[2020-04-27T15:17:10.486Z]     freeglut: vwebp viewer
[2020-04-27T15:17:10.486Z] installing gd...
[2020-04-27T15:17:10.486Z] Optional dependencies for gd
[2020-04-27T15:17:10.486Z]     perl: bdftogd script [installed]
[2020-04-27T15:17:10.486Z] installing gdk-pixbuf2...
[2020-04-27T15:17:10.486Z] installing libdatrie...
[2020-04-27T15:17:10.486Z] installing libthai...
[2020-04-27T15:17:10.486Z] installing libxrender...
[2020-04-27T15:17:10.486Z] installing pixman...
[2020-04-27T15:17:10.486Z] installing lzo...
[2020-04-27T15:17:10.486Z] installing cairo...
[2020-04-27T15:17:10.736Z] installing libxft...
[2020-04-27T15:17:10.736Z] installing fribidi...
[2020-04-27T15:17:10.736Z] installing pango...
[2020-04-27T15:17:10.736Z] installing librsvg...
[2020-04-27T15:17:10.736Z] installing libxmu...
[2020-04-27T15:17:10.736Z] installing libxaw...
[2020-04-27T15:17:10.736Z] installing libdaemon...
[2020-04-27T15:17:10.736Z] installing dbus...
[2020-04-27T15:17:10.992Z] installing avahi...
[2020-04-27T15:17:10.992Z] Optional dependencies for avahi
[2020-04-27T15:17:10.992Z]     gtk3: avahi-discover, avahi-discover-standalone, bshell, bssh, bvnc
[2020-04-27T15:17:10.992Z]     qt5-base: qt5 bindings
[2020-04-27T15:17:10.992Z]     libevent: libevent bindings
[2020-04-27T15:17:10.992Z]     nss-mdns: NSS support for mDNS
[2020-04-27T15:17:10.992Z]     python-twisted: avahi-bookmarks
[2020-04-27T15:17:10.992Z]     python-gobject: avahi-bookmarks, avahi-discover [pending]
[2020-04-27T15:17:10.992Z]     python-dbus: avahi-bookmarks, avahi-discover
[2020-04-27T15:17:10.992Z] installing libusb...
[2020-04-27T15:17:10.992Z] installing libcups...
[2020-04-27T15:17:10.992Z] installing jbig2dec...
[2020-04-27T15:17:10.992Z] installing lcms2...
[2020-04-27T15:17:10.992Z] installing run-parts...
[2020-04-27T15:17:10.992Z] installing libpaper...
[2020-04-27T15:17:10.992Z] installing ijs...
[2020-04-27T15:17:10.992Z] installing openjpeg2...
[2020-04-27T15:17:10.992Z] installing libidn...
[2020-04-27T15:17:11.242Z] installing ghostscript...
[2020-04-27T15:17:12.153Z] Optional dependencies for ghostscript
[2020-04-27T15:17:12.153Z]     texlive-core: needed for dvipdf
[2020-04-27T15:17:12.153Z]     gtk3: needed for gsx
[2020-04-27T15:17:12.153Z] installing netpbm...
[2020-04-27T15:17:12.403Z] installing gts...
[2020-04-27T15:17:12.403Z] installing gsfonts...
[2020-04-27T15:17:12.403Z] installing graphviz...
[2020-04-27T15:17:12.954Z] Warning: Could not load "/usr/lib/graphviz/libgvplugin_gdk.so.6" - It was found, so perhaps one of its dependents was not.  Try ldd.
[2020-04-27T15:17:12.954Z] Warning: Could not load "/usr/lib/graphviz/libgvplugin_gtk.so.6" - It was found, so perhaps one of its dependents was not.  Try ldd.
[2020-04-27T15:17:12.954Z] Warning: Could not load "/usr/lib/graphviz/libgvplugin_rsvg.so.6" - It was found, so perhaps one of its dependents was not.  Try ldd.
[2020-04-27T15:17:12.954Z] Warning: Could not load "/usr/lib/graphviz/libgvplugin_gdk.so.6" - It was found, so perhaps one of its dependents was not.  Try ldd.
[2020-04-27T15:17:12.954Z] Warning: Could not load "/usr/lib/graphviz/libgvplugin_gtk.so.6" - It was found, so perhaps one of its dependents was not.  Try ldd.
[2020-04-27T15:17:12.954Z] Warning: Could not load "/usr/lib/graphviz/libgvplugin_rsvg.so.6" - It was found, so perhaps one of its dependents was not.  Try ldd.
[2020-04-27T15:17:12.954Z] Optional dependencies for graphviz
[2020-04-27T15:17:12.954Z]     mono: sharp bindings
[2020-04-27T15:17:12.954Z]     guile: guile bindings [installed]
[2020-04-27T15:17:12.954Z]     lua: lua bindings
[2020-04-27T15:17:12.954Z]     ocaml: ocaml bindings
[2020-04-27T15:17:12.954Z]     perl: perl bindings [installed]
[2020-04-27T15:17:12.954Z]     python: python bindings [installed]
[2020-04-27T15:17:12.954Z]     python2: python2 bindings
[2020-04-27T15:17:12.954Z]     r: r bindings
[2020-04-27T15:17:12.954Z]     tcl: tcl bindings
[2020-04-27T15:17:12.954Z]     qt5-base: gvedit
[2020-04-27T15:17:12.954Z]     gtk2: gtk output plugin
[2020-04-27T15:17:12.954Z]     xterm: vimdot
[2020-04-27T15:17:12.954Z] installing noto-fonts...
[2020-04-27T15:17:15.436Z] Optional dependencies for noto-fonts
[2020-04-27T15:17:15.436Z]     noto-fonts-cjk: CJK characters
[2020-04-27T15:17:15.436Z]     noto-fonts-emoji: Emoji characters
[2020-04-27T15:17:15.436Z]     noto-fonts-extra: additional variants (condensed, semi-bold, extra-light)
[2020-04-27T15:17:15.436Z] installing vala...
[2020-04-27T15:17:15.436Z] installing python-markupsafe...
[2020-04-27T15:17:15.436Z] installing python-beaker...
[2020-04-27T15:17:15.437Z] installing python-mako...
[2020-04-27T15:17:15.437Z] installing python-markdown...
[2020-04-27T15:17:15.437Z] installing gobject-introspection-runtime...
[2020-04-27T15:17:15.437Z] installing gobject-introspection...
[2020-04-27T15:17:15.437Z] installing pygobject-devel...
[2020-04-27T15:17:15.437Z] installing python-gobject...
[2020-04-27T15:17:15.437Z] Optional dependencies for python-gobject
[2020-04-27T15:17:15.437Z]     cairo: Cairo bindings [installed]
[2020-04-27T15:17:15.687Z] :: Running post-transaction hooks...
[2020-04-27T15:17:15.687Z] (1/6) Creating system user accounts...
[2020-04-27T15:17:15.687Z] (2/6) Warn about old perl modules
[2020-04-27T15:17:15.687Z] (3/6) Updating fontconfig cache...
[2020-04-27T15:17:15.937Z] (4/6) Probing GDK-Pixbuf loader modules...
[2020-04-27T15:17:15.937Z] g_module_open() failed for /usr/lib/gdk-pixbuf-2.0/2.10.0/loaders/libpixbufloader-svg.so: libicuuc.so.65: cannot open shared object file: No such file or directory
[2020-04-27T15:17:15.937Z] (5/6) Updating the info directory file...
[2020-04-27T15:17:15.937Z] (6/6) Updating the MIME type database...
[2020-04-27T15:17:15.937Z] /usr/bin/update-mime-database: error while loading shared libraries: libicuuc.so.65: cannot open shared object file: No such file or directory
[2020-04-27T15:17:15.937Z] error: command failed to execute correctly
[2020-04-27T15:17:15.937Z] ==> Retrieving sources...
[2020-04-27T15:17:15.937Z]   -> Found libical-3.0.8.tar.gz
[2020-04-27T15:17:15.937Z] ==> WARNING: Skipping all source file integrity checks.
[2020-04-27T15:17:15.937Z] ==> Extracting sources...
[2020-04-27T15:17:16.188Z]   -> Extracting libical-3.0.8.tar.gz with bsdtar
[2020-04-27T15:17:16.188Z] ==> Starting prepare()...
[2020-04-27T15:17:16.188Z] ==> Starting build()...
[2020-04-27T15:17:16.188Z] -- The C compiler identification is GNU 9.3.0
[2020-04-27T15:17:16.188Z] -- Check for working C compiler: /usr/bin/cc
[2020-04-27T15:17:16.438Z] -- Check for working C compiler: /usr/bin/cc - works
[2020-04-27T15:17:16.438Z] -- Detecting C compiler ABI info
[2020-04-27T15:17:16.438Z] -- Detecting C compiler ABI info - done
[2020-04-27T15:17:16.438Z] -- Detecting C compile features
[2020-04-27T15:17:16.438Z] -- Detecting C compile features - done
[2020-04-27T15:17:16.689Z] -- The CXX compiler identification is GNU 9.3.0
[2020-04-27T15:17:16.689Z] -- Check for working CXX compiler: /usr/bin/c++
[2020-04-27T15:17:16.689Z] -- Check for working CXX compiler: /usr/bin/c++ - works
[2020-04-27T15:17:16.689Z] -- Detecting CXX compiler ABI info
[2020-04-27T15:17:16.939Z] -- Detecting CXX compiler ABI info - done
[2020-04-27T15:17:16.939Z] -- Detecting CXX compile features
[2020-04-27T15:17:16.939Z] -- Detecting CXX compile features - done
[2020-04-27T15:17:16.939Z] -- Found Perl: /usr/bin/perl (found version "5.30.2") 
[2020-04-27T15:17:16.939Z] -- Found ICU version 67.1
[2020-04-27T15:17:16.939Z] -- Found ICU header files in /usr/include
[2020-04-27T15:17:16.939Z] -- Found ICU libraries: /lib64/libicuuc.so /lib/libicui18n.so
[2020-04-27T15:17:16.939Z] -- Found Berkeley DB header files in /usr/include
[2020-04-27T15:17:16.939Z] -- Found Berkeley libraries: /usr/lib/libdb.so
[2020-04-27T15:17:16.939Z] -- Looking for include file byteswap.h
[2020-04-27T15:17:17.190Z] -- Looking for include file byteswap.h - found
[2020-04-27T15:17:17.190Z] -- Looking for include file dirent.h
[2020-04-27T15:17:17.190Z] -- Looking for include file dirent.h - found
[2020-04-27T15:17:17.190Z] -- Looking for include file endian.h
[2020-04-27T15:17:17.440Z] -- Looking for include file endian.h - found
[2020-04-27T15:17:17.440Z] -- Looking for include file inttypes.h
[2020-04-27T15:17:17.440Z] -- Looking for include file inttypes.h - found
[2020-04-27T15:17:17.440Z] -- Looking for include file pthread.h
[2020-04-27T15:17:17.691Z] -- Looking for include file pthread.h - found
[2020-04-27T15:17:17.691Z] -- Looking for include file sys/endian.h
[2020-04-27T15:17:17.691Z] -- Looking for include file sys/endian.h - not found
[2020-04-27T15:17:17.691Z] -- Looking for include file sys/param.h
[2020-04-27T15:17:17.691Z] -- Looking for include file sys/param.h - found
[2020-04-27T15:17:17.691Z] -- Looking for include file sys/utsname.h
[2020-04-27T15:17:17.941Z] -- Looking for include file sys/utsname.h - found
[2020-04-27T15:17:17.941Z] -- Looking for include file fcntl.h
[2020-04-27T15:17:17.941Z] -- Looking for include file fcntl.h - found
[2020-04-27T15:17:17.941Z] -- Looking for include file unistd.h
[2020-04-27T15:17:18.192Z] -- Looking for include file unistd.h - found
[2020-04-27T15:17:18.192Z] -- Looking for include file wctype.h
[2020-04-27T15:17:18.192Z] -- Looking for include file wctype.h - found
[2020-04-27T15:17:18.192Z] -- Looking for access
[2020-04-27T15:17:18.442Z] -- Looking for access - found
[2020-04-27T15:17:18.442Z] -- Looking for fork
[2020-04-27T15:17:18.442Z] -- Looking for fork - found
[2020-04-27T15:17:18.442Z] -- Looking for getopt
[2020-04-27T15:17:18.692Z] -- Looking for getopt - found
[2020-04-27T15:17:18.692Z] -- Looking for getpid
[2020-04-27T15:17:18.692Z] -- Looking for getpid - found
[2020-04-27T15:17:18.692Z] -- Looking for getpwent
[2020-04-27T15:17:18.693Z] -- Looking for getpwent - found
[2020-04-27T15:17:18.693Z] -- Looking for gmtime_r
[2020-04-27T15:17:18.943Z] -- Looking for gmtime_r - found
[2020-04-27T15:17:18.943Z] -- Looking for localtime_r
[2020-04-27T15:17:18.943Z] -- Looking for localtime_r - found
[2020-04-27T15:17:18.943Z] -- Looking for mkdir
[2020-04-27T15:17:19.193Z] -- Looking for mkdir - found
[2020-04-27T15:17:19.193Z] -- Looking for open
[2020-04-27T15:17:19.193Z] -- Looking for open - found
[2020-04-27T15:17:19.193Z] -- Looking for nanosleep
[2020-04-27T15:17:19.444Z] -- Looking for nanosleep - found
[2020-04-27T15:17:19.444Z] -- Looking for signal
[2020-04-27T15:17:19.444Z] -- Looking for signal - found
[2020-04-27T15:17:19.444Z] -- Looking for stat
[2020-04-27T15:17:19.694Z] -- Looking for stat - found
[2020-04-27T15:17:19.694Z] -- Looking for strdup
[2020-04-27T15:17:19.694Z] -- Looking for strdup - found
[2020-04-27T15:17:19.694Z] -- Looking for strcasecmp
[2020-04-27T15:17:19.694Z] -- Looking for strcasecmp - found
[2020-04-27T15:17:19.694Z] -- Looking for strncasecmp
[2020-04-27T15:17:19.944Z] -- Looking for strncasecmp - found
[2020-04-27T15:17:19.945Z] -- Looking for read
[2020-04-27T15:17:19.945Z] -- Looking for read - found
[2020-04-27T15:17:19.945Z] -- Looking for unlink
[2020-04-27T15:17:20.195Z] -- Looking for unlink - found
[2020-04-27T15:17:20.195Z] -- Looking for usleep
[2020-04-27T15:17:20.195Z] -- Looking for usleep - found
[2020-04-27T15:17:20.195Z] -- Looking for waitpid
[2020-04-27T15:17:20.445Z] -- Looking for waitpid - found
[2020-04-27T15:17:20.445Z] -- Looking for write
[2020-04-27T15:17:20.445Z] -- Looking for write - found
[2020-04-27T15:17:20.445Z] -- Looking for alarm
[2020-04-27T15:17:20.696Z] -- Looking for alarm - found
[2020-04-27T15:17:20.696Z] -- Looking for backtrace
[2020-04-27T15:17:20.696Z] -- Looking for backtrace - found
[2020-04-27T15:17:20.696Z] -- Looking for iswspace
[2020-04-27T15:17:20.946Z] -- Looking for iswspace - found
[2020-04-27T15:17:20.946Z] -- Looking for setenv
[2020-04-27T15:17:20.946Z] -- Looking for setenv - found
[2020-04-27T15:17:20.946Z] -- Looking for unsetenv
[2020-04-27T15:17:20.946Z] -- Looking for unsetenv - found
[2020-04-27T15:17:20.946Z] -- Looking for snprintf
[2020-04-27T15:17:21.197Z] -- Looking for snprintf - found
[2020-04-27T15:17:21.197Z] -- Looking for GetNumberFormat
[2020-04-27T15:17:21.197Z] -- Looking for GetNumberFormat - not found
[2020-04-27T15:17:21.197Z] -- Looking for sys/types.h
[2020-04-27T15:17:21.447Z] -- Looking for sys/types.h - found
[2020-04-27T15:17:21.447Z] -- Looking for stdint.h
[2020-04-27T15:17:21.447Z] -- Looking for stdint.h - found
[2020-04-27T15:17:21.447Z] -- Looking for stddef.h
[2020-04-27T15:17:21.697Z] -- Looking for stddef.h - found
[2020-04-27T15:17:21.697Z] -- Check size of intptr_t
[2020-04-27T15:17:21.697Z] -- Check size of intptr_t - done
[2020-04-27T15:17:21.697Z] -- Check size of pid_t
[2020-04-27T15:17:21.948Z] -- Check size of pid_t - done
[2020-04-27T15:17:21.948Z] -- Check size of size_t
[2020-04-27T15:17:21.948Z] -- Check size of size_t - done
[2020-04-27T15:17:21.948Z] -- Check size of ssize_t
[2020-04-27T15:17:22.198Z] -- Check size of ssize_t - done
[2020-04-27T15:17:22.198Z] -- Check size of time_t
[2020-04-27T15:17:22.198Z] -- Check size of time_t - done
[2020-04-27T15:17:22.198Z] -- Check size of wint_t
[2020-04-27T15:17:22.198Z] -- Check size of wint_t - failed
[2020-04-27T15:17:22.198Z] -- Looking for pthread.h
[2020-04-27T15:17:22.449Z] -- Looking for pthread.h - found
[2020-04-27T15:17:22.449Z] -- Performing Test CMAKE_HAVE_LIBC_PTHREAD
[2020-04-27T15:17:22.449Z] -- Performing Test CMAKE_HAVE_LIBC_PTHREAD - Failed
[2020-04-27T15:17:22.449Z] -- Looking for pthread_create in pthreads
[2020-04-27T15:17:22.699Z] -- Looking for pthread_create in pthreads - not found
[2020-04-27T15:17:22.699Z] -- Looking for pthread_create in pthread
[2020-04-27T15:17:22.699Z] -- Looking for pthread_create in pthread - found
[2020-04-27T15:17:22.699Z] -- Found Threads: TRUE  
[2020-04-27T15:17:22.699Z] -- Looking for pthread_attr_get_np in pthread
[2020-04-27T15:17:22.949Z] -- Looking for pthread_attr_get_np in pthread - not found
[2020-04-27T15:17:22.949Z] -- Looking for pthread_getattr_np in pthread
[2020-04-27T15:17:22.949Z] -- Looking for pthread_getattr_np in pthread - found
[2020-04-27T15:17:22.949Z] -- Looking for pthread_create in pthread
[2020-04-27T15:17:22.949Z] -- Looking for pthread_create in pthread - found
[2020-04-27T15:17:22.949Z] -- Looking for include files pthread.h, pthread_np.h
[2020-04-27T15:17:23.200Z] -- Looking for include files pthread.h, pthread_np.h - not found
[2020-04-27T15:17:23.200Z] -- Found PkgConfig: /usr/bin/pkg-config (found version "1.6.3") 
[2020-04-27T15:17:23.200Z] -- Checking for module 'gobject-introspection-1.0'
[2020-04-27T15:17:23.200Z] --   Found gobject-introspection-1.0, version 1.64.1
[2020-04-27T15:17:23.200Z] -- Checking for modules 'glib-2.0;gobject-2.0'
[2020-04-27T15:17:23.200Z] --   Found glib-2.0, version 2.64.2
[2020-04-27T15:17:23.200Z] --   Found gobject-2.0, version 2.64.2
[2020-04-27T15:17:23.200Z] -- Checking for module 'libxml-2.0'
[2020-04-27T15:17:23.200Z] --   Found libxml-2.0, version 2.9.10
[2020-04-27T15:17:23.450Z] -- Performing Test HAVE_GCC_UNUSED_BUT_SET
[2020-04-27T15:17:23.451Z] -- Performing Test HAVE_GCC_UNUSED_BUT_SET - Success
[2020-04-27T15:17:23.451Z] -- Performing Test HAVE_GCC_LOGICAL_OP
[2020-04-27T15:17:23.451Z] -- Performing Test HAVE_GCC_LOGICAL_OP - Success
[2020-04-27T15:17:23.451Z] -- Performing Test HAVE_GCC_POINTER_MEMACCESS
[2020-04-27T15:17:23.701Z] -- Performing Test HAVE_GCC_POINTER_MEMACCESS - Success
[2020-04-27T15:17:23.701Z] -- Performing Test HAVE_GCC_FORMAT_SECURITY
[2020-04-27T15:17:23.701Z] -- Performing Test HAVE_GCC_FORMAT_SECURITY - Success
[2020-04-27T15:17:23.701Z] -- Performing Test HAVE_GCC_REDUNDANT_DECLS
[2020-04-27T15:17:23.952Z] -- Performing Test HAVE_GCC_REDUNDANT_DECLS - Success
[2020-04-27T15:17:23.952Z] -- Performing Test HAVE_GXX_UNUSED_BUT_SET
[2020-04-27T15:17:23.952Z] -- Performing Test HAVE_GXX_UNUSED_BUT_SET - Success
[2020-04-27T15:17:23.952Z] -- Performing Test HAVE_GXX_LOGICAL_OP
[2020-04-27T15:17:24.202Z] -- Performing Test HAVE_GXX_LOGICAL_OP - Success
[2020-04-27T15:17:24.202Z] -- Performing Test HAVE_GXX_POINTER_MEMACCESS
[2020-04-27T15:17:24.202Z] -- Performing Test HAVE_GXX_POINTER_MEMACCESS - Success
[2020-04-27T15:17:24.202Z] -- Performing Test HAVE_GXX_REORDER
[2020-04-27T15:17:24.453Z] -- Performing Test HAVE_GXX_REORDER - Success
[2020-04-27T15:17:24.453Z] -- Performing Test HAVE_GXX_FORMAT_SECURITY
[2020-04-27T15:17:24.453Z] -- Performing Test HAVE_GXX_FORMAT_SECURITY - Success
[2020-04-27T15:17:24.453Z] -- Performing Test HAVE_GXX_REDUNDANT_DECLS
[2020-04-27T15:17:24.453Z] -- Performing Test HAVE_GXX_REDUNDANT_DECLS - Success
[2020-04-27T15:17:24.703Z] -- Found Doxygen: /usr/bin/doxygen (found version "1.8.17") found components: doxygen dot 
[2020-04-27T15:17:24.703Z] -- The following features have been enabled:
[2020-04-27T15:17:24.703Z] 
[2020-04-27T15:17:24.703Z]  * Option WITH_CXX_BINDINGS, build the C++ bindings. Requires a C++ compiler
[2020-04-27T15:17:24.703Z]  * Option SHARED_ONLY, build shared libraries only
[2020-04-27T15:17:24.703Z]  * RSCALE support (RFC7529), build in RSCALE support
[2020-04-27T15:17:24.703Z]  * Berkeley DB storage support, build in support for Berkeley DB storage
[2020-04-27T15:17:24.703Z]  * Option GOBJECT_INTROSPECTION, build GObject introspection "typelib" files
[2020-04-27T15:17:24.703Z]  * Option ICAL_BUILD_DOCS, build API documentation and reference manual
[2020-04-27T15:17:24.703Z]  * Option ICAL_GLIB_VAPI, build Vala "vapi" files
[2020-04-27T15:17:24.703Z]  * Option ICAL_GLIB, build libical-glib interface
[2020-04-27T15:17:24.703Z]  * Option LIBICAL_BUILD_TESTING, build tests
[2020-04-27T15:17:24.703Z]  * libical-glib testing, python3 is required to run the regression tests
[2020-04-27T15:17:24.703Z] 
[2020-04-27T15:17:24.703Z] -- The following OPTIONAL packages have been found:
[2020-04-27T15:17:24.703Z] 
[2020-04-27T15:17:24.703Z]  * BDB, Berkeley DB storage, <https://www.oracle.com/database/berkeley-db>
[2020-04-27T15:17:24.703Z]    For Berkeley DB storage support
[2020-04-27T15:17:24.703Z]  * GLib (required version >= 2.32), A library of handy utility functions, <https://www.gtk.org>
[2020-04-27T15:17:24.703Z]    For the optional libical-glib interface
[2020-04-27T15:17:24.703Z]  * PkgConfig
[2020-04-27T15:17:24.703Z]  * LibXML (required version >= 2.7.3), a library providing XML and HTML support, <http://xmlsoft.org>
[2020-04-27T15:17:24.703Z]    For the optional libical-glib interface
[2020-04-27T15:17:24.703Z]  * Doxygen, API Documentation system, <http://www.doxygen.org>
[2020-04-27T15:17:24.703Z]    Needed to build the API documention.
[2020-04-27T15:17:24.703Z] 
[2020-04-27T15:17:24.703Z] -- The following RECOMMENDED packages have been found:
[2020-04-27T15:17:24.703Z] 
[2020-04-27T15:17:24.703Z]  * ICU, libicu (International Components for Unicode) libraries, <http://www.icu-project.org>
[2020-04-27T15:17:24.703Z]    For RSCALE (RFC7529) support
[2020-04-27T15:17:24.703Z] 
[2020-04-27T15:17:24.703Z] -- The following REQUIRED packages have been found:
[2020-04-27T15:17:24.703Z] 
[2020-04-27T15:17:24.703Z]  * Perl
[2020-04-27T15:17:24.703Z]    Required by the libical build system.
[2020-04-27T15:17:24.703Z]  * GObjectIntrospection (required version >= 0.6.7), <https://wiki.gnome.org/Projects/GObjectIntrospection>
[2020-04-27T15:17:24.703Z]    Required in order to build the GObject introspection "typelib" files.
[2020-04-27T15:17:24.703Z] 
[2020-04-27T15:17:24.703Z] -- The following features have been disabled:
[2020-04-27T15:17:24.703Z] 
[2020-04-27T15:17:24.703Z]  * Option STATIC_ONLY, build static libraries only
[2020-04-27T15:17:24.703Z]  * Option ICAL_ERRORS_ARE_FATAL, icalerror_* calls will abort instead of internally signaling an error
[2020-04-27T15:17:24.703Z]  * Option ICAL_ALLOW_EMPTY_PROPERTIES, prevents empty properties from being replaced with X-LIC-ERROR properties
[2020-04-27T15:17:24.703Z]  * Option USE_BUILTIN_TZDATA, use our own timezone data rather then the system timezone data
[2020-04-27T15:17:24.703Z] 
[2020-04-27T15:17:24.703Z] -- Configuring done
[2020-04-27T15:17:24.703Z] -- Generating done
[2020-04-27T15:17:24.703Z] -- Build files have been written to: /build/libical/src/build
[2020-04-27T15:17:24.703Z] Scanning dependencies of target ical-header
[2020-04-27T15:17:24.703Z] Scanning dependencies of target src-generator
[2020-04-27T15:17:24.703Z] Scanning dependencies of target icalss-header
[2020-04-27T15:17:24.703Z] [  1%] Generating icalderivedvalue.c
[2020-04-27T15:17:24.703Z] [  2%] Building C object src/libical-glib/CMakeFiles/src-generator.dir/tools/generator.c.o
[2020-04-27T15:17:24.703Z] [  2%] Generating icalss.h
[2020-04-27T15:17:24.954Z] [  3%] Generating icalderivedproperty.c
[2020-04-27T15:17:24.954Z] [  4%] Generating icalrestriction.c
[2020-04-27T15:17:24.954Z] [  4%] Generating icalderivedparameter.c
[2020-04-27T15:17:24.954Z] [  4%] Generating icalderivedproperty.h
[2020-04-27T15:17:24.954Z] [  5%] Generating icalderivedparameter.h
[2020-04-27T15:17:24.954Z] [  6%] Generating icalderivedvalue.h
[2020-04-27T15:17:24.954Z] [  7%] Building C object src/libical-glib/CMakeFiles/src-generator.dir/tools/xml-parser.c.o
[2020-04-27T15:17:24.954Z] [  8%] Generating ical.h
[2020-04-27T15:17:24.954Z] [  8%] Built target ical-header
[2020-04-27T15:17:24.954Z] [  8%] Built target icalss-header
[2020-04-27T15:17:24.954Z] Scanning dependencies of target ical
[2020-04-27T15:17:24.954Z] [  9%] Building C object src/libical/CMakeFiles/ical.dir/icalderivedvalue.c.o
[2020-04-27T15:17:24.954Z] [  9%] Building C object src/libical/CMakeFiles/ical.dir/icalderivedparameter.c.o
[2020-04-27T15:17:24.954Z] [ 10%] Building C object src/libical/CMakeFiles/ical.dir/icalattach.c.o
[2020-04-27T15:17:24.954Z] [ 10%] Building C object src/libical/CMakeFiles/ical.dir/icalenums.c.o
[2020-04-27T15:17:24.954Z] [ 11%] Building C object src/libical/CMakeFiles/ical.dir/icalrecur.c.o
[2020-04-27T15:17:24.954Z] [ 13%] Building C object src/libical/CMakeFiles/ical.dir/icalrestriction.c.o
[2020-04-27T15:17:24.954Z] [ 13%] Building C object src/libical/CMakeFiles/ical.dir/icalderivedproperty.c.o
[2020-04-27T15:17:24.954Z] [ 14%] Building C object src/libical/CMakeFiles/ical.dir/icalproperty.c.o
[2020-04-27T15:17:24.954Z] [ 15%] Building C object src/libical/CMakeFiles/ical.dir/icalerror.c.o
[2020-04-27T15:17:24.954Z] [ 15%] Building C object src/libical/CMakeFiles/ical.dir/icaltime.c.o
[2020-04-27T15:17:24.954Z] [ 15%] Building C object src/libical/CMakeFiles/ical.dir/icalarray.c.o
[2020-04-27T15:17:24.954Z] [ 16%] Building C object src/libical/CMakeFiles/ical.dir/icalcomponent.c.o
[2020-04-27T15:17:24.954Z] [ 17%] Building C object src/libical/CMakeFiles/ical.dir/icalmemory.c.o
[2020-04-27T15:17:24.954Z] [ 17%] Building C object src/libical/CMakeFiles/ical.dir/icalmime.c.o
[2020-04-27T15:17:24.954Z] [ 18%] Building C object src/libical/CMakeFiles/ical.dir/icaltz-util.c.o
[2020-04-27T15:17:24.954Z] [ 19%] Building C object src/libical/CMakeFiles/ical.dir/icalparameter.c.o
[2020-04-27T15:17:24.954Z] [ 19%] Building C object src/libical/CMakeFiles/ical.dir/icalparser.c.o
[2020-04-27T15:17:24.954Z] [ 20%] Building C object src/libical/CMakeFiles/ical.dir/icaltimezone.c.o
[2020-04-27T15:17:24.954Z] [ 20%] Building C object src/libical/CMakeFiles/ical.dir/icalduration.c.o
[2020-04-27T15:17:24.954Z] [ 21%] Building C object src/libical/CMakeFiles/ical.dir/icaltypes.c.o
[2020-04-27T15:17:24.954Z] [ 22%] Building C object src/libical/CMakeFiles/ical.dir/icalperiod.c.o
[2020-04-27T15:17:24.954Z] [ 22%] Building C object src/libical/CMakeFiles/ical.dir/icalvalue.c.o
[2020-04-27T15:17:25.204Z] [ 24%] Building C object src/libical/CMakeFiles/ical.dir/sspm.c.o
[2020-04-27T15:17:25.204Z] [ 24%] Building C object src/libical/CMakeFiles/ical.dir/pvl.c.o
[2020-04-27T15:17:25.204Z] [ 24%] Building C object src/libical/CMakeFiles/ical.dir/icallangbind.c.o
[2020-04-27T15:17:25.204Z] [ 25%] Building C object src/libical/CMakeFiles/ical.dir/caldate.c.o
[2020-04-27T15:17:25.204Z] /build/libical/src/libical-3.0.8/src/libical/icalparser.c: In function ���������icalparser_string_line_generator���������:
[2020-04-27T15:17:25.204Z] /build/libical/src/libical-3.0.8/src/libical/icalparser.c:1327:5: warning: ���������strncpy��������� specified bound depends on the length of the source argument [-Wstringop-overflow=]
[2020-04-27T15:17:25.204Z]  1327 |     strncpy(out, data->pos, size);
[2020-04-27T15:17:25.204Z]       |     ^~~~~~~~~~~~~~~~~~~~~~~~~~~~~
[2020-04-27T15:17:25.204Z] /build/libical/src/libical-3.0.8/src/libical/icalparser.c:1312:20: note: length computed here
[2020-04-27T15:17:25.204Z]  1312 |             size = strlen(data->pos);
[2020-04-27T15:17:25.204Z]       |                    ^~~~~~~~~~~~~~~~~
[2020-04-27T15:17:25.204Z] /build/libical/src/libical-3.0.8/src/libical/icalvalue.c: In function ���������print_date_to_string.part.0���������:
[2020-04-27T15:17:25.204Z] /build/libical/src/libical-3.0.8/src/libical/icalvalue.c:1001:9: warning: ���������strncat��������� output may be truncated copying 8 bytes from a string of length 19 [-Wstringop-truncation]
[2020-04-27T15:17:25.204Z]  1001 |         strncat(str, temp, 8);
[2020-04-27T15:17:25.204Z]       |         ^~~~~~~~~~~~~~~~~~~~~
[2020-04-27T15:17:25.204Z] In function ���������print_time_to_string���������,
[2020-04-27T15:17:25.204Z]     inlined from ���������print_datetime_to_string��������� at /build/libical/src/libical-3.0.8/src/libical/icalvalue.c:1032:13,
[2020-04-27T15:17:25.204Z]     inlined from ���������print_datetime_to_string��������� at /build/libical/src/libical-3.0.8/src/libical/icalvalue.c:1021:6:
[2020-04-27T15:17:25.204Z] /build/libical/src/libical-3.0.8/src/libical/icalvalue.c:988:13: warning: ���������strncat��������� output may be truncated copying 6 bytes from a string of length 19 [-Wstringop-truncation]
[2020-04-27T15:17:25.204Z]   988 |             strncat(str, temp, 6);
[2020-04-27T15:17:25.204Z]       |             ^~~~~~~~~~~~~~~~~~~~~
[2020-04-27T15:17:25.204Z] /build/libical/src/libical-3.0.8/src/libical/icalvalue.c:985:13: warning: ���������strncat��������� output may be truncated copying 7 bytes from a string of length 19 [-Wstringop-truncation]
[2020-04-27T15:17:25.204Z]   985 |             strncat(str, temp, 7);
[2020-04-27T15:17:25.204Z]       |             ^~~~~~~~~~~~~~~~~~~~~
[2020-04-27T15:17:25.205Z] In function ���������print_datetime_to_string���������,
[2020-04-27T15:17:25.205Z]     inlined from ���������print_datetime_to_string��������� at /build/libical/src/libical-3.0.8/src/libical/icalvalue.c:1021:6:
[2020-04-27T15:17:25.205Z] /build/libical/src/libical-3.0.8/src/libical/icalvalue.c:1033:13: warning: ���������strncat��������� output may be truncated copying 19 bytes from a string of length 19 [-Wstringop-truncation]
[2020-04-27T15:17:25.205Z]  1033 |             strncat(str, temp, 19);
[2020-04-27T15:17:25.205Z]       |             ^~~~~~~~~~~~~~~~~~~~~~
[2020-04-27T15:17:25.205Z] /build/libical/src/libical-3.0.8/src/libical/icalvalue.c: In function ���������icalvalue_as_ical_string_r���������:
[2020-04-27T15:17:25.205Z] /build/libical/src/libical-3.0.8/src/libical/icalvalue.c:905:33: warning: ���������%02d��������� directive output may be truncated writing between 2 and 8 bytes into a region of size between 2 and 6 [-Wformat-truncation=]
[2020-04-27T15:17:25.205Z]   905 |         snprintf(str, 9, "%c%02d%02d", sign, abs(h), abs(m));
[2020-04-27T15:17:25.205Z]       |                                 ^~~~
[2020-04-27T15:17:25.205Z] /build/libical/src/libical-3.0.8/src/libical/icalvalue.c:905:26: note: directive argument in the range [0, 35791394]
[2020-04-27T15:17:25.205Z]   905 |         snprintf(str, 9, "%c%02d%02d", sign, abs(h), abs(m));
[2020-04-27T15:17:25.205Z]       |                          ^~~~~~~~~~~~
[2020-04-27T15:17:25.205Z] /build/libical/src/libical-3.0.8/src/libical/icalvalue.c:905:9: note: ���������snprintf��������� output between 6 and 16 bytes into a destination of size 9
[2020-04-27T15:17:25.205Z]   905 |         snprintf(str, 9, "%c%02d%02d", sign, abs(h), abs(m));
[2020-04-27T15:17:25.205Z]       |         ^~~~~~~~~~~~~~~~~~~~~~~~~~~~~~~~~~~~~~~~~~~~~~~~~~~~
[2020-04-27T15:17:25.205Z] /build/libical/src/libical-3.0.8/src/libical/icalvalue.c:903:33: warning: ���������%02d��������� directive output may be truncated writing between 2 and 8 bytes into a region of size between 2 and 6 [-Wformat-truncation=]
[2020-04-27T15:17:25.205Z]   903 |         snprintf(str, 9, "%c%02d%02d%02d", sign, abs(h), abs(m), abs(s));
[2020-04-27T15:17:25.205Z]       |                                 ^~~~
[2020-04-27T15:17:25.205Z] /build/libical/src/libical-3.0.8/src/libical/icalvalue.c:903:26: note: directive argument in the range [0, 35791394]
[2020-04-27T15:17:25.205Z]   903 |         snprintf(str, 9, "%c%02d%02d%02d", sign, abs(h), abs(m), abs(s));
[2020-04-27T15:17:25.205Z]       |                          ^~~~~~~~~~~~~~~~
[2020-04-27T15:17:25.205Z] /build/libical/src/libical-3.0.8/src/libical/icalvalue.c:903:26: note: directive argument in the range [1, 2147483647]
[2020-04-27T15:17:25.205Z] /build/libical/src/libical-3.0.8/src/libical/icalvalue.c:903:9: note: ���������snprintf��������� output between 8 and 26 bytes into a destination of size 9
[2020-04-27T15:17:25.205Z]   903 |         snprintf(str, 9, "%c%02d%02d%02d", sign, abs(h), abs(m), abs(s));
[2020-04-27T15:17:25.205Z]       |         ^~~~~~~~~~~~~~~~~~~~~~~~~~~~~~~~~~~~~~~~~~~~~~~~~~~~~~~~~~~~~~~~
[2020-04-27T15:17:25.455Z] /build/libical/src/libical-3.0.8/src/libical/sspm.c: In function ���������sspm_write_part.isra.0���������:
[2020-04-27T15:17:25.455Z] /build/libical/src/libical-3.0.8/src/libical/sspm.c:1199:34: warning: ���������%02X��������� directive output may be truncated writing between 2 and 8 bytes into a region of size 3 [-Wformat-truncation=]
[2020-04-27T15:17:25.455Z]  1199 |     snprintf(tmp, sizeof(tmp), "=%02X", (unsigned int)ch);
[2020-04-27T15:17:25.455Z]       |                                  ^~~~
[2020-04-27T15:17:25.455Z] /build/libical/src/libical-3.0.8/src/libical/sspm.c:1199:32: note: directive argument in the range [1, 4294967295]
[2020-04-27T15:17:25.455Z]  1199 |     snprintf(tmp, sizeof(tmp), "=%02X", (unsigned int)ch);
[2020-04-27T15:17:25.455Z]       |                                ^~~~~~~
[2020-04-27T15:17:25.455Z] /build/libical/src/libical-3.0.8/src/libical/sspm.c:1199:5: note: ���������snprintf��������� output between 4 and 10 bytes into a destination of size 4
[2020-04-27T15:17:25.455Z]  1199 |     snprintf(tmp, sizeof(tmp), "=%02X", (unsigned int)ch);
[2020-04-27T15:17:25.455Z]       |     ^~~~~~~~~~~~~~~~~~~~~~~~~~~~~~~~~~~~~~~~~~~~~~~~~~~~~
[2020-04-27T15:17:25.455Z] /build/libical/src/libical-3.0.8/src/libical/icaltimezone.c: In function ���������icaltimezone_dump_changes���������:
[2020-04-27T15:17:25.455Z] /build/libical/src/libical-3.0.8/src/libical/icaltimezone.c:1968:46: warning: ���������%02i��������� directive output may be truncated writing 2 bytes into a region of size between 1 and 5 [-Wformat-truncation=]
[2020-04-27T15:17:25.455Z]  1968 |         snprintf(buffer, buffer_size, "%s%02i%02i%02i", sign, hours, minutes, seconds);
[2020-04-27T15:17:25.455Z]       |                                              ^~~~
[2020-04-27T15:17:25.455Z] /build/libical/src/libical-3.0.8/src/libical/icaltimezone.c:1968:39: note: directive argument in the range [0, 59]
[2020-04-27T15:17:25.455Z]  1968 |         snprintf(buffer, buffer_size, "%s%02i%02i%02i", sign, hours, minutes, seconds);
[2020-04-27T15:17:25.455Z]       |                                       ^~~~~~~~~~~~~~~~
[2020-04-27T15:17:25.455Z] /build/libical/src/libical-3.0.8/src/libical/icaltimezone.c:1968:39: note: directive argument in the range [1, 59]
[2020-04-27T15:17:25.455Z] /build/libical/src/libical-3.0.8/src/libical/icaltimezone.c:1968:9: note: ���������snprintf��������� output between 8 and 12 bytes into a destination of size 8
[2020-04-27T15:17:25.455Z]  1968 |         snprintf(buffer, buffer_size, "%s%02i%02i%02i", sign, hours, minutes, seconds);
[2020-04-27T15:17:25.455Z]       |         ^~~~~~~~~~~~~~~~~~~~~~~~~~~~~~~~~~~~~~~~~~~~~~~~~~~~~~~~~~~~~~~~~~~~~~~~~~~~~~
[2020-04-27T15:17:25.455Z] /build/libical/src/libical-3.0.8/src/libical/icaltimezone.c:1966:46: warning: ���������%02i��������� directive output may be truncated writing 2 bytes into a region of size between 1 and 5 [-Wformat-truncation=]
[2020-04-27T15:17:25.455Z]  1966 |         snprintf(buffer, buffer_size, "%s%02i%02i", sign, hours, minutes);
[2020-04-27T15:17:25.455Z]       |                                              ^~~~
[2020-04-27T15:17:25.455Z] /build/libical/src/libical-3.0.8/src/libical/icaltimezone.c:1966:39: note: directive argument in the range [0, 59]
[2020-04-27T15:17:25.455Z]  1966 |         snprintf(buffer, buffer_size, "%s%02i%02i", sign, hours, minutes);
[2020-04-27T15:17:25.455Z]       |                                       ^~~~~~~~~~~~
[2020-04-27T15:17:25.455Z] /build/libical/src/libical-3.0.8/src/libical/icaltimezone.c:1966:9: note: ���������snprintf��������� output between 6 and 10 bytes into a destination of size 8
[2020-04-27T15:17:25.455Z]  1966 |         snprintf(buffer, buffer_size, "%s%02i%02i", sign, hours, minutes);
[2020-04-27T15:17:25.455Z]       |         ^~~~~~~~~~~~~~~~~~~~~~~~~~~~~~~~~~~~~~~~~~~~~~~~~~~~~~~~~~~~~~~~~
[2020-04-27T15:17:25.706Z] [ 25%] Linking C executable ../../bin/src-generator
[2020-04-27T15:17:25.706Z] /usr/bin/ld: warning: libicuuc.so.65, needed by /usr/lib/gcc/x86_64-pc-linux-gnu/9.3.0/../../../../lib/libxml2.so, not found (try using -rpath or -rpath-link)
[2020-04-27T15:17:25.706Z] /usr/bin/ld: /usr/lib/gcc/x86_64-pc-linux-gnu/9.3.0/../../../../lib/libxml2.so: undefined reference to `ucnv_close_65'
[2020-04-27T15:17:25.706Z] /usr/bin/ld: /usr/lib/gcc/x86_64-pc-linux-gnu/9.3.0/../../../../lib/libxml2.so: undefined reference to `UCNV_TO_U_CALLBACK_STOP_65'
[2020-04-27T15:17:25.706Z] /usr/bin/ld: /usr/lib/gcc/x86_64-pc-linux-gnu/9.3.0/../../../../lib/libxml2.so: undefined reference to `ucnv_setToUCallBack_65'
[2020-04-27T15:17:25.706Z] /usr/bin/ld: /usr/lib/gcc/x86_64-pc-linux-gnu/9.3.0/../../../../lib/libxml2.so: undefined reference to `UCNV_FROM_U_CALLBACK_STOP_65'
[2020-04-27T15:17:25.706Z] /usr/bin/ld: /usr/lib/gcc/x86_64-pc-linux-gnu/9.3.0/../../../../lib/libxml2.so: undefined reference to `ucnv_convertEx_65'
[2020-04-27T15:17:25.706Z] /usr/bin/ld: /usr/lib/gcc/x86_64-pc-linux-gnu/9.3.0/../../../../lib/libxml2.so: undefined reference to `ucnv_setFromUCallBack_65'
[2020-04-27T15:17:25.706Z] /usr/bin/ld: /usr/lib/gcc/x86_64-pc-linux-gnu/9.3.0/../../../../lib/libxml2.so: undefined reference to `ucnv_open_65'
[2020-04-27T15:17:25.706Z] collect2: error: ld returned 1 exit status
[2020-04-27T15:17:25.706Z] make[2]: *** [src/libical-glib/CMakeFiles/src-generator.dir/build.make:119: bin/src-generator] Error 1
[2020-04-27T15:17:25.706Z] make[1]: *** [CMakeFiles/Makefile2:845: src/libical-glib/CMakeFiles/src-generator.dir/all] Error 2
[2020-04-27T15:17:25.706Z] make[1]: *** Waiting for unfinished jobs....
[2020-04-27T15:17:26.617Z] [ 26%] Linking C shared library ../../lib/libical.so
[2020-04-27T15:17:26.867Z] [ 31%] Built target ical
[2020-04-27T15:17:26.867Z] make: *** [Makefile:161: all] Error 2
[2020-04-27T15:17:26.867Z] ==> ERROR: A failure occurred in build().
[2020-04-27T15:17:26.867Z]     Aborting...
[2020-04-27T15:17:27.778Z] ==> ERROR: Build failed, check /build/buildpkg/goblins-x86_64/jenkins/build
[Pipeline] }
[Pipeline] // dir
Post stage
[Pipeline] emailext
[2020-04-27T15:17:27.861Z] Sending email to: artix-build-failures at artixlinux.org


More information about the artix-build-failures mailing list