[artix-build-failures] [galaxy-gremlins] Failure: sssd

jenkins at artixlinux.org jenkins at artixlinux.org
Thu Apr 23 21:27:58 CEST 2020


   Failure

   Build: repos/community-testing-x86_64

   Packages:

   [sssd-2.2.3-7-x86_64.pkg.tar.xz]

   authorName: alium

   authorEmail: alium at artixlinux.org

   [1]https://orion.artixlinux.org/job/packagesS/job/sssd/job/master/22/

References

   1. https://orion.artixlinux.org/job/packagesS/job/sssd/job/master/22/
-------------- next part --------------
Push event to branch master
Querying the current revision of branch master...
Current revision of branch master is 0339c79e5996d774353ccd005da1f2c88f1f3088
Obtained Jenkinsfile from 0339c79e5996d774353ccd005da1f2c88f1f3088
Running in Durability level: PERFORMANCE_OPTIMIZED
Loading library artix-ci at master
Attempting to resolve master from remote references...
 > git --version # timeout=10
 > git ls-remote -- https://gitea.artixlinux.org/artix/pipeline-libs.git # timeout=10
Found match: refs/heads/master revision 77f77ff85eedb6eb60b64faf8c328ab86dbb479c
Warning: CredentialId "gitea-ci" could not be found.
 > git rev-parse --is-inside-work-tree # timeout=10
Fetching changes from the remote Git repository
 > git config remote.origin.url https://gitea.artixlinux.org/artix/pipeline-libs.git # timeout=10
Fetching without tags
Fetching upstream changes from https://gitea.artixlinux.org/artix/pipeline-libs.git
 > git --version # timeout=10
 > git fetch --no-tags --force --progress -- https://gitea.artixlinux.org/artix/pipeline-libs.git +refs/heads/master:refs/remotes/origin/master # timeout=10
Checking out Revision 77f77ff85eedb6eb60b64faf8c328ab86dbb479c (master)
 > git config core.sparsecheckout # timeout=10
 > git checkout -f 77f77ff85eedb6eb60b64faf8c328ab86dbb479c # timeout=10
Commit message: "Notify: remove fail condition"
[Gitea] Notifying branch build status: PENDING Build started...
[Gitea] Notified
[Pipeline] Start of Pipeline
[Pipeline] node
Running on Jenkins in /build/jenkins/workspace/packagesS_sssd_master
[Pipeline] {
[Pipeline] timestamps
[Pipeline] {
[Pipeline] stage
[Pipeline] { (Prepare)
[Pipeline] checkout
[2020-04-23T19:27:29.765Z] Warning: CredentialId "jenkins-ci" could not be found.
[2020-04-23T19:27:29.765Z]  > git rev-parse --is-inside-work-tree # timeout=10
[2020-04-23T19:27:29.770Z] Fetching changes from the remote Git repository
[2020-04-23T19:27:29.770Z]  > git config remote.origin.url https://237b7412742b4068af4173944de150f12959f4d3@gitea.artixlinux.org/packagesS/sssd.git # timeout=10
[2020-04-23T19:27:29.774Z] Cleaning workspace
[2020-04-23T19:27:29.774Z]  > git rev-parse --verify HEAD # timeout=10
[2020-04-23T19:27:29.780Z] Resetting working tree
[2020-04-23T19:27:29.780Z]  > git reset --hard # timeout=10
[2020-04-23T19:27:29.786Z]  > git clean -fdx # timeout=10
[2020-04-23T19:27:29.792Z] Fetching without tags
[2020-04-23T19:27:29.792Z] Fetching upstream changes from https://237b7412742b4068af4173944de150f12959f4d3@gitea.artixlinux.org/packagesS/sssd.git
[2020-04-23T19:27:29.792Z]  > git --version # timeout=10
[2020-04-23T19:27:29.797Z]  > git fetch --no-tags --force --progress -- https://237b7412742b4068af4173944de150f12959f4d3@gitea.artixlinux.org/packagesS/sssd.git +refs/heads/master:refs/remotes/origin/master # timeout=10
[2020-04-23T19:27:29.934Z] Checking out Revision 0339c79e5996d774353ccd005da1f2c88f1f3088 (master)
[2020-04-23T19:27:29.934Z]  > git config core.sparsecheckout # timeout=10
[2020-04-23T19:27:29.939Z]  > git checkout -f 0339c79e5996d774353ccd005da1f2c88f1f3088 # timeout=10
[2020-04-23T19:27:29.948Z] Commit message: "[trunk] -> [community-testing] 'sssd-2.2.3-7' add"
[2020-04-23T19:27:29.948Z]  > git rev-list --no-walk 1331cf318625b273de6084fcc5bc4bca2f8e21fe # timeout=10
[2020-04-23T19:27:29.960Z] [Gitea] Notifying branch build status: PENDING Build started...
[2020-04-23T19:27:30.107Z] [Gitea] Notified
[Pipeline] libraryResource
[Pipeline] readYaml
[Pipeline] sh
[2020-04-23T19:27:30.380Z] + git rev-parse @
[Pipeline] sh
[2020-04-23T19:27:30.638Z] + git show -s --format=%an 0339c79e5996d774353ccd005da1f2c88f1f3088
[Pipeline] sh
[2020-04-23T19:27:30.895Z] + git show -s --format=%ae 0339c79e5996d774353ccd005da1f2c88f1f3088
[Pipeline] sh
[2020-04-23T19:27:31.152Z] + git show --pretty=format: --name-status 0339c79e5996d774353ccd005da1f2c88f1f3088
[Pipeline] fileExists
[Pipeline] sh
[2020-04-23T19:27:31.417Z] + pkg2yaml repos/community-testing-x86_64
[Pipeline] readYaml
[Pipeline] }
[Pipeline] // stage
[Pipeline] stage
[Pipeline] { (Build)
[Pipeline] echo
[2020-04-23T19:27:31.521Z] isRebuild: false
[Pipeline] dir
[2020-04-23T19:27:31.527Z] Running in /build/jenkins/workspace/packagesS_sssd_master/repos/community-testing-x86_64
[Pipeline] {
[Pipeline] sh
[2020-04-23T19:27:31.788Z] + buildpkg-galaxy-gremlins
[2020-04-23T19:27:35.018Z] :: Synchronizing package databases...
[2020-04-23T19:27:35.018Z]  gremlins is up to date
[2020-04-23T19:27:35.018Z]  system is up to date
[2020-04-23T19:27:35.018Z]  world is up to date
[2020-04-23T19:27:35.018Z]  galaxy-gremlins is up to date
[2020-04-23T19:27:35.018Z]  galaxy is up to date
[2020-04-23T19:27:35.018Z]  testing is up to date
[2020-04-23T19:27:35.018Z]  extra is up to date
[2020-04-23T19:27:35.018Z]  community-testing is up to date
[2020-04-23T19:27:35.018Z]  community is up to date
[2020-04-23T19:27:35.018Z] :: Starting full system upgrade...
[2020-04-23T19:27:35.018Z]  there is nothing to do
[2020-04-23T19:27:35.568Z] ==> Building in chroot for [gremlins] (x86_64)...
[2020-04-23T19:27:36.479Z] ==> Synchronizing chroot copy [/build/buildpkg/gremlins-x86_64/root] -> [jenkins]...done
[2020-04-23T19:27:37.390Z] ==> Making package: sssd 2.2.3-7 (Thu Apr 23 21:27:37 2020)
[2020-04-23T19:27:37.390Z] ==> Retrieving sources...
[2020-04-23T19:27:37.390Z]   -> Found sssd-2.2.3.tar.gz
[2020-04-23T19:27:37.390Z]   -> Found sssd-2.2.3.tar.gz.asc
[2020-04-23T19:27:37.390Z]   -> Found ndr_get.patch
[2020-04-23T19:27:37.390Z]   -> Found samba-4.12-fix.patch
[2020-04-23T19:27:37.390Z]   -> Found kerberos-1.18-fix.patch
[2020-04-23T19:27:37.390Z] ==> Validating source files with sha512sums...
[2020-04-23T19:27:37.390Z]     sssd-2.2.3.tar.gz ... Passed
[2020-04-23T19:27:37.390Z]     sssd-2.2.3.tar.gz.asc ... Skipped
[2020-04-23T19:27:37.390Z]     ndr_get.patch ... Passed
[2020-04-23T19:27:37.390Z]     samba-4.12-fix.patch ... Passed
[2020-04-23T19:27:37.390Z]     kerberos-1.18-fix.patch ... Passed
[2020-04-23T19:27:37.390Z] ==> Verifying source file signatures with gpg...
[2020-04-23T19:27:37.640Z]     sssd-2.2.3.tar.gz ... Passed (WARNING: the key has expired.)
[2020-04-23T19:27:37.640Z] ==> WARNING: Warnings have occurred while verifying the signatures.
[2020-04-23T19:27:37.640Z]     Please make sure you really trust them.
[2020-04-23T19:27:42.834Z] ==> Making package: sssd 2.2.3-7 (Thu 23 Apr 2020 07:27:41 PM UTC)
[2020-04-23T19:27:42.834Z] ==> Checking runtime dependencies...
[2020-04-23T19:27:42.834Z] ==> Installing missing dependencies...
[2020-04-23T19:27:42.834Z] :: There are 2 providers available for libtevent.so:
[2020-04-23T19:27:42.834Z] :: Repository world
[2020-04-23T19:27:42.834Z]    1) tevent
[2020-04-23T19:27:42.834Z] :: Repository extra
[2020-04-23T19:27:42.834Z]    2) tevent
[2020-04-23T19:27:42.834Z] 
[2020-04-23T19:27:42.834Z] Enter a number (default=1): 
[2020-04-23T19:27:42.834Z] :: There are 4 providers available for libldb.so:
[2020-04-23T19:27:42.834Z] :: Repository gremlins
[2020-04-23T19:27:42.834Z]    1) ldb
[2020-04-23T19:27:42.834Z] :: Repository world
[2020-04-23T19:27:42.834Z]    2) ldb
[2020-04-23T19:27:42.834Z] :: Repository testing
[2020-04-23T19:27:42.834Z]    3) ldb
[2020-04-23T19:27:42.834Z] :: Repository extra
[2020-04-23T19:27:42.834Z]    4) ldb
[2020-04-23T19:27:42.834Z] 
[2020-04-23T19:27:42.834Z] Enter a number (default=1): 
[2020-04-23T19:27:42.834Z] resolving dependencies...
[2020-04-23T19:27:42.834Z] :: There are 2 providers available for libjpeg:
[2020-04-23T19:27:42.834Z] :: Repository world
[2020-04-23T19:27:42.834Z]    1) libjpeg-turbo
[2020-04-23T19:27:42.834Z] :: Repository extra
[2020-04-23T19:27:42.834Z]    2) libjpeg-turbo
[2020-04-23T19:27:42.834Z] 
[2020-04-23T19:27:42.834Z] Enter a number (default=1): 
[2020-04-23T19:27:42.834Z] looking for conflicting packages...
[2020-04-23T19:27:42.834Z] warning: dependency cycle detected:
[2020-04-23T19:27:42.834Z] warning: cifs-utils will be installed before its smbclient dependency
[2020-04-23T19:27:42.834Z] 
[2020-04-23T19:27:42.834Z] Package (40)             New Version        Net Change
[2020-04-23T19:27:42.834Z] 
[2020-04-23T19:27:42.834Z] world/avahi              0.8+15+ge8a3dd0-1    1.83 MiB
[2020-04-23T19:27:42.834Z] world/bind-tools         9.16.2-1             5.95 MiB
[2020-04-23T19:27:42.834Z] world/cifs-utils         6.10-1               0.24 MiB
[2020-04-23T19:27:42.834Z] system/dbus              1.12.16-5            0.91 MiB
[2020-04-23T19:27:42.834Z] system/dnssec-anchors    20190629-2           0.00 MiB
[2020-04-23T19:27:42.834Z] system/json-c            0.13.1-3             0.15 MiB
[2020-04-23T19:27:42.834Z] world/libbsd             0.10.0-1             0.33 MiB
[2020-04-23T19:27:42.834Z] world/libcups            2.3.1-1              0.84 MiB
[2020-04-23T19:27:42.834Z] world/libdaemon          0.14-4               0.09 MiB
[2020-04-23T19:27:42.834Z] world/libjpeg-turbo      2.0.4-1              2.10 MiB
[2020-04-23T19:27:42.834Z] galaxy/libmaxminddb      1.4.2-1              0.04 MiB
[2020-04-23T19:27:42.834Z] system/libnsl            1.2.0-2              0.19 MiB
[2020-04-23T19:27:42.834Z] world/libpng             1.6.37-1             0.61 MiB
[2020-04-23T19:27:42.834Z] world/libtiff            4.1.0-1              2.72 MiB
[2020-04-23T19:27:42.834Z] system/libusb            1.0.23-2             0.17 MiB
[2020-04-23T19:27:42.834Z] world/libuv              1.37.0-1             0.51 MiB
[2020-04-23T19:27:42.834Z] world/libx11             1.6.9-6             10.15 MiB
[2020-04-23T19:27:42.834Z] world/libxau             1.0.9-2              0.02 MiB
[2020-04-23T19:27:42.834Z] world/libxcb             1.14-1               3.73 MiB
[2020-04-23T19:27:42.834Z] world/libxdmcp           1.1.3-2              0.13 MiB
[2020-04-23T19:27:42.834Z] world/lmdb               0.9.24-1             0.56 MiB
[2020-04-23T19:27:42.834Z] system/nspr              4.25-1               0.72 MiB
[2020-04-23T19:27:42.834Z] system/popt              1.16-12              0.22 MiB
[2020-04-23T19:27:42.834Z] world/python             3.8.2-2             80.70 MiB
[2020-04-23T19:27:42.834Z] world/python-ply         3.11-4               0.31 MiB
[2020-04-23T19:27:42.834Z] world/talloc             2.3.1-1              0.18 MiB
[2020-04-23T19:27:42.834Z] world/tdb                1.4.3-2              0.23 MiB
[2020-04-23T19:27:42.834Z] world/xcb-proto          1.14-1               0.83 MiB
[2020-04-23T19:27:42.834Z] world/xorgproto          2020.1-1             1.40 MiB
[2020-04-23T19:27:42.834Z] world/bind               9.16.2-1             0.69 MiB
[2020-04-23T19:27:42.834Z] world/c-ares             1.16.0-1             0.19 MiB
[2020-04-23T19:27:42.834Z] world/cyrus-sasl-gssapi  2.1.27-1             0.10 MiB
[2020-04-23T19:27:42.834Z] system/ding-libs         0.6.1-3              0.64 MiB
[2020-04-23T19:27:42.834Z] galaxy/jansson           2.12-1               0.19 MiB
[2020-04-23T19:27:42.834Z] gremlins/ldb             1:2.1.1-1            0.84 MiB
[2020-04-23T19:27:42.834Z] system/libnl             3.5.0-2              2.01 MiB
[2020-04-23T19:27:42.834Z] system/nfsidmap          2.4.3-2              0.20 MiB
[2020-04-23T19:27:42.834Z] system/nss               3.51.1-1             5.02 MiB
[2020-04-23T19:27:42.834Z] gremlins/smbclient       4.12.1-1            25.89 MiB
[2020-04-23T19:27:42.834Z] world/tevent             1:0.10.2-1           0.18 MiB
[2020-04-23T19:27:42.834Z] 
[2020-04-23T19:27:42.834Z] Total Installed Size:  151.79 MiB
[2020-04-23T19:27:42.834Z] 
[2020-04-23T19:27:42.834Z] :: Proceed with installation? [Y/n] 
[2020-04-23T19:27:42.834Z] checking keyring...
[2020-04-23T19:27:42.834Z] checking package integrity...
[2020-04-23T19:27:45.316Z] loading package files...
[2020-04-23T19:27:45.316Z] checking for file conflicts...
[2020-04-23T19:27:45.317Z] checking available disk space...
[2020-04-23T19:27:45.317Z] :: Processing package changes...
[2020-04-23T19:27:45.317Z] installing json-c...
[2020-04-23T19:27:45.317Z] installing libnsl...
[2020-04-23T19:27:45.317Z] installing python...
[2020-04-23T19:27:47.799Z] Optional dependencies for python
[2020-04-23T19:27:47.799Z]     python-setuptools
[2020-04-23T19:27:47.799Z]     python-pip
[2020-04-23T19:27:47.799Z]     sqlite [installed]
[2020-04-23T19:27:47.799Z]     mpdecimal: for decimal
[2020-04-23T19:27:47.799Z]     xz: for lzma [installed]
[2020-04-23T19:27:47.799Z]     tk: for tkinter
[2020-04-23T19:27:47.799Z] installing dnssec-anchors...
[2020-04-23T19:27:47.799Z] installing lmdb...
[2020-04-23T19:27:47.799Z] installing python-ply...
[2020-04-23T19:27:47.799Z] installing libmaxminddb...
[2020-04-23T19:27:47.799Z] Optional dependencies for libmaxminddb
[2020-04-23T19:27:47.799Z]     geoip2-database: IP geolocation databases
[2020-04-23T19:27:47.799Z] installing libuv...
[2020-04-23T19:27:47.799Z] installing bind-tools...
[2020-04-23T19:27:47.799Z] installing bind...
[2020-04-23T19:27:47.799Z] installing c-ares...
[2020-04-23T19:27:47.799Z] installing cyrus-sasl-gssapi...
[2020-04-23T19:27:47.799Z] installing ding-libs...
[2020-04-23T19:27:47.799Z] installing libnl...
[2020-04-23T19:27:47.799Z] installing nspr...
[2020-04-23T19:27:47.799Z] installing nss...
[2020-04-23T19:27:47.799Z] installing popt...
[2020-04-23T19:27:47.799Z] installing talloc...
[2020-04-23T19:27:47.799Z] Optional dependencies for talloc
[2020-04-23T19:27:47.799Z]     python: for python bindings [installed]
[2020-04-23T19:27:47.799Z] installing cifs-utils...
[2020-04-23T19:27:47.799Z] installing tdb...
[2020-04-23T19:27:47.799Z] Optional dependencies for tdb
[2020-04-23T19:27:47.799Z]     python: for python bindings [installed]
[2020-04-23T19:27:47.799Z] installing tevent...
[2020-04-23T19:27:47.799Z] Optional dependencies for tevent
[2020-04-23T19:27:47.799Z]     python: for python bindings [installed]
[2020-04-23T19:27:47.799Z] installing ldb...
[2020-04-23T19:27:47.799Z] Optional dependencies for ldb
[2020-04-23T19:27:47.799Z]     python: for python bindings [installed]
[2020-04-23T19:27:47.799Z] installing libbsd...
[2020-04-23T19:27:47.799Z] installing libjpeg-turbo...
[2020-04-23T19:27:48.049Z] installing libtiff...
[2020-04-23T19:27:48.049Z] Optional dependencies for libtiff
[2020-04-23T19:27:48.049Z]     freeglut: for using tiffgt
[2020-04-23T19:27:48.049Z] installing libpng...
[2020-04-23T19:27:48.049Z] installing libdaemon...
[2020-04-23T19:27:48.049Z] installing xcb-proto...
[2020-04-23T19:27:48.049Z] installing libxdmcp...
[2020-04-23T19:27:48.049Z] installing libxau...
[2020-04-23T19:27:48.049Z] installing libxcb...
[2020-04-23T19:27:48.300Z] installing xorgproto...
[2020-04-23T19:27:48.300Z] installing libx11...
[2020-04-23T19:27:48.550Z] installing dbus...
[2020-04-23T19:27:48.550Z] installing avahi...
[2020-04-23T19:27:48.550Z] Optional dependencies for avahi
[2020-04-23T19:27:48.550Z]     gtk3: avahi-discover, avahi-discover-standalone, bshell, bssh, bvnc
[2020-04-23T19:27:48.550Z]     qt5-base: qt5 bindings
[2020-04-23T19:27:48.550Z]     libevent: libevent bindings
[2020-04-23T19:27:48.550Z]     nss-mdns: NSS support for mDNS
[2020-04-23T19:27:48.550Z]     python-twisted: avahi-bookmarks
[2020-04-23T19:27:48.550Z]     python-gobject: avahi-bookmarks, avahi-discover
[2020-04-23T19:27:48.550Z]     python-dbus: avahi-bookmarks, avahi-discover
[2020-04-23T19:27:48.550Z] installing libusb...
[2020-04-23T19:27:48.550Z] installing libcups...
[2020-04-23T19:27:48.550Z] installing jansson...
[2020-04-23T19:27:48.550Z] installing smbclient...
[2020-04-23T19:27:49.101Z] Optional dependencies for smbclient
[2020-04-23T19:27:49.101Z]     python-dnspython: samba_dnsupdate and samba_upgradedns in AD setup
[2020-04-23T19:27:49.101Z] installing nfsidmap...
[2020-04-23T19:27:49.101Z] :: Running post-transaction hooks...
[2020-04-23T19:27:49.101Z] (1/1) Creating system user accounts...
[2020-04-23T19:27:49.351Z] ==> Checking buildtime dependencies...
[2020-04-23T19:27:49.601Z] ==> Installing missing dependencies...
[2020-04-23T19:27:49.852Z] resolving dependencies...
[2020-04-23T19:27:49.852Z] looking for conflicting packages...
[2020-04-23T19:27:49.852Z] 
[2020-04-23T19:27:49.852Z] Package (28)            New Version     Net Change
[2020-04-23T19:27:49.852Z] 
[2020-04-23T19:27:49.852Z] world/boost-libs        1.72.0-1         10.53 MiB
[2020-04-23T19:27:49.852Z] galaxy/ceph-libs        14.2.8-1.1       52.22 MiB
[2020-04-23T19:27:49.852Z] world/docbook-xml       4.5-8             2.04 MiB
[2020-04-23T19:27:49.852Z] system/hwids            20200306-1        1.74 MiB
[2020-04-23T19:27:49.852Z] world/iniparser         4.1-1             0.07 MiB
[2020-04-23T19:27:49.852Z] system/kbd              2.2.0-5           2.85 MiB
[2020-04-23T19:27:49.852Z] system/kmod             27-1              0.28 MiB
[2020-04-23T19:27:49.852Z] system/ldns             1.7.1-2           1.85 MiB
[2020-04-23T19:27:49.852Z] system/libaio           0.3.112-2         0.02 MiB
[2020-04-23T19:27:49.852Z] system/libedit          20191231_3.1-1    0.25 MiB
[2020-04-23T19:27:49.852Z] world/libxslt           1.1.34-2          2.30 MiB
[2020-04-23T19:27:49.852Z] galaxy/oath-toolkit     2.6.2-7           1.05 MiB
[2020-04-23T19:27:49.852Z] system/pcre2            10.34-3           3.78 MiB
[2020-04-23T19:27:49.852Z] world/perl-error        0.17029-1         0.04 MiB
[2020-04-23T19:27:49.852Z] world/perl-mailtools    2.21-2            0.17 MiB
[2020-04-23T19:27:49.852Z] galaxy/perl-parse-yapp  1.21-2            0.18 MiB
[2020-04-23T19:27:49.852Z] world/perl-timedate     2.32-1            0.08 MiB
[2020-04-23T19:27:49.852Z] world/snappy            1.1.8-1           0.07 MiB
[2020-04-23T19:27:49.852Z] world/xmlsec            1.2.30-1          4.87 MiB
[2020-04-23T19:27:49.852Z] world/check             0.14.0-1          0.17 MiB
[2020-04-23T19:27:49.852Z] galaxy/cmocka           1.1.5-1           0.15 MiB
[2020-04-23T19:27:49.852Z] world/docbook-xsl       1.79.2-5         26.59 MiB
[2020-04-23T19:27:49.852Z] world/doxygen           1.8.17-1         17.92 MiB
[2020-04-23T19:27:49.852Z] system/eudev            3.2.9-4           7.57 MiB
[2020-04-23T19:27:49.852Z] world/git               2.26.2-1         38.36 MiB
[2020-04-23T19:27:49.852Z] community/libfaketime   0.9.8-1           0.14 MiB
[2020-04-23T19:27:49.852Z] system/openssh          8.2p1-3           5.20 MiB
[2020-04-23T19:27:49.852Z] gremlins/samba          4.12.1-1         61.87 MiB
[2020-04-23T19:27:49.852Z] 
[2020-04-23T19:27:49.852Z] Total Installed Size:  242.36 MiB
[2020-04-23T19:27:49.852Z] 
[2020-04-23T19:27:49.852Z] :: Proceed with installation? [Y/n] 
[2020-04-23T19:27:49.852Z] checking keyring...
[2020-04-23T19:27:50.102Z] checking package integrity...
[2020-04-23T19:27:51.963Z] loading package files...
[2020-04-23T19:27:51.963Z] checking for file conflicts...
[2020-04-23T19:27:51.963Z] checking available disk space...
[2020-04-23T19:27:51.963Z] :: Processing package changes...
[2020-04-23T19:27:51.963Z] installing libxslt...
[2020-04-23T19:27:51.963Z] installing docbook-xml...
[2020-04-23T19:27:51.963Z] installing docbook-xsl...
[2020-04-23T19:27:52.213Z] installing doxygen...
[2020-04-23T19:27:52.764Z] Optional dependencies for doxygen
[2020-04-23T19:27:52.764Z]     graphviz: for caller/callee graph generation
[2020-04-23T19:27:52.764Z]     qt5-base: for doxywizard
[2020-04-23T19:27:52.764Z] installing iniparser...
[2020-04-23T19:27:52.764Z] installing libaio...
[2020-04-23T19:27:52.764Z] installing perl-parse-yapp...
[2020-04-23T19:27:52.764Z] installing boost-libs...
[2020-04-23T19:27:53.014Z] Optional dependencies for boost-libs
[2020-04-23T19:27:53.014Z]     openmpi: for mpi support
[2020-04-23T19:27:53.014Z] installing xmlsec...
[2020-04-23T19:27:53.014Z] installing oath-toolkit...
[2020-04-23T19:27:53.014Z] installing snappy...
[2020-04-23T19:27:53.014Z] installing kbd...
[2020-04-23T19:27:53.264Z] installing kmod...
[2020-04-23T19:27:53.264Z] installing hwids...
[2020-04-23T19:27:53.264Z] installing eudev...
[2020-04-23T19:27:53.264Z] Optional dependencies for eudev
[2020-04-23T19:27:53.264Z]     eudev-openrc: udev starup scripts for openrc
[2020-04-23T19:27:53.264Z] installing ceph-libs...
[2020-04-23T19:27:54.607Z] installing samba...
[2020-04-23T19:27:54.607Z] warning: directory permissions differ on /etc/sudoers.d/
[2020-04-23T19:27:54.607Z] filesystem: 750  package: 755
[2020-04-23T19:27:55.518Z] Optional dependencies for samba
[2020-04-23T19:27:55.518Z]     python-dnspython: samba_dnsupdate and samba_upgradedns in AD setup
[2020-04-23T19:27:55.518Z] installing perl-error...
[2020-04-23T19:27:55.518Z] installing perl-timedate...
[2020-04-23T19:27:55.518Z] installing perl-mailtools...
[2020-04-23T19:27:55.518Z] installing pcre2...
[2020-04-23T19:27:55.518Z] installing git...
[2020-04-23T19:27:56.428Z] Optional dependencies for git
[2020-04-23T19:27:56.428Z]     tk: gitk and git gui
[2020-04-23T19:27:56.428Z]     perl-libwww: git svn
[2020-04-23T19:27:56.428Z]     perl-term-readkey: git svn and interactive.singlekey setting
[2020-04-23T19:27:56.428Z]     perl-mime-tools: git send-email
[2020-04-23T19:27:56.428Z]     perl-net-smtp-ssl: git send-email TLS support
[2020-04-23T19:27:56.428Z]     perl-authen-sasl: git send-email TLS support
[2020-04-23T19:27:56.428Z]     perl-mediawiki-api: git mediawiki support
[2020-04-23T19:27:56.428Z]     perl-datetime-format-iso8601: git mediawiki support
[2020-04-23T19:27:56.428Z]     perl-lwp-protocol-https: git mediawiki https support
[2020-04-23T19:27:56.428Z]     perl-cgi: gitweb (web interface) support
[2020-04-23T19:27:56.428Z]     python: git svn & git p4 [installed]
[2020-04-23T19:27:56.428Z]     subversion: git svn
[2020-04-23T19:27:56.428Z]     org.freedesktop.secrets: keyring credential helper
[2020-04-23T19:27:56.428Z]     libsecret: libsecret credential helper [installed]
[2020-04-23T19:27:56.428Z] installing check...
[2020-04-23T19:27:56.428Z] Optional dependencies for check
[2020-04-23T19:27:56.428Z]     check-docs: Documentation
[2020-04-23T19:27:56.428Z] installing cmocka...
[2020-04-23T19:27:56.428Z] installing libfaketime...
[2020-04-23T19:27:56.428Z] installing libedit...
[2020-04-23T19:27:56.428Z] installing ldns...
[2020-04-23T19:27:56.428Z] Optional dependencies for ldns
[2020-04-23T19:27:56.428Z]     libpcap: ldns-dpa tool
[2020-04-23T19:27:56.428Z] installing openssh...
[2020-04-23T19:27:56.428Z] Optional dependencies for openssh
[2020-04-23T19:27:56.428Z]     xorg-xauth: X11 forwarding
[2020-04-23T19:27:56.428Z]     x11-ssh-askpass: input passphrase in X
[2020-04-23T19:27:56.429Z]     libfido2: FIDO/U2F support
[2020-04-23T19:27:56.429Z] :: Running post-transaction hooks...
[2020-04-23T19:27:56.429Z] (1/5) Creating system user accounts...
[2020-04-23T19:27:56.429Z] (2/5) Updating udev Hardware Database...
[2020-04-23T19:27:56.679Z] (3/5) Reloading device manager configuration...
[2020-04-23T19:27:56.679Z]   Skipped: Device manager is not running.
[2020-04-23T19:27:56.679Z] (4/5) Warn about old perl modules
[2020-04-23T19:27:56.679Z] (5/5) Updating the info directory file...
[2020-04-23T19:27:56.929Z] ==> Retrieving sources...
[2020-04-23T19:27:56.929Z]   -> Found sssd-2.2.3.tar.gz
[2020-04-23T19:27:56.929Z]   -> Found sssd-2.2.3.tar.gz.asc
[2020-04-23T19:27:56.929Z]   -> Found ndr_get.patch
[2020-04-23T19:27:56.929Z]   -> Found samba-4.12-fix.patch
[2020-04-23T19:27:56.929Z]   -> Found kerberos-1.18-fix.patch
[2020-04-23T19:27:56.929Z] ==> WARNING: Skipping all source file integrity checks.
[2020-04-23T19:27:56.929Z] ==> Extracting sources...
[2020-04-23T19:27:56.929Z]   -> Extracting sssd-2.2.3.tar.gz with bsdtar
[2020-04-23T19:27:57.179Z] ==> Starting prepare()...
[2020-04-23T19:27:57.179Z] patching file src/providers/ad/ad_gpo_ndr.c
[2020-04-23T19:27:57.179Z] patching file src/external/samba.m4
[2020-04-23T19:27:57.179Z] patching file src/providers/ad/ad_gpo_ndr.c
[2020-04-23T19:27:57.179Z] Hunk #1 FAILED at 105.
[2020-04-23T19:27:57.179Z] Hunk #3 FAILED at 127.
[2020-04-23T19:27:57.179Z] Hunk #5 FAILED at 182.
[2020-04-23T19:27:57.179Z] 3 out of 6 hunks FAILED -- saving rejects to file src/providers/ad/ad_gpo_ndr.c.rej
[2020-04-23T19:27:57.179Z] ==> ERROR: A failure occurred in prepare().
[2020-04-23T19:27:57.179Z]     Aborting...
[2020-04-23T19:27:58.090Z] ==> ERROR: Build failed, check /build/buildpkg/gremlins-x86_64/jenkins/build
[Pipeline] }
[Pipeline] // dir
Post stage
[Pipeline] emailext
[2020-04-23T19:27:58.155Z] Sending email to: artix-build-failures at artixlinux.org


More information about the artix-build-failures mailing list