[artix-build-failures] [galaxy] Failure: opendht

jenkins at artixlinux.org jenkins at artixlinux.org
Tue Apr 7 16:51:49 CEST 2020


   Failure

   Build: repos/community-x86_64

   Packages:

   [opendht-1:2.0.0-1.1-x86_64.pkg.tar.xz]

   authorName: Nathan Owens

   authorEmail: ndowens at artixlinux.org

   [1]https://orion.artixlinux.org/job/packagesO/job/opendht/job/master/2/

References

   1. https://orion.artixlinux.org/job/packagesO/job/opendht/job/master/2/
-------------- next part --------------
Push event to branch master
Querying the current revision of branch master...
Current revision of branch master is fc41b2c8bdf3cb76ccd4cc221c3502b5f9cc32b4
Obtained Jenkinsfile from fc41b2c8bdf3cb76ccd4cc221c3502b5f9cc32b4
Running in Durability level: PERFORMANCE_OPTIMIZED
Loading library artix-ci at master
Attempting to resolve master from remote references...
 > git --version # timeout=10
 > git ls-remote -- https://gitea.artixlinux.org/artix/pipeline-libs.git # timeout=10
Found match: refs/heads/master revision 77f77ff85eedb6eb60b64faf8c328ab86dbb479c
Warning: CredentialId "gitea-ci" could not be found.
 > git rev-parse --is-inside-work-tree # timeout=10
Fetching changes from the remote Git repository
 > git config remote.origin.url https://gitea.artixlinux.org/artix/pipeline-libs.git # timeout=10
Fetching without tags
Fetching upstream changes from https://gitea.artixlinux.org/artix/pipeline-libs.git
 > git --version # timeout=10
 > git fetch --no-tags --force --progress -- https://gitea.artixlinux.org/artix/pipeline-libs.git +refs/heads/master:refs/remotes/origin/master # timeout=10
Checking out Revision 77f77ff85eedb6eb60b64faf8c328ab86dbb479c (master)
 > git config core.sparsecheckout # timeout=10
 > git checkout -f 77f77ff85eedb6eb60b64faf8c328ab86dbb479c # timeout=10
Commit message: "Notify: remove fail condition"
[Gitea] Notifying branch build status: PENDING Build started...
[Gitea] Notified
[Pipeline] Start of Pipeline
[Pipeline] node
Running on Jenkins in /build/jenkins/workspace/packagesO_opendht_master
[Pipeline] {
[Pipeline] timestamps
[Pipeline] {
[Pipeline] stage
[Pipeline] { (Prepare)
[Pipeline] checkout
[2020-04-07T14:49:43.123Z] Warning: CredentialId "jenkins-ci" could not be found.
[2020-04-07T14:49:43.123Z]  > git rev-parse --is-inside-work-tree # timeout=10
[2020-04-07T14:49:43.128Z] Fetching changes from the remote Git repository
[2020-04-07T14:49:43.128Z]  > git config remote.origin.url https://237b7412742b4068af4173944de150f12959f4d3@gitea.artixlinux.org/packagesO/opendht.git # timeout=10
[2020-04-07T14:49:43.138Z] Cleaning workspace
[2020-04-07T14:49:43.138Z]  > git rev-parse --verify HEAD # timeout=10
[2020-04-07T14:49:43.143Z] Resetting working tree
[2020-04-07T14:49:43.143Z]  > git reset --hard # timeout=10
[2020-04-07T14:49:43.152Z]  > git clean -fdx # timeout=10
[2020-04-07T14:49:43.157Z] Fetching without tags
[2020-04-07T14:49:43.157Z] Fetching upstream changes from https://237b7412742b4068af4173944de150f12959f4d3@gitea.artixlinux.org/packagesO/opendht.git
[2020-04-07T14:49:43.157Z]  > git --version # timeout=10
[2020-04-07T14:49:43.161Z]  > git fetch --no-tags --force --progress -- https://237b7412742b4068af4173944de150f12959f4d3@gitea.artixlinux.org/packagesO/opendht.git +refs/heads/master:refs/remotes/origin/master # timeout=10
[2020-04-07T14:49:43.303Z] Checking out Revision fc41b2c8bdf3cb76ccd4cc221c3502b5f9cc32b4 (master)
[2020-04-07T14:49:43.303Z]  > git config core.sparsecheckout # timeout=10
[2020-04-07T14:49:43.308Z]  > git checkout -f fc41b2c8bdf3cb76ccd4cc221c3502b5f9cc32b4 # timeout=10
[2020-04-07T14:49:43.317Z] Commit message: "[trunk] -> [community] 'opendht-1:2.0.0-1.1' add"
[2020-04-07T14:49:43.318Z]  > git rev-list --no-walk 9e89b64fb904c9e6f13a538a296d74c77fb818fc # timeout=10
[2020-04-07T14:49:43.330Z] [Gitea] Notifying branch build status: PENDING Build started...
[2020-04-07T14:49:43.519Z] [Gitea] Notified
[Pipeline] libraryResource
[Pipeline] readYaml
[Pipeline] sh
[2020-04-07T14:49:43.793Z] + git rev-parse @
[Pipeline] sh
[2020-04-07T14:49:44.050Z] + git show -s --format=%an fc41b2c8bdf3cb76ccd4cc221c3502b5f9cc32b4
[Pipeline] sh
[2020-04-07T14:49:44.307Z] + git show -s --format=%ae fc41b2c8bdf3cb76ccd4cc221c3502b5f9cc32b4
[Pipeline] sh
[2020-04-07T14:49:44.564Z] + git show --pretty=format: --name-status fc41b2c8bdf3cb76ccd4cc221c3502b5f9cc32b4
[Pipeline] fileExists
[Pipeline] sh
[2020-04-07T14:49:44.829Z] + pkg2yaml repos/community-x86_64
[Pipeline] readYaml
[Pipeline] }
[Pipeline] // stage
[Pipeline] stage
[Pipeline] { (Build)
[Pipeline] echo
[2020-04-07T14:49:44.945Z] isRebuild: false
[Pipeline] dir
[2020-04-07T14:49:44.950Z] Running in /build/jenkins/workspace/packagesO_opendht_master/repos/community-x86_64
[Pipeline] {
[Pipeline] sh
[2020-04-07T14:49:45.212Z] + buildpkg-galaxy
[2020-04-07T14:49:47.695Z] :: Synchronizing package databases...
[2020-04-07T14:49:47.695Z] downloading system.db...
[2020-04-07T14:49:47.695Z] downloading world.db...
[2020-04-07T14:49:48.246Z]  galaxy is up to date
[2020-04-07T14:49:48.246Z]  extra is up to date
[2020-04-07T14:49:48.246Z]  community is up to date
[2020-04-07T14:49:48.246Z] :: Starting full system upgrade...
[2020-04-07T14:49:48.246Z] resolving dependencies...
[2020-04-07T14:49:48.246Z] looking for conflicting packages...
[2020-04-07T14:49:48.246Z] 
[2020-04-07T14:49:48.246Z] Package (1)   Old Version  New Version  Net Change
[2020-04-07T14:49:48.246Z] 
[2020-04-07T14:49:48.246Z] system/bison  3.5.3-1      3.5.4-1        0.02 MiB
[2020-04-07T14:49:48.246Z] 
[2020-04-07T14:49:48.246Z] Total Installed Size:  2.11 MiB
[2020-04-07T14:49:48.246Z] Net Upgrade Size:      0.02 MiB
[2020-04-07T14:49:48.246Z] 
[2020-04-07T14:49:48.246Z] :: Proceed with installation? [Y/n] 
[2020-04-07T14:49:48.246Z] checking keyring...
[2020-04-07T14:49:48.246Z] checking package integrity...
[2020-04-07T14:49:48.246Z] loading package files...
[2020-04-07T14:49:48.246Z] checking for file conflicts...
[2020-04-07T14:49:48.246Z] checking available disk space...
[2020-04-07T14:49:48.246Z] :: Processing package changes...
[2020-04-07T14:49:48.246Z] upgrading bison...
[2020-04-07T14:49:48.496Z] :: Running post-transaction hooks...
[2020-04-07T14:49:48.496Z] (1/1) Updating the info directory file...
[2020-04-07T14:49:49.407Z] ==> Building in chroot for [default] (x86_64)...
[2020-04-07T14:49:50.318Z] ==> Synchronizing chroot copy [/build/buildpkg/default-x86_64/root] -> [jenkins]...done
[2020-04-07T14:49:51.228Z] ==> Making package: opendht 1:2.0.0-1.1 (Tue Apr  7 16:49:51 2020)
[2020-04-07T14:49:51.228Z] ==> Retrieving sources...
[2020-04-07T14:49:51.228Z]   -> Found opendht-2.0.0.tar.gz
[2020-04-07T14:49:51.228Z] ==> Validating source files with sha256sums...
[2020-04-07T14:49:51.228Z]     opendht-2.0.0.tar.gz ... Passed
[2020-04-07T14:49:56.422Z] ==> Making package: opendht 1:2.0.0-1.1 (Tue 07 Apr 2020 02:49:55 PM UTC)
[2020-04-07T14:49:56.422Z] ==> Checking runtime dependencies...
[2020-04-07T14:49:56.422Z] ==> Installing missing dependencies...
[2020-04-07T14:49:56.422Z] :: There are 2 providers available for libjsoncpp.so:
[2020-04-07T14:49:56.422Z] :: Repository world
[2020-04-07T14:49:56.422Z]    1) jsoncpp
[2020-04-07T14:49:56.422Z] :: Repository extra
[2020-04-07T14:49:56.422Z]    2) jsoncpp
[2020-04-07T14:49:56.422Z] 
[2020-04-07T14:49:56.422Z] Enter a number (default=1): 
[2020-04-07T14:49:56.422Z] resolving dependencies...
[2020-04-07T14:49:56.422Z] looking for conflicting packages...
[2020-04-07T14:49:56.422Z] 
[2020-04-07T14:49:56.422Z] Package (4)        New Version  Net Change
[2020-04-07T14:49:56.422Z] 
[2020-04-07T14:49:56.422Z] system/argon2      20190702-2     0.11 MiB
[2020-04-07T14:49:56.422Z] world/fmt          6.1.2-1        0.67 MiB
[2020-04-07T14:49:56.422Z] world/http-parser  2.9.4-1        0.06 MiB
[2020-04-07T14:49:56.422Z] world/jsoncpp      1.9.2-1        1.60 MiB
[2020-04-07T14:49:56.422Z] 
[2020-04-07T14:49:56.422Z] Total Installed Size:  2.44 MiB
[2020-04-07T14:49:56.422Z] 
[2020-04-07T14:49:56.422Z] :: Proceed with installation? [Y/n] 
[2020-04-07T14:49:56.422Z] checking keyring...
[2020-04-07T14:49:56.422Z] checking package integrity...
[2020-04-07T14:49:56.422Z] loading package files...
[2020-04-07T14:49:56.422Z] checking for file conflicts...
[2020-04-07T14:49:56.422Z] checking available disk space...
[2020-04-07T14:49:56.422Z] :: Processing package changes...
[2020-04-07T14:49:56.422Z] installing argon2...
[2020-04-07T14:49:56.422Z] installing fmt...
[2020-04-07T14:49:56.422Z] installing http-parser...
[2020-04-07T14:49:56.422Z] installing jsoncpp...
[2020-04-07T14:49:56.422Z] Optional dependencies for jsoncpp
[2020-04-07T14:49:56.422Z]     jsoncpp-doc: documentation
[2020-04-07T14:49:56.672Z] ==> Checking buildtime dependencies...
[2020-04-07T14:49:56.672Z] ==> Installing missing dependencies...
[2020-04-07T14:49:57.223Z] resolving dependencies...
[2020-04-07T14:49:57.223Z] looking for conflicting packages...
[2020-04-07T14:49:57.223Z] 
[2020-04-07T14:49:57.223Z] Package (17)              New Version  Net Change
[2020-04-07T14:49:57.223Z] 
[2020-04-07T14:49:57.223Z] extra/asio                1.14.0-1       3.22 MiB
[2020-04-07T14:49:57.223Z] system/libnsl             1.2.0-2        0.19 MiB
[2020-04-07T14:49:57.223Z] world/libuv               1.35.0-1       0.51 MiB
[2020-04-07T14:49:57.223Z] world/python              3.8.2-1       80.71 MiB
[2020-04-07T14:49:57.223Z] world/python-appdirs      1.4.3-5        0.07 MiB
[2020-04-07T14:49:57.223Z] world/python-ordered-set  3.1.1-1        0.05 MiB
[2020-04-07T14:49:57.223Z] world/python-packaging    20.3-1         0.17 MiB
[2020-04-07T14:49:57.223Z] world/python-pyparsing    2.4.7-1        0.73 MiB
[2020-04-07T14:49:57.223Z] world/python-setuptools   1:46.1.3-1     1.53 MiB
[2020-04-07T14:49:57.223Z] world/python-six          1.14.0-1       0.09 MiB
[2020-04-07T14:49:57.223Z] world/rhash               1.3.9-1        0.29 MiB
[2020-04-07T14:49:57.223Z] world/shared-mime-info    1.15-2         4.25 MiB
[2020-04-07T14:49:57.223Z] world/cmake               3.17.0-2      39.22 MiB
[2020-04-07T14:49:57.223Z] world/cppunit             1.15.1-1       5.37 MiB
[2020-04-07T14:49:57.223Z] galaxy/cython             0.29.16-1      8.54 MiB
[2020-04-07T14:49:57.223Z] community/msgpack-c       3.2.1-1        5.16 MiB
[2020-04-07T14:49:57.223Z] community/restinio        0.6.4-1        0.98 MiB
[2020-04-07T14:49:57.223Z] 
[2020-04-07T14:49:57.223Z] Total Installed Size:  151.11 MiB
[2020-04-07T14:49:57.223Z] 
[2020-04-07T14:49:57.223Z] :: Proceed with installation? [Y/n] 
[2020-04-07T14:49:57.223Z] checking keyring...
[2020-04-07T14:49:57.223Z] checking package integrity...
[2020-04-07T14:49:58.566Z] loading package files...
[2020-04-07T14:49:58.566Z] checking for file conflicts...
[2020-04-07T14:49:58.566Z] checking available disk space...
[2020-04-07T14:49:58.566Z] :: Processing package changes...
[2020-04-07T14:49:58.566Z] installing msgpack-c...
[2020-04-07T14:49:58.566Z] installing shared-mime-info...
[2020-04-07T14:49:58.566Z] installing libnsl...
[2020-04-07T14:49:58.566Z] installing libuv...
[2020-04-07T14:49:58.566Z] installing rhash...
[2020-04-07T14:49:58.566Z] installing cmake...
[2020-04-07T14:49:59.476Z] Optional dependencies for cmake
[2020-04-07T14:49:59.477Z]     qt5-base: cmake-gui
[2020-04-07T14:49:59.477Z] installing python...
[2020-04-07T14:50:01.959Z] Optional dependencies for python
[2020-04-07T14:50:01.959Z]     python-setuptools [pending]
[2020-04-07T14:50:01.959Z]     python-pip
[2020-04-07T14:50:01.959Z]     sqlite [installed]
[2020-04-07T14:50:01.959Z]     mpdecimal: for decimal
[2020-04-07T14:50:01.959Z]     xz: for lzma [installed]
[2020-04-07T14:50:01.959Z]     tk: for tkinter
[2020-04-07T14:50:01.959Z] installing python-appdirs...
[2020-04-07T14:50:01.959Z] installing python-pyparsing...
[2020-04-07T14:50:01.959Z] installing python-six...
[2020-04-07T14:50:01.959Z] installing python-packaging...
[2020-04-07T14:50:01.959Z] installing python-ordered-set...
[2020-04-07T14:50:01.959Z] installing python-setuptools...
[2020-04-07T14:50:01.959Z] installing cython...
[2020-04-07T14:50:02.209Z] installing cppunit...
[2020-04-07T14:50:02.209Z] installing asio...
[2020-04-07T14:50:02.209Z] installing restinio...
[2020-04-07T14:50:02.209Z] :: Running post-transaction hooks...
[2020-04-07T14:50:02.209Z] (1/1) Updating the MIME type database...
[2020-04-07T14:50:02.760Z] ==> Retrieving sources...
[2020-04-07T14:50:02.760Z]   -> Found opendht-2.0.0.tar.gz
[2020-04-07T14:50:02.760Z] ==> WARNING: Skipping all source file integrity checks.
[2020-04-07T14:50:02.760Z] ==> Extracting sources...
[2020-04-07T14:50:02.760Z]   -> Extracting opendht-2.0.0.tar.gz with bsdtar
[2020-04-07T14:50:02.760Z] ==> Starting prepare()...
[2020-04-07T14:50:02.760Z] ==> Starting build()...
[2020-04-07T14:50:03.010Z] -- The C compiler identification is GNU 9.3.0
[2020-04-07T14:50:03.010Z] -- The CXX compiler identification is GNU 9.3.0
[2020-04-07T14:50:03.010Z] -- Check for working C compiler: /usr/bin/cc
[2020-04-07T14:50:03.261Z] -- Check for working C compiler: /usr/bin/cc - works
[2020-04-07T14:50:03.261Z] -- Detecting C compiler ABI info
[2020-04-07T14:50:03.511Z] -- Detecting C compiler ABI info - done
[2020-04-07T14:50:03.511Z] -- Detecting C compile features
[2020-04-07T14:50:03.511Z] -- Detecting C compile features - done
[2020-04-07T14:50:03.511Z] -- Check for working CXX compiler: /usr/bin/c++
[2020-04-07T14:50:03.511Z] -- Check for working CXX compiler: /usr/bin/c++ - works
[2020-04-07T14:50:03.511Z] -- Detecting CXX compiler ABI info
[2020-04-07T14:50:03.761Z] -- Detecting CXX compiler ABI info - done
[2020-04-07T14:50:03.761Z] -- Detecting CXX compile features
[2020-04-07T14:50:03.761Z] -- Detecting CXX compile features - done
[2020-04-07T14:50:03.761Z] -- Could NOT find Doxygen (missing: DOXYGEN_EXECUTABLE) 
[2020-04-07T14:50:03.761Z] -- Looking for pthread.h
[2020-04-07T14:50:04.011Z] -- Looking for pthread.h - found
[2020-04-07T14:50:04.011Z] -- Performing Test CMAKE_HAVE_LIBC_PTHREAD
[2020-04-07T14:50:04.011Z] -- Performing Test CMAKE_HAVE_LIBC_PTHREAD - Failed
[2020-04-07T14:50:04.011Z] -- Looking for pthread_create in pthreads
[2020-04-07T14:50:04.262Z] -- Looking for pthread_create in pthreads - not found
[2020-04-07T14:50:04.262Z] -- Looking for pthread_create in pthread
[2020-04-07T14:50:04.512Z] -- Looking for pthread_create in pthread - found
[2020-04-07T14:50:04.512Z] -- Found Threads: TRUE  
[2020-04-07T14:50:04.512Z] -- Found PkgConfig: /usr/bin/pkg-config (found version "1.6.3") 
[2020-04-07T14:50:04.512Z] -- Found GnuTLS: /usr/lib/libgnutls.so (found suitable version "3.6.13", minimum required is "3.3") 
[2020-04-07T14:50:04.512Z] -- Checking for one of the modules 'nettle'
[2020-04-07T14:50:04.512Z] -- Found Msgpack: /usr/lib/libmsgpackc.so (found suitable version "3.2.1", minimum required is "1.2") 
[2020-04-07T14:50:04.512Z] -- Found Readline: /usr/lib/libreadline.so (Required is at least version "6") 
[2020-04-07T14:50:04.512Z] -- Checking for one of the modules 'libargon2'
[2020-04-07T14:50:04.762Z] -- Found Argon2:  (found version "ZERO")
[2020-04-07T14:50:04.762Z] -- Checking for one of the modules 'jsoncpp'
[2020-04-07T14:50:04.762Z] -- Found Restinio: /usr/include  
[2020-04-07T14:50:04.762Z] -- Checking for one of the modules 'openssl'
[2020-04-07T14:50:04.762Z] -- Found OpenSSL 1.1.1f
[2020-04-07T14:50:04.762Z] Indexation enabled since it is required for Python support
[2020-04-07T14:50:04.762Z] Using push notification
[2020-04-07T14:50:04.762Z] CMake Warning (dev) at /usr/share/cmake-3.17/Modules/FindPackageHandleStandardArgs.cmake:272 (message):
[2020-04-07T14:50:04.762Z]   The package name passed to `find_package_handle_standard_args` (PkgConfig)
[2020-04-07T14:50:04.762Z]   does not match the name of the calling package (Cppunit).  This can lead to
[2020-04-07T14:50:04.762Z]   problems in calling code that expects `find_package` result variables
[2020-04-07T14:50:04.762Z]   (e.g., `_FOUND`) to follow a certain pattern.
[2020-04-07T14:50:04.762Z] Call Stack (most recent call first):
[2020-04-07T14:50:04.762Z]   /usr/share/cmake-3.17/Modules/FindPkgConfig.cmake:45 (find_package_handle_standard_args)
[2020-04-07T14:50:04.762Z]   cmake/FindCppunit.cmake:1 (INCLUDE)
[2020-04-07T14:50:04.762Z]   CMakeLists.txt:383 (FIND_PACKAGE)
[2020-04-07T14:50:04.762Z] This warning is for project developers.  Use -Wno-dev to suppress it.
[2020-04-07T14:50:04.762Z] 
[2020-04-07T14:50:04.762Z] -- Checking for module 'cppunit'
[2020-04-07T14:50:04.762Z] --   Found cppunit, version 1.15.1
[2020-04-07T14:50:05.013Z] CMake Warning (dev) at /usr/share/cmake-3.17/Modules/FindPackageHandleStandardArgs.cmake:272 (message):
[2020-04-07T14:50:05.013Z]   The package name passed to `find_package_handle_standard_args` (CPPUNIT)
[2020-04-07T14:50:05.013Z]   does not match the name of the calling package (Cppunit).  This can lead to
[2020-04-07T14:50:05.013Z]   problems in calling code that expects `find_package` result variables
[2020-04-07T14:50:05.013Z]   (e.g., `_FOUND`) to follow a certain pattern.
[2020-04-07T14:50:05.013Z] Call Stack (most recent call first):
[2020-04-07T14:50:05.013Z]   cmake/FindCppunit.cmake:27 (FIND_PACKAGE_HANDLE_STANDARD_ARGS)
[2020-04-07T14:50:05.013Z]   CMakeLists.txt:383 (FIND_PACKAGE)
[2020-04-07T14:50:05.013Z] This warning is for project developers.  Use -Wno-dev to suppress it.
[2020-04-07T14:50:05.013Z] 
[2020-04-07T14:50:05.013Z] -- Found CPPUNIT: /usr/lib/libcppunit.so;dl  
[2020-04-07T14:50:05.013Z] -- Configuring done
[2020-04-07T14:50:05.013Z] -- Generating done
[2020-04-07T14:50:05.013Z] -- Build files have been written to: /build/opendht/src/build
[2020-04-07T14:50:05.013Z] make[1]: Entering directory '/build/opendht/src/build'
[2020-04-07T14:50:05.013Z] make[2]: Entering directory '/build/opendht/src/build'
[2020-04-07T14:50:05.013Z] Scanning dependencies of target opendht
[2020-04-07T14:50:05.013Z] make[2]: Leaving directory '/build/opendht/src/build'
[2020-04-07T14:50:05.013Z] make[2]: Entering directory '/build/opendht/src/build'
[2020-04-07T14:50:05.013Z] [  2%] Building CXX object CMakeFiles/opendht.dir/src/infohash.cpp.o
[2020-04-07T14:50:05.013Z] [  4%] Building CXX object CMakeFiles/opendht.dir/src/utils.cpp.o
[2020-04-07T14:50:05.013Z] [  6%] Building CXX object CMakeFiles/opendht.dir/src/node.cpp.o
[2020-04-07T14:50:05.013Z] [  9%] Building CXX object CMakeFiles/opendht.dir/src/dht.cpp.o
[2020-04-07T14:50:05.013Z] [ 13%] Building CXX object CMakeFiles/opendht.dir/src/crypto.cpp.o
[2020-04-07T14:50:05.013Z] [ 13%] Building CXX object CMakeFiles/opendht.dir/src/default_types.cpp.o
[2020-04-07T14:50:05.013Z] [ 18%] Building CXX object CMakeFiles/opendht.dir/src/op_cache.cpp.o
[2020-04-07T14:50:05.013Z] [ 18%] Building CXX object CMakeFiles/opendht.dir/src/callbacks.cpp.o
[2020-04-07T14:50:05.013Z] [ 20%] Building CXX object CMakeFiles/opendht.dir/src/base64.cpp.o
[2020-04-07T14:50:05.013Z] [ 22%] Building CXX object CMakeFiles/opendht.dir/src/securedht.cpp.o
[2020-04-07T14:50:05.013Z] [ 27%] Building CXX object CMakeFiles/opendht.dir/src/network_engine.cpp.o
[2020-04-07T14:50:05.013Z] [ 27%] Building CXX object CMakeFiles/opendht.dir/src/routing_table.cpp.o
[2020-04-07T14:50:05.013Z] [ 29%] Building CXX object CMakeFiles/opendht.dir/src/value.cpp.o
[2020-04-07T14:50:05.013Z] [ 34%] Building CXX object CMakeFiles/opendht.dir/src/node_cache.cpp.o
[2020-04-07T14:50:05.013Z] [ 34%] Building CXX object CMakeFiles/opendht.dir/src/dhtrunner.cpp.o
[2020-04-07T14:50:05.013Z] [ 45%] Building CXX object CMakeFiles/opendht.dir/src/peer_discovery.cpp.o
[2020-04-07T14:50:05.013Z] [ 45%] Building CXX object CMakeFiles/opendht.dir/src/log.cpp.o
[2020-04-07T14:50:05.013Z] [ 45%] Building CXX object CMakeFiles/opendht.dir/src/indexation/pht.cpp.o
[2020-04-07T14:50:05.013Z] [ 45%] Building CXX object CMakeFiles/opendht.dir/src/dht_proxy_server.cpp.o
[2020-04-07T14:50:05.013Z] [ 45%] Building CXX object CMakeFiles/opendht.dir/src/thread_pool.cpp.o
[2020-04-07T14:50:05.013Z] [ 47%] Building CXX object CMakeFiles/opendht.dir/src/network_utils.cpp.o
[2020-04-07T14:50:05.013Z] [ 52%] Building CXX object CMakeFiles/opendht.dir/src/http.cpp.o
[2020-04-07T14:50:05.013Z] [ 52%] Building CXX object CMakeFiles/opendht.dir/src/dht_proxy_client.cpp.o
[2020-04-07T14:50:07.496Z] /build/opendht/src/opendht-2.0.0/src/crypto.cpp: In function ‘dht::Blob dht::crypto::aesEncrypt(const uint8_t*, size_t, const Blob&)’:
[2020-04-07T14:50:07.496Z] /build/opendht/src/opendht-2.0.0/src/crypto.cpp:109:49: warning: ‘void nettle_gcm_aes_set_key(gcm_aes_ctx*, size_t, const uint8_t*)’ is deprecated [-Wdeprecated-declarations]
[2020-04-07T14:50:07.496Z]   109 |     gcm_aes_set_key(&aes, key.size(), key.data());
[2020-04-07T14:50:07.496Z]       |                                                 ^
[2020-04-07T14:50:07.496Z] In file included from /build/opendht/src/opendht-2.0.0/src/crypto.cpp:26:
[2020-04-07T14:50:07.496Z] /usr/include/nettle/gcm.h:268:1: note: declared here
[2020-04-07T14:50:07.496Z]   268 | gcm_aes_set_key(struct gcm_aes_ctx *ctx,
[2020-04-07T14:50:07.496Z]       | ^~~~~~~~~~~~~~~
[2020-04-07T14:50:07.496Z] /build/opendht/src/opendht-2.0.0/src/crypto.cpp:109:49: warning: ‘void nettle_gcm_aes_set_key(gcm_aes_ctx*, size_t, const uint8_t*)’ is deprecated [-Wdeprecated-declarations]
[2020-04-07T14:50:07.496Z]   109 |     gcm_aes_set_key(&aes, key.size(), key.data());
[2020-04-07T14:50:07.496Z]       |                                                 ^
[2020-04-07T14:50:07.496Z] In file included from /build/opendht/src/opendht-2.0.0/src/crypto.cpp:26:
[2020-04-07T14:50:07.496Z] /usr/include/nettle/gcm.h:268:1: note: declared here
[2020-04-07T14:50:07.496Z]   268 | gcm_aes_set_key(struct gcm_aes_ctx *ctx,
[2020-04-07T14:50:07.496Z]       | ^~~~~~~~~~~~~~~
[2020-04-07T14:50:07.496Z] /build/opendht/src/opendht-2.0.0/src/crypto.cpp:110:49: warning: ‘void nettle_gcm_aes_set_iv(gcm_aes_ctx*, size_t, const uint8_t*)’ is deprecated [-Wdeprecated-declarations]
[2020-04-07T14:50:07.496Z]   110 |     gcm_aes_set_iv(&aes, GCM_IV_SIZE, ret.data());
[2020-04-07T14:50:07.496Z]       |                                                 ^
[2020-04-07T14:50:07.496Z] In file included from /build/opendht/src/opendht-2.0.0/src/crypto.cpp:26:
[2020-04-07T14:50:07.496Z] /usr/include/nettle/gcm.h:272:1: note: declared here
[2020-04-07T14:50:07.496Z]   272 | gcm_aes_set_iv(struct gcm_aes_ctx *ctx,
[2020-04-07T14:50:07.496Z]       | ^~~~~~~~~~~~~~
[2020-04-07T14:50:07.496Z] /build/opendht/src/opendht-2.0.0/src/crypto.cpp:110:49: warning: ‘void nettle_gcm_aes_set_iv(gcm_aes_ctx*, size_t, const uint8_t*)’ is deprecated [-Wdeprecated-declarations]
[2020-04-07T14:50:07.496Z]   110 |     gcm_aes_set_iv(&aes, GCM_IV_SIZE, ret.data());
[2020-04-07T14:50:07.496Z]       |                                                 ^
[2020-04-07T14:50:07.496Z] In file included from /build/opendht/src/opendht-2.0.0/src/crypto.cpp:26:
[2020-04-07T14:50:07.496Z] /usr/include/nettle/gcm.h:272:1: note: declared here
[2020-04-07T14:50:07.496Z]   272 | gcm_aes_set_iv(struct gcm_aes_ctx *ctx,
[2020-04-07T14:50:07.496Z]       | ^~~~~~~~~~~~~~
[2020-04-07T14:50:07.496Z] /build/opendht/src/opendht-2.0.0/src/crypto.cpp:112:43: warning: ‘void nettle_gcm_aes_update(gcm_aes_ctx*, size_t, const uint8_t*)’ is deprecated [-Wdeprecated-declarations]
[2020-04-07T14:50:07.496Z]   112 |     gcm_aes_update(&aes, data_length, data);
[2020-04-07T14:50:07.496Z]       |                                           ^
[2020-04-07T14:50:07.496Z] In file included from /build/opendht/src/opendht-2.0.0/src/crypto.cpp:26:
[2020-04-07T14:50:07.496Z] /usr/include/nettle/gcm.h:276:1: note: declared here
[2020-04-07T14:50:07.496Z]   276 | gcm_aes_update(struct gcm_aes_ctx *ctx,
[2020-04-07T14:50:07.496Z]       | ^~~~~~~~~~~~~~
[2020-04-07T14:50:07.496Z] /build/opendht/src/opendht-2.0.0/src/crypto.cpp:112:43: warning: ‘void nettle_gcm_aes_update(gcm_aes_ctx*, size_t, const uint8_t*)’ is deprecated [-Wdeprecated-declarations]
[2020-04-07T14:50:07.496Z]   112 |     gcm_aes_update(&aes, data_length, data);
[2020-04-07T14:50:07.496Z]       |                                           ^
[2020-04-07T14:50:07.496Z] In file included from /build/opendht/src/opendht-2.0.0/src/crypto.cpp:26:
[2020-04-07T14:50:07.496Z] /usr/include/nettle/gcm.h:276:1: note: declared here
[2020-04-07T14:50:07.496Z]   276 | gcm_aes_update(struct gcm_aes_ctx *ctx,
[2020-04-07T14:50:07.496Z]       | ^~~~~~~~~~~~~~
[2020-04-07T14:50:07.496Z] /build/opendht/src/opendht-2.0.0/src/crypto.cpp:115:70: warning: ‘void nettle_gcm_aes_encrypt(gcm_aes_ctx*, size_t, uint8_t*, const uint8_t*)’ is deprecated [-Wdeprecated-declarations]
[2020-04-07T14:50:07.496Z]   115 |     gcm_aes_encrypt(&aes, data_length, ret.data() + GCM_IV_SIZE, data);
[2020-04-07T14:50:07.496Z]       |                                                                      ^
[2020-04-07T14:50:07.496Z] In file included from /build/opendht/src/opendht-2.0.0/src/crypto.cpp:26:
[2020-04-07T14:50:07.496Z] /usr/include/nettle/gcm.h:280:1: note: declared here
[2020-04-07T14:50:07.496Z]   280 | gcm_aes_encrypt(struct gcm_aes_ctx *ctx,
[2020-04-07T14:50:07.496Z]       | ^~~~~~~~~~~~~~~
[2020-04-07T14:50:07.496Z] /build/opendht/src/opendht-2.0.0/src/crypto.cpp:115:70: warning: ‘void nettle_gcm_aes_encrypt(gcm_aes_ctx*, size_t, uint8_t*, const uint8_t*)’ is deprecated [-Wdeprecated-declarations]
[2020-04-07T14:50:07.496Z]   115 |     gcm_aes_encrypt(&aes, data_length, ret.data() + GCM_IV_SIZE, data);
[2020-04-07T14:50:07.496Z]       |                                                                      ^
[2020-04-07T14:50:07.496Z] In file included from /build/opendht/src/opendht-2.0.0/src/crypto.cpp:26:
[2020-04-07T14:50:07.496Z] /usr/include/nettle/gcm.h:280:1: note: declared here
[2020-04-07T14:50:07.496Z]   280 | gcm_aes_encrypt(struct gcm_aes_ctx *ctx,
[2020-04-07T14:50:07.496Z]       | ^~~~~~~~~~~~~~~
[2020-04-07T14:50:07.496Z] /build/opendht/src/opendht-2.0.0/src/crypto.cpp:116:81: warning: ‘void nettle_gcm_aes_digest(gcm_aes_ctx*, size_t, uint8_t*)’ is deprecated [-Wdeprecated-declarations]
[2020-04-07T14:50:07.496Z]   116 |     gcm_aes_digest(&aes, GCM_DIGEST_SIZE, ret.data() + GCM_IV_SIZE + data_length);
[2020-04-07T14:50:07.496Z]       |                                                                                 ^
[2020-04-07T14:50:07.496Z] In file included from /build/opendht/src/opendht-2.0.0/src/crypto.cpp:26:
[2020-04-07T14:50:07.496Z] /usr/include/nettle/gcm.h:290:1: note: declared here
[2020-04-07T14:50:07.496Z]   290 | gcm_aes_digest(struct gcm_aes_ctx *ctx, size_t length, uint8_t *digest)
[2020-04-07T14:50:07.496Z]       | ^~~~~~~~~~~~~~
[2020-04-07T14:50:07.496Z] /build/opendht/src/opendht-2.0.0/src/crypto.cpp:116:81: warning: ‘void nettle_gcm_aes_digest(gcm_aes_ctx*, size_t, uint8_t*)’ is deprecated [-Wdeprecated-declarations]
[2020-04-07T14:50:07.496Z]   116 |     gcm_aes_digest(&aes, GCM_DIGEST_SIZE, ret.data() + GCM_IV_SIZE + data_length);
[2020-04-07T14:50:07.496Z]       |                                                                                 ^
[2020-04-07T14:50:07.496Z] In file included from /build/opendht/src/opendht-2.0.0/src/crypto.cpp:26:
[2020-04-07T14:50:07.496Z] /usr/include/nettle/gcm.h:290:1: note: declared here
[2020-04-07T14:50:07.496Z]   290 | gcm_aes_digest(struct gcm_aes_ctx *ctx, size_t length, uint8_t *digest)
[2020-04-07T14:50:07.496Z]       | ^~~~~~~~~~~~~~
[2020-04-07T14:50:07.496Z] /build/opendht/src/opendht-2.0.0/src/crypto.cpp: In function ‘dht::Blob dht::crypto::aesDecrypt(const Blob&, const Blob&)’:
[2020-04-07T14:50:07.496Z] /build/opendht/src/opendht-2.0.0/src/crypto.cpp:140:49: warning: ‘void nettle_gcm_aes_set_key(gcm_aes_ctx*, size_t, const uint8_t*)’ is deprecated [-Wdeprecated-declarations]
[2020-04-07T14:50:07.496Z]   140 |     gcm_aes_set_key(&aes, key.size(), key.data());
[2020-04-07T14:50:07.496Z]       |                                                 ^
[2020-04-07T14:50:07.496Z] In file included from /build/opendht/src/opendht-2.0.0/src/crypto.cpp:26:
[2020-04-07T14:50:07.496Z] /usr/include/nettle/gcm.h:268:1: note: declared here
[2020-04-07T14:50:07.496Z]   268 | gcm_aes_set_key(struct gcm_aes_ctx *ctx,
[2020-04-07T14:50:07.496Z]       | ^~~~~~~~~~~~~~~
[2020-04-07T14:50:07.496Z] /build/opendht/src/opendht-2.0.0/src/crypto.cpp:140:49: warning: ‘void nettle_gcm_aes_set_key(gcm_aes_ctx*, size_t, const uint8_t*)’ is deprecated [-Wdeprecated-declarations]
[2020-04-07T14:50:07.496Z]   140 |     gcm_aes_set_key(&aes, key.size(), key.data());
[2020-04-07T14:50:07.496Z]       |                                                 ^
[2020-04-07T14:50:07.496Z] In file included from /build/opendht/src/opendht-2.0.0/src/crypto.cpp:26:
[2020-04-07T14:50:07.496Z] /usr/include/nettle/gcm.h:268:1: note: declared here
[2020-04-07T14:50:07.496Z]   268 | gcm_aes_set_key(struct gcm_aes_ctx *ctx,
[2020-04-07T14:50:07.496Z]       | ^~~~~~~~~~~~~~~
[2020-04-07T14:50:07.496Z] /build/opendht/src/opendht-2.0.0/src/crypto.cpp:141:50: warning: ‘void nettle_gcm_aes_set_iv(gcm_aes_ctx*, size_t, const uint8_t*)’ is deprecated [-Wdeprecated-declarations]
[2020-04-07T14:50:07.496Z]   141 |     gcm_aes_set_iv(&aes, GCM_IV_SIZE, data.data());
[2020-04-07T14:50:07.496Z]       |                                                  ^
[2020-04-07T14:50:07.496Z] In file included from /build/opendht/src/opendht-2.0.0/src/crypto.cpp:26:
[2020-04-07T14:50:07.496Z] /usr/include/nettle/gcm.h:272:1: note: declared here
[2020-04-07T14:50:07.496Z]   272 | gcm_aes_set_iv(struct gcm_aes_ctx *ctx,
[2020-04-07T14:50:07.496Z]       | ^~~~~~~~~~~~~~
[2020-04-07T14:50:07.496Z] /build/opendht/src/opendht-2.0.0/src/crypto.cpp:141:50: warning: ‘void nettle_gcm_aes_set_iv(gcm_aes_ctx*, size_t, const uint8_t*)’ is deprecated [-Wdeprecated-declarations]
[2020-04-07T14:50:07.496Z]   141 |     gcm_aes_set_iv(&aes, GCM_IV_SIZE, data.data());
[2020-04-07T14:50:07.496Z]       |                                                  ^
[2020-04-07T14:50:07.496Z] In file included from /build/opendht/src/opendht-2.0.0/src/crypto.cpp:26:
[2020-04-07T14:50:07.496Z] /usr/include/nettle/gcm.h:272:1: note: declared here
[2020-04-07T14:50:07.496Z]   272 | gcm_aes_set_iv(struct gcm_aes_ctx *ctx,
[2020-04-07T14:50:07.496Z]       | ^~~~~~~~~~~~~~
[2020-04-07T14:50:07.496Z] /build/opendht/src/opendht-2.0.0/src/crypto.cpp:145:73: warning: ‘void nettle_gcm_aes_decrypt(gcm_aes_ctx*, size_t, uint8_t*, const uint8_t*)’ is deprecated [-Wdeprecated-declarations]
[2020-04-07T14:50:07.496Z]   145 |     gcm_aes_decrypt(&aes, data_sz, ret.data(), data.data() + GCM_IV_SIZE);
[2020-04-07T14:50:07.496Z]       |                                                                         ^
[2020-04-07T14:50:07.496Z] In file included from /build/opendht/src/opendht-2.0.0/src/crypto.cpp:26:
[2020-04-07T14:50:07.496Z] /usr/include/nettle/gcm.h:285:1: note: declared here
[2020-04-07T14:50:07.496Z]   285 | gcm_aes_decrypt(struct gcm_aes_ctx *ctx,
[2020-04-07T14:50:07.496Z]       | ^~~~~~~~~~~~~~~
[2020-04-07T14:50:07.496Z] /build/opendht/src/opendht-2.0.0/src/crypto.cpp:145:73: warning: ‘void nettle_gcm_aes_decrypt(gcm_aes_ctx*, size_t, uint8_t*, const uint8_t*)’ is deprecated [-Wdeprecated-declarations]
[2020-04-07T14:50:07.496Z]   145 |     gcm_aes_decrypt(&aes, data_sz, ret.data(), data.data() + GCM_IV_SIZE);
[2020-04-07T14:50:07.496Z]       |                                                                         ^
[2020-04-07T14:50:07.496Z] In file included from /build/opendht/src/opendht-2.0.0/src/crypto.cpp:26:
[2020-04-07T14:50:07.496Z] /usr/include/nettle/gcm.h:285:1: note: declared here
[2020-04-07T14:50:07.496Z]   285 | gcm_aes_decrypt(struct gcm_aes_ctx *ctx,
[2020-04-07T14:50:07.496Z]       | ^~~~~~~~~~~~~~~
[2020-04-07T14:50:07.496Z] /build/opendht/src/opendht-2.0.0/src/crypto.cpp:146:56: warning: ‘void nettle_gcm_aes_digest(gcm_aes_ctx*, size_t, uint8_t*)’ is deprecated [-Wdeprecated-declarations]
[2020-04-07T14:50:07.496Z]   146 |     gcm_aes_digest(&aes, GCM_DIGEST_SIZE, digest.data());
[2020-04-07T14:50:07.496Z]       |                                                        ^
[2020-04-07T14:50:07.496Z] In file included from /build/opendht/src/opendht-2.0.0/src/crypto.cpp:26:
[2020-04-07T14:50:07.496Z] /usr/include/nettle/gcm.h:290:1: note: declared here
[2020-04-07T14:50:07.496Z]   290 | gcm_aes_digest(struct gcm_aes_ctx *ctx, size_t length, uint8_t *digest)
[2020-04-07T14:50:07.496Z]       | ^~~~~~~~~~~~~~
[2020-04-07T14:50:07.496Z] /build/opendht/src/opendht-2.0.0/src/crypto.cpp:146:56: warning: ‘void nettle_gcm_aes_digest(gcm_aes_ctx*, size_t, uint8_t*)’ is deprecated [-Wdeprecated-declarations]
[2020-04-07T14:50:07.496Z]   146 |     gcm_aes_digest(&aes, GCM_DIGEST_SIZE, digest.data());
[2020-04-07T14:50:07.496Z]       |                                                        ^
[2020-04-07T14:50:07.496Z] In file included from /build/opendht/src/opendht-2.0.0/src/crypto.cpp:26:
[2020-04-07T14:50:07.496Z] /usr/include/nettle/gcm.h:290:1: note: declared here
[2020-04-07T14:50:07.496Z]   290 | gcm_aes_digest(struct gcm_aes_ctx *ctx, size_t length, uint8_t *digest)
[2020-04-07T14:50:07.496Z]       | ^~~~~~~~~~~~~~
[2020-04-07T14:50:07.496Z] /build/opendht/src/opendht-2.0.0/src/crypto.cpp:153:55: warning: ‘void nettle_gcm_aes_set_key(gcm_aes_ctx*, size_t, const uint8_t*)’ is deprecated [-Wdeprecated-declarations]
[2020-04-07T14:50:07.496Z]   153 |         gcm_aes_set_key(&aes_d, key.size(), key.data());
[2020-04-07T14:50:07.496Z]       |                                                       ^
[2020-04-07T14:50:07.496Z] In file included from /build/opendht/src/opendht-2.0.0/src/crypto.cpp:26:
[2020-04-07T14:50:07.496Z] /usr/include/nettle/gcm.h:268:1: note: declared here
[2020-04-07T14:50:07.496Z]   268 | gcm_aes_set_key(struct gcm_aes_ctx *ctx,
[2020-04-07T14:50:07.496Z]       | ^~~~~~~~~~~~~~~
[2020-04-07T14:50:07.496Z] /build/opendht/src/opendht-2.0.0/src/crypto.cpp:153:55: warning: ‘void nettle_gcm_aes_set_key(gcm_aes_ctx*, size_t, const uint8_t*)’ is deprecated [-Wdeprecated-declarations]
[2020-04-07T14:50:07.496Z]   153 |         gcm_aes_set_key(&aes_d, key.size(), key.data());
[2020-04-07T14:50:07.496Z]       |                                                       ^
[2020-04-07T14:50:07.496Z] In file included from /build/opendht/src/opendht-2.0.0/src/crypto.cpp:26:
[2020-04-07T14:50:07.496Z] /usr/include/nettle/gcm.h:268:1: note: declared here
[2020-04-07T14:50:07.496Z]   268 | gcm_aes_set_key(struct gcm_aes_ctx *ctx,
[2020-04-07T14:50:07.496Z]       | ^~~~~~~~~~~~~~~
[2020-04-07T14:50:07.496Z] /build/opendht/src/opendht-2.0.0/src/crypto.cpp:154:56: warning: ‘void nettle_gcm_aes_set_iv(gcm_aes_ctx*, size_t, const uint8_t*)’ is deprecated [-Wdeprecated-declarations]
[2020-04-07T14:50:07.496Z]   154 |         gcm_aes_set_iv(&aes_d, GCM_IV_SIZE, data.data());
[2020-04-07T14:50:07.496Z]       |                                                        ^
[2020-04-07T14:50:07.496Z] In file included from /build/opendht/src/opendht-2.0.0/src/crypto.cpp:26:
[2020-04-07T14:50:07.496Z] /usr/include/nettle/gcm.h:272:1: note: declared here
[2020-04-07T14:50:07.496Z]   272 | gcm_aes_set_iv(struct gcm_aes_ctx *ctx,
[2020-04-07T14:50:07.496Z]       | ^~~~~~~~~~~~~~
[2020-04-07T14:50:07.496Z] /build/opendht/src/opendht-2.0.0/src/crypto.cpp:154:56: warning: ‘void nettle_gcm_aes_set_iv(gcm_aes_ctx*, size_t, const uint8_t*)’ is deprecated [-Wdeprecated-declarations]
[2020-04-07T14:50:07.496Z]   154 |         gcm_aes_set_iv(&aes_d, GCM_IV_SIZE, data.data());
[2020-04-07T14:50:07.497Z]       |                                                        ^
[2020-04-07T14:50:07.497Z] In file included from /build/opendht/src/opendht-2.0.0/src/crypto.cpp:26:
[2020-04-07T14:50:07.497Z] /usr/include/nettle/gcm.h:272:1: note: declared here
[2020-04-07T14:50:07.497Z]   272 | gcm_aes_set_iv(struct gcm_aes_ctx *ctx,
[2020-04-07T14:50:07.497Z]       | ^~~~~~~~~~~~~~
[2020-04-07T14:50:07.497Z] /build/opendht/src/opendht-2.0.0/src/crypto.cpp:155:54: warning: ‘void nettle_gcm_aes_update(gcm_aes_ctx*, size_t, const uint8_t*)’ is deprecated [-Wdeprecated-declarations]
[2020-04-07T14:50:07.497Z]   155 |         gcm_aes_update(&aes_d, ret.size(), ret.data());
[2020-04-07T14:50:07.497Z]       |                                                      ^
[2020-04-07T14:50:07.497Z] In file included from /build/opendht/src/opendht-2.0.0/src/crypto.cpp:26:
[2020-04-07T14:50:07.497Z] /usr/include/nettle/gcm.h:276:1: note: declared here
[2020-04-07T14:50:07.497Z]   276 | gcm_aes_update(struct gcm_aes_ctx *ctx,
[2020-04-07T14:50:07.497Z]       | ^~~~~~~~~~~~~~
[2020-04-07T14:50:07.497Z] /build/opendht/src/opendht-2.0.0/src/crypto.cpp:155:54: warning: ‘void nettle_gcm_aes_update(gcm_aes_ctx*, size_t, const uint8_t*)’ is deprecated [-Wdeprecated-declarations]
[2020-04-07T14:50:07.497Z]   155 |         gcm_aes_update(&aes_d, ret.size(), ret.data());
[2020-04-07T14:50:07.497Z]       |                                                      ^
[2020-04-07T14:50:07.497Z] In file included from /build/opendht/src/opendht-2.0.0/src/crypto.cpp:26:
[2020-04-07T14:50:07.497Z] /usr/include/nettle/gcm.h:276:1: note: declared here
[2020-04-07T14:50:07.497Z]   276 | gcm_aes_update(struct gcm_aes_ctx *ctx,
[2020-04-07T14:50:07.497Z]       | ^~~~~~~~~~~~~~
[2020-04-07T14:50:07.497Z] /build/opendht/src/opendht-2.0.0/src/crypto.cpp:156:71: warning: ‘void nettle_gcm_aes_encrypt(gcm_aes_ctx*, size_t, uint8_t*, const uint8_t*)’ is deprecated [-Wdeprecated-declarations]
[2020-04-07T14:50:07.497Z]   156 |         gcm_aes_encrypt(&aes_d, ret.size(), ret_tmp.data(), ret.data());
[2020-04-07T14:50:07.497Z]       |                                                                       ^
[2020-04-07T14:50:07.497Z] In file included from /build/opendht/src/opendht-2.0.0/src/crypto.cpp:26:
[2020-04-07T14:50:07.497Z] /usr/include/nettle/gcm.h:280:1: note: declared here
[2020-04-07T14:50:07.497Z]   280 | gcm_aes_encrypt(struct gcm_aes_ctx *ctx,
[2020-04-07T14:50:07.497Z]       | ^~~~~~~~~~~~~~~
[2020-04-07T14:50:07.497Z] /build/opendht/src/opendht-2.0.0/src/crypto.cpp:156:71: warning: ‘void nettle_gcm_aes_encrypt(gcm_aes_ctx*, size_t, uint8_t*, const uint8_t*)’ is deprecated [-Wdeprecated-declarations]
[2020-04-07T14:50:07.497Z]   156 |         gcm_aes_encrypt(&aes_d, ret.size(), ret_tmp.data(), ret.data());
[2020-04-07T14:50:07.497Z]       |                                                                       ^
[2020-04-07T14:50:07.497Z] In file included from /build/opendht/src/opendht-2.0.0/src/crypto.cpp:26:
[2020-04-07T14:50:07.497Z] /usr/include/nettle/gcm.h:280:1: note: declared here
[2020-04-07T14:50:07.497Z]   280 | gcm_aes_encrypt(struct gcm_aes_ctx *ctx,
[2020-04-07T14:50:07.497Z]       | ^~~~~~~~~~~~~~~
[2020-04-07T14:50:07.497Z] /build/opendht/src/opendht-2.0.0/src/crypto.cpp:157:62: warning: ‘void nettle_gcm_aes_digest(gcm_aes_ctx*, size_t, uint8_t*)’ is deprecated [-Wdeprecated-declarations]
[2020-04-07T14:50:07.497Z]   157 |         gcm_aes_digest(&aes_d, GCM_DIGEST_SIZE, digest.data());
[2020-04-07T14:50:07.497Z]       |                                                              ^
[2020-04-07T14:50:07.497Z] In file included from /build/opendht/src/opendht-2.0.0/src/crypto.cpp:26:
[2020-04-07T14:50:07.497Z] /usr/include/nettle/gcm.h:290:1: note: declared here
[2020-04-07T14:50:07.497Z]   290 | gcm_aes_digest(struct gcm_aes_ctx *ctx, size_t length, uint8_t *digest)
[2020-04-07T14:50:07.497Z]       | ^~~~~~~~~~~~~~
[2020-04-07T14:50:07.497Z] /build/opendht/src/opendht-2.0.0/src/crypto.cpp:157:62: warning: ‘void nettle_gcm_aes_digest(gcm_aes_ctx*, size_t, uint8_t*)’ is deprecated [-Wdeprecated-declarations]
[2020-04-07T14:50:07.497Z]   157 |         gcm_aes_digest(&aes_d, GCM_DIGEST_SIZE, digest.data());
[2020-04-07T14:50:07.497Z]       |                                                              ^
[2020-04-07T14:50:07.497Z] In file included from /build/opendht/src/opendht-2.0.0/src/crypto.cpp:26:
[2020-04-07T14:50:07.497Z] /usr/include/nettle/gcm.h:290:1: note: declared here
[2020-04-07T14:50:07.497Z]   290 | gcm_aes_digest(struct gcm_aes_ctx *ctx, size_t length, uint8_t *digest)
[2020-04-07T14:50:07.497Z]       | ^~~~~~~~~~~~~~
[2020-04-07T14:50:08.840Z] /build/opendht/src/opendht-2.0.0/src/http.cpp: In member function ‘void dht::http::Request::handle_response(const error_code&, size_t)’:
[2020-04-07T14:50:08.840Z] /build/opendht/src/opendht-2.0.0/src/http.cpp:934:61: warning: unused parameter ‘n_bytes’ [-Wunused-parameter]
[2020-04-07T14:50:08.840Z]   934 | Request::handle_response(const asio::error_code& ec, size_t n_bytes)
[2020-04-07T14:50:08.840Z]       |                                                      ~~~~~~~^~~~~~~
[2020-04-07T14:50:23.602Z] [ 54%] Linking CXX shared library libopendht.so
[2020-04-07T14:51:19.651Z] make[2]: Leaving directory '/build/opendht/src/build'
[2020-04-07T14:51:19.651Z] [ 54%] Built target opendht
[2020-04-07T14:51:19.651Z] make[2]: Entering directory '/build/opendht/src/build'
[2020-04-07T14:51:19.651Z] make[2]: Entering directory '/build/opendht/src/build'
[2020-04-07T14:51:19.651Z] make[2]: Entering directory '/build/opendht/src/build'
[2020-04-07T14:51:19.651Z] make[2]: Entering directory '/build/opendht/src/build'
[2020-04-07T14:51:19.651Z] make[2]: Entering directory '/build/opendht/src/build'
[2020-04-07T14:51:19.651Z] make[2]: Entering directory '/build/opendht/src/build'
[2020-04-07T14:51:19.651Z] make[2]: Entering directory '/build/opendht/src/build'
[2020-04-07T14:51:19.651Z] Scanning dependencies of target python
[2020-04-07T14:51:19.651Z] make[2]: Leaving directory '/build/opendht/src/build'
[2020-04-07T14:51:19.651Z] Scanning dependencies of target perftest
[2020-04-07T14:51:19.651Z] Scanning dependencies of target dhtnode
[2020-04-07T14:51:19.651Z] Scanning dependencies of target dhtchat
[2020-04-07T14:51:19.651Z] Scanning dependencies of target dhtscanner
[2020-04-07T14:51:19.651Z] make[2]: Leaving directory '/build/opendht/src/build'
[2020-04-07T14:51:19.651Z] make[2]: Entering directory '/build/opendht/src/build'
[2020-04-07T14:51:19.651Z] make[2]: Leaving directory '/build/opendht/src/build'
[2020-04-07T14:51:19.651Z] make[2]: Leaving directory '/build/opendht/src/build'
[2020-04-07T14:51:19.651Z] make[2]: Leaving directory '/build/opendht/src/build'
[2020-04-07T14:51:19.651Z] Scanning dependencies of target durl
[2020-04-07T14:51:19.651Z] make[2]: Leaving directory '/build/opendht/src/build'
[2020-04-07T14:51:19.651Z] make[2]: Entering directory '/build/opendht/src/build'
[2020-04-07T14:51:19.651Z] make[2]: Entering directory '/build/opendht/src/build'
[2020-04-07T14:51:19.651Z] make[2]: Entering directory '/build/opendht/src/build'
[2020-04-07T14:51:19.651Z] make[2]: Entering directory '/build/opendht/src/build'
[2020-04-07T14:51:19.651Z] make[2]: Entering directory '/build/opendht/src/build'
[2020-04-07T14:51:19.651Z] Scanning dependencies of target opendht_unit_tests
[2020-04-07T14:51:19.651Z] make[2]: Leaving directory '/build/opendht/src/build'
[2020-04-07T14:51:19.651Z] make[2]: Entering directory '/build/opendht/src/build'
[2020-04-07T14:51:19.651Z] [ 56%] Building CXX object tools/CMakeFiles/perftest.dir/perftest.cpp.o
[2020-04-07T14:51:19.651Z] [ 61%] Building CXX object tools/CMakeFiles/dhtchat.dir/dhtchat.cpp.o
[2020-04-07T14:51:19.651Z] [ 61%] Building CXX object tools/CMakeFiles/dhtscanner.dir/dhtscanner.cpp.o
[2020-04-07T14:51:19.651Z] [ 63%] Building CXX object tools/CMakeFiles/dhtnode.dir/dhtnode.cpp.o
[2020-04-07T14:51:19.651Z] [ 65%] Building CXX object tools/CMakeFiles/durl.dir/durl.cpp.o
[2020-04-07T14:51:19.651Z] [ 68%] Building CXX object CMakeFiles/opendht_unit_tests.dir/tests/infohashtester.cpp.o
[2020-04-07T14:51:19.652Z] [ 70%] Building CXX object CMakeFiles/opendht_unit_tests.dir/tests/dhtproxytester.cpp.o
[2020-04-07T14:51:19.652Z] [ 72%] Building CXX object CMakeFiles/opendht_unit_tests.dir/tests/threadpooltester.cpp.o
[2020-04-07T14:51:19.652Z] [ 75%] Building CXX object CMakeFiles/opendht_unit_tests.dir/tests/httptester.cpp.o
[2020-04-07T14:51:19.652Z] [ 79%] Building CXX object CMakeFiles/opendht_unit_tests.dir/tests/cryptotester.cpp.o
[2020-04-07T14:51:19.652Z] [ 79%] Building CXX object CMakeFiles/opendht_unit_tests.dir/tests/dhtrunnertester.cpp.o
[2020-04-07T14:51:19.652Z] [ 81%] Building CXX object CMakeFiles/opendht_unit_tests.dir/tests/tests_runner.cpp.o
[2020-04-07T14:51:19.652Z] [ 84%] Building CXX object CMakeFiles/opendht_unit_tests.dir/tests/peerdiscoverytester.cpp.o
[2020-04-07T14:51:19.652Z] [ 86%] Building CXX object CMakeFiles/opendht_unit_tests.dir/tests/valuetester.cpp.o
[2020-04-07T14:51:19.652Z] Compiling /build/opendht/src/opendht-2.0.0/python/opendht.pyx because it changed.
[2020-04-07T14:51:19.652Z] [1/1] Cythonizing /build/opendht/src/opendht-2.0.0/python/opendht.pyx
[2020-04-07T14:51:19.652Z] running build
[2020-04-07T14:51:19.652Z] running build_ext
[2020-04-07T14:51:19.652Z] building 'opendht' extension
[2020-04-07T14:51:19.652Z] creating build
[2020-04-07T14:51:19.652Z] creating build/temp.linux-x86_64-3.8
[2020-04-07T14:51:19.652Z] creating build/temp.linux-x86_64-3.8/build
[2020-04-07T14:51:19.652Z] creating build/temp.linux-x86_64-3.8/build/opendht
[2020-04-07T14:51:19.652Z] creating build/temp.linux-x86_64-3.8/build/opendht/src
[2020-04-07T14:51:19.652Z] creating build/temp.linux-x86_64-3.8/build/opendht/src/opendht-2.0.0
[2020-04-07T14:51:19.652Z] creating build/temp.linux-x86_64-3.8/build/opendht/src/opendht-2.0.0/python
[2020-04-07T14:51:19.652Z] gcc -pthread -Wno-unused-result -Wsign-compare -DNDEBUG -g -fwrapv -O3 -Wall -march=x86-64 -mtune=generic -O3 -pipe -fno-plt -fno-semantic-interposition -march=x86-64 -mtune=generic -O3 -pipe -fno-plt -march=x86-64 -mtune=generic -O3 -pipe -fno-plt -march=x86-64 -mtune=generic -O2 -pipe -fno-plt -D_FORTIFY_SOURCE=2 -fPIC -I../../include -I/build/opendht/src/opendht-2.0.0/include -I/usr/include/python3.8 -c /build/opendht/src/opendht-2.0.0/python/opendht.cpp -o build/temp.linux-x86_64-3.8/build/opendht/src/opendht-2.0.0/python/opendht.o -std=c++14
[2020-04-07T14:51:19.652Z] [ 88%] Linking CXX executable durl
[2020-04-07T14:51:20.202Z] make[2]: Leaving directory '/build/opendht/src/build'
[2020-04-07T14:51:20.202Z] [ 88%] Built target durl
[2020-04-07T14:51:22.064Z] [ 90%] Linking CXX executable opendht_unit_tests
[2020-04-07T14:51:22.314Z] [ 93%] Linking CXX executable dhtscanner
[2020-04-07T14:51:23.658Z] make[2]: Leaving directory '/build/opendht/src/build'
[2020-04-07T14:51:23.658Z] [ 93%] Built target dhtscanner
[2020-04-07T14:51:23.908Z] [ 95%] Linking CXX executable dhtchat
[2020-04-07T14:51:23.908Z] [ 97%] Linking CXX executable perftest
[2020-04-07T14:51:24.819Z] [100%] Linking CXX executable dhtnode
[2020-04-07T14:51:25.369Z] make[2]: Leaving directory '/build/opendht/src/build'
[2020-04-07T14:51:25.369Z] [100%] Built target perftest
[2020-04-07T14:51:26.712Z] make[2]: Leaving directory '/build/opendht/src/build'
[2020-04-07T14:51:26.712Z] [100%] Built target dhtchat
[2020-04-07T14:51:28.573Z] make[2]: Leaving directory '/build/opendht/src/build'
[2020-04-07T14:51:28.573Z] [100%] Built target opendht_unit_tests
[2020-04-07T14:51:28.824Z] make[2]: Leaving directory '/build/opendht/src/build'
[2020-04-07T14:51:28.824Z] [100%] Built target dhtnode
[2020-04-07T14:51:34.018Z] creating build/lib.linux-x86_64-3.8
[2020-04-07T14:51:34.018Z] g++ -pthread -shared -Wl,-O1,--sort-common,--as-needed,-z,relro,-z,now -fno-semantic-interposition -Wl,-O1,--sort-common,--as-needed,-z,relro,-z,now -Wl,-O1,--sort-common,--as-needed,-z,relro,-z,now -march=x86-64 -mtune=generic -O2 -pipe -fno-plt -D_FORTIFY_SOURCE=2 build/temp.linux-x86_64-3.8/build/opendht/src/opendht-2.0.0/python/opendht.o -L../../src -L/build/opendht/src/build/python -L/build/opendht/src/build -L/usr/lib -lopendht -lgnutls -o build/lib.linux-x86_64-3.8/opendht.cpython-38-x86_64-linux-gnu.so -std=c++14
[2020-04-07T14:51:34.268Z] make[2]: Leaving directory '/build/opendht/src/build'
[2020-04-07T14:51:34.268Z] [100%] Built target python
[2020-04-07T14:51:34.268Z] make[1]: Leaving directory '/build/opendht/src/build'
[2020-04-07T14:51:34.268Z] ==> Starting check()...
[2020-04-07T14:51:34.519Z] Running tests...
[2020-04-07T14:51:34.519Z] Test project /build/opendht/src/build
[2020-04-07T14:51:34.519Z]     Start 1: TEST
[2020-04-07T14:51:49.279Z] 1/1 Test #1: TEST .............................***Exception: SegFault 12.67 sec
[2020-04-07T14:51:49.279Z] 
[2020-04-07T14:51:49.279Z] 0% tests passed, 1 tests failed out of 1
[2020-04-07T14:51:49.279Z] 
[2020-04-07T14:51:49.279Z] Total Test time (real) =  12.67 sec
[2020-04-07T14:51:49.279Z] 
[2020-04-07T14:51:49.279Z] The following tests FAILED:
[2020-04-07T14:51:49.279Z] 	  1 - TEST (SEGFAULT)
[2020-04-07T14:51:49.279Z] Errors while running CTest
[2020-04-07T14:51:49.279Z] make: *** [Makefile:125: test] Error 8
[2020-04-07T14:51:49.279Z] ==> ERROR: A failure occurred in check().
[2020-04-07T14:51:49.279Z]     Aborting...
[2020-04-07T14:51:49.279Z] ==> ERROR: Build failed, check /build/buildpkg/default-x86_64/jenkins/build
[Pipeline] }
[Pipeline] // dir
Post stage
[Pipeline] emailext
[2020-04-07T14:51:49.399Z] Sending email to: artix-build-failures at artixlinux.org


More information about the artix-build-failures mailing list