[artix-build-failures] [goblins] Failure: gobject-introspection

jenkins at artixlinux.org jenkins at artixlinux.org
Sat Oct 26 17:27:27 CEST 2019


   Failure

   Build: repos/staging-x86_64

   Packages:

   [gobject-introspection-1.62.0-2-x86_64.pkg.tar.xz,
   gobject-introspection-runtime-1.62.0-2-x86_64.pkg.tar.xz]

   authorName: artoo

   authorEmail: artoo at artixlinux.org

   [1]https://orion.artixlinux.org/job/packagesG/job/gobject-introspection
   /job/master/6/

References

   1. https://orion.artixlinux.org/job/packagesG/job/gobject-introspection/job/master/6/
-------------- next part --------------
Push event to branch master
Querying the current revision of branch master...
Current revision of branch master is d80f01dc9f93cf2fc7c040f0a65aa65b978c70ed
Obtained Jenkinsfile from d80f01dc9f93cf2fc7c040f0a65aa65b978c70ed
Running in Durability level: PERFORMANCE_OPTIMIZED
Loading library artix-ci at master
Attempting to resolve master from remote references...
 > git --version # timeout=10
 > git ls-remote -- https://gitea.artixlinux.org/artix/pipeline-libs.git # timeout=10
Found match: refs/heads/master revision 77f77ff85eedb6eb60b64faf8c328ab86dbb479c
Warning: CredentialId "gitea-ci" could not be found.
 > git rev-parse --is-inside-work-tree # timeout=10
Fetching changes from the remote Git repository
 > git config remote.origin.url https://gitea.artixlinux.org/artix/pipeline-libs.git # timeout=10
Fetching without tags
Fetching upstream changes from https://gitea.artixlinux.org/artix/pipeline-libs.git
 > git --version # timeout=10
 > git fetch --no-tags --force --progress -- https://gitea.artixlinux.org/artix/pipeline-libs.git +refs/heads/master:refs/remotes/origin/master
Checking out Revision 77f77ff85eedb6eb60b64faf8c328ab86dbb479c (master)
 > git config core.sparsecheckout # timeout=10
 > git checkout -f 77f77ff85eedb6eb60b64faf8c328ab86dbb479c
Commit message: "Notify: remove fail condition"
[Gitea] Notifying branch build status: PENDING Build started...
[Gitea] Notified
[Pipeline] Start of Pipeline
[Pipeline] node
Running on Jenkins in /build/jenkins/workspace/esG_gobject-introspection_master
[Pipeline] {
[Pipeline] timestamps
[Pipeline] {
[Pipeline] stage
[Pipeline] { (Prepare)
[Pipeline] checkout
[2019-10-26T15:26:19.602Z] Warning: CredentialId "jenkins-ci" could not be found.
[2019-10-26T15:26:19.602Z] Cloning the remote Git repository
[2019-10-26T15:26:19.602Z] Cloning with configured refspecs honoured and without tags
[2019-10-26T15:26:19.602Z] Cloning repository https://237b7412742b4068af4173944de150f12959f4d3@gitea.artixlinux.org/packagesG/gobject-introspection.git
[2019-10-26T15:26:19.602Z]  > git init /build/jenkins/workspace/esG_gobject-introspection_master # timeout=10
[2019-10-26T15:26:19.612Z] Fetching upstream changes from https://237b7412742b4068af4173944de150f12959f4d3@gitea.artixlinux.org/packagesG/gobject-introspection.git
[2019-10-26T15:26:19.612Z]  > git --version # timeout=10
[2019-10-26T15:26:19.617Z]  > git fetch --no-tags --force --progress -- https://237b7412742b4068af4173944de150f12959f4d3@gitea.artixlinux.org/packagesG/gobject-introspection.git +refs/heads/master:refs/remotes/origin/master
[2019-10-26T15:26:19.893Z]  > git config remote.origin.url https://237b7412742b4068af4173944de150f12959f4d3@gitea.artixlinux.org/packagesG/gobject-introspection.git # timeout=10
[2019-10-26T15:26:19.898Z]  > git config --add remote.origin.fetch +refs/heads/master:refs/remotes/origin/master # timeout=10
[2019-10-26T15:26:19.902Z]  > git config remote.origin.url https://237b7412742b4068af4173944de150f12959f4d3@gitea.artixlinux.org/packagesG/gobject-introspection.git # timeout=10
[2019-10-26T15:26:19.907Z] Cleaning workspace
[2019-10-26T15:26:19.907Z]  > git rev-parse --verify HEAD # timeout=10
[2019-10-26T15:26:19.912Z] No valid HEAD. Skipping the resetting
[2019-10-26T15:26:19.912Z]  > git clean -fdx # timeout=10
[2019-10-26T15:26:19.915Z] Fetching without tags
[2019-10-26T15:26:19.915Z] Fetching upstream changes from https://237b7412742b4068af4173944de150f12959f4d3@gitea.artixlinux.org/packagesG/gobject-introspection.git
[2019-10-26T15:26:19.915Z]  > git fetch --no-tags --force --progress -- https://237b7412742b4068af4173944de150f12959f4d3@gitea.artixlinux.org/packagesG/gobject-introspection.git +refs/heads/master:refs/remotes/origin/master
[2019-10-26T15:26:20.102Z] Checking out Revision d80f01dc9f93cf2fc7c040f0a65aa65b978c70ed (master)
[2019-10-26T15:26:20.102Z]  > git config core.sparsecheckout # timeout=10
[2019-10-26T15:26:20.107Z]  > git checkout -f d80f01dc9f93cf2fc7c040f0a65aa65b978c70ed
[2019-10-26T15:26:20.114Z] Commit message: "[trunk] -> [staging] 'gobject-introspection-1.62.0-2' add"
[2019-10-26T15:26:20.115Z]  > git rev-list --no-walk 5c6cd9a7d4cb9b58a3ecd34822fd618cac6636f7 # timeout=10
[2019-10-26T15:26:20.128Z] [Gitea] Notifying branch build status: PENDING Build started...
[2019-10-26T15:26:20.312Z] [Gitea] Notified
[Pipeline] libraryResource
[Pipeline] readYaml
[Pipeline] sh
[2019-10-26T15:26:20.587Z] + git rev-parse @
[Pipeline] sh
[2019-10-26T15:26:20.844Z] + git show -s --format=%an d80f01dc9f93cf2fc7c040f0a65aa65b978c70ed
[Pipeline] sh
[2019-10-26T15:26:21.101Z] + git show -s --format=%ae d80f01dc9f93cf2fc7c040f0a65aa65b978c70ed
[Pipeline] sh
[2019-10-26T15:26:21.357Z] + git show --pretty=format: --name-status d80f01dc9f93cf2fc7c040f0a65aa65b978c70ed
[Pipeline] fileExists
[Pipeline] sh
[2019-10-26T15:26:21.622Z] + pkg2yaml repos/staging-x86_64
[Pipeline] readYaml
[Pipeline] }
[Pipeline] // stage
[Pipeline] stage
[Pipeline] { (Build)
[Pipeline] input
[2019-10-26T15:26:21.741Z] Input requested
[2019-10-26T15:26:32.819Z] Approved by artoo
[Pipeline] echo
[2019-10-26T15:26:32.865Z] isRebuild: false
[Pipeline] dir
[2019-10-26T15:26:32.872Z] Running in /build/jenkins/workspace/esG_gobject-introspection_master/repos/staging-x86_64
[Pipeline] {
[Pipeline] sh
[2019-10-26T15:26:33.135Z] + buildpkg-goblins
[2019-10-26T15:26:34.998Z] :: Synchronizing package databases...
[2019-10-26T15:26:34.998Z] downloading goblins.db...
[2019-10-26T15:26:34.998Z]  gremlins is up to date
[2019-10-26T15:26:34.998Z]  system is up to date
[2019-10-26T15:26:34.998Z]  world is up to date
[2019-10-26T15:26:34.998Z]  galaxy-goblins is up to date
[2019-10-26T15:26:34.998Z]  galaxy-gremlins is up to date
[2019-10-26T15:26:34.998Z]  galaxy is up to date
[2019-10-26T15:26:34.998Z]  staging is up to date
[2019-10-26T15:26:34.998Z]  testing is up to date
[2019-10-26T15:26:34.998Z]  extra is up to date
[2019-10-26T15:26:34.998Z]  community-staging is up to date
[2019-10-26T15:26:34.998Z]  community-testing is up to date
[2019-10-26T15:26:34.998Z]  community is up to date
[2019-10-26T15:26:34.998Z] :: Starting full system upgrade...
[2019-10-26T15:26:34.998Z]  there is nothing to do
[2019-10-26T15:26:35.549Z] ==> Building in chroot for [goblins] (x86_64)...
[2019-10-26T15:26:36.350Z] ==> Synchronizing chroot copy [/build/buildpkg/goblins-x86_64/root] -> [jenkins]...done
[2019-10-26T15:26:36.350Z] ==> WARNING: PACKAGER should have the format 'Example Name <email at address.invalid>'
[2019-10-26T15:26:37.692Z] ==> Making package: gobject-introspection 1.62.0-2 (Sat Oct 26 17:26:37 2019)
[2019-10-26T15:26:37.692Z] ==> Retrieving sources...
[2019-10-26T15:26:37.692Z]   -> Updating gobject-introspection git repo...
[2019-10-26T15:26:37.692Z] Fetching origin
[2019-10-26T15:26:39.554Z] From https://gitlab.gnome.org/GNOME/gobject-introspection
[2019-10-26T15:26:39.554Z]  - [deleted]           (none)     -> issue-309
[2019-10-26T15:26:39.554Z]  - [deleted]           (none)     -> tintou/repository-test-fix
[2019-10-26T15:26:40.897Z]    37411d0e..8b7145fe  gnome-3-34 -> gnome-3-34
[2019-10-26T15:26:40.897Z]    9ac3686a..dac56824  master     -> master
[2019-10-26T15:26:40.897Z]  + c32d8b34...a614da06 refs/merge-requests/133/merge -> refs/merge-requests/133/merge  (forced update)
[2019-10-26T15:26:40.897Z]  + b68d2325...6f03ed29 refs/merge-requests/163/merge -> refs/merge-requests/163/merge  (forced update)
[2019-10-26T15:26:40.897Z]  + 05b67079...d1d12a39 refs/merge-requests/167/merge -> refs/merge-requests/167/merge  (forced update)
[2019-10-26T15:26:40.897Z]  + 904854b2...dac56824 refs/merge-requests/174/head -> refs/merge-requests/174/head  (forced update)
[2019-10-26T15:26:40.897Z]  + 7240bcfe...279bb8c3 refs/merge-requests/174/merge -> refs/merge-requests/174/merge  (forced update)
[2019-10-26T15:26:40.897Z]  + 8eb7e052...073dcd08 refs/merge-requests/176/head -> refs/merge-requests/176/head  (forced update)
[2019-10-26T15:26:40.897Z]  + 6e88c51c...f651783d refs/merge-requests/176/merge -> refs/merge-requests/176/merge  (forced update)
[2019-10-26T15:26:40.897Z]  * [new ref]           refs/merge-requests/178/head -> refs/merge-requests/178/head
[2019-10-26T15:26:40.897Z]  * [new ref]           refs/merge-requests/178/merge -> refs/merge-requests/178/merge
[2019-10-26T15:26:40.897Z]  * [new ref]           refs/merge-requests/179/head -> refs/merge-requests/179/head
[2019-10-26T15:26:40.897Z]  * [new ref]           refs/merge-requests/179/merge -> refs/merge-requests/179/merge
[2019-10-26T15:26:40.897Z]  * [new ref]           refs/merge-requests/180/head -> refs/merge-requests/180/head
[2019-10-26T15:26:40.897Z]  * [new ref]           refs/merge-requests/180/merge -> refs/merge-requests/180/merge
[2019-10-26T15:26:40.897Z]  * [new ref]           refs/merge-requests/181/head -> refs/merge-requests/181/head
[2019-10-26T15:26:40.897Z]  * [new ref]           refs/merge-requests/181/merge -> refs/merge-requests/181/merge
[2019-10-26T15:26:40.897Z]  * [new ref]           refs/merge-requests/182/head -> refs/merge-requests/182/head
[2019-10-26T15:26:40.897Z]  * [new ref]           refs/merge-requests/182/merge -> refs/merge-requests/182/merge
[2019-10-26T15:26:40.897Z]  + 74fd7c51...854d4438 refs/merge-requests/64/merge -> refs/merge-requests/64/merge  (forced update)
[2019-10-26T15:26:41.148Z]   -> Updating glib git repo...
[2019-10-26T15:26:41.148Z] Fetching origin
[2019-10-26T15:26:45.270Z] From https://gitlab.gnome.org/GNOME/glib
[2019-10-26T15:26:45.270Z]    ca9f51b82..4b3d30963  glib-2-62           -> glib-2-62
[2019-10-26T15:26:45.270Z]    322347e10..1bebba043  master              -> master
[2019-10-26T15:26:45.270Z]  * [new branch]          param-value-default -> param-value-default
[2019-10-26T15:26:45.270Z]  * [new branch]          wip/albfan/annotations-for-vapi -> wip/albfan/annotations-for-vapi
[2019-10-26T15:26:45.270Z]  + 727381e61...db4fcdd8f refs/merge-requests/1001/merge -> refs/merge-requests/1001/merge  (forced update)
[2019-10-26T15:26:45.270Z]  + f4dd8f584...27a93d1b9 refs/merge-requests/1003/merge -> refs/merge-requests/1003/merge  (forced update)
[2019-10-26T15:26:45.270Z]  + 332339ad7...b9ecf861f refs/merge-requests/1005/merge -> refs/merge-requests/1005/merge  (forced update)
[2019-10-26T15:26:45.270Z]  + edf721d58...694c5d345 refs/merge-requests/1010/merge -> refs/merge-requests/1010/merge  (forced update)
[2019-10-26T15:26:45.270Z]  + b75d9d65e...9559ebc9d refs/merge-requests/1018/merge -> refs/merge-requests/1018/merge  (forced update)
[2019-10-26T15:26:45.270Z]  + f2d647c15...54f2c8d17 refs/merge-requests/1025/head -> refs/merge-requests/1025/head  (forced update)
[2019-10-26T15:26:45.270Z]  + dba4fb1c2...cbad82786 refs/merge-requests/1025/merge -> refs/merge-requests/1025/merge  (forced update)
[2019-10-26T15:26:45.270Z]  + 5f5277d6e...d68cc7140 refs/merge-requests/1029/head -> refs/merge-requests/1029/head  (forced update)
[2019-10-26T15:26:45.270Z]  + aac4cb968...d42328f73 refs/merge-requests/1029/merge -> refs/merge-requests/1029/merge  (forced update)
[2019-10-26T15:26:45.270Z]  + 131a78407...cd061b3a4 refs/merge-requests/1039/merge -> refs/merge-requests/1039/merge  (forced update)
[2019-10-26T15:26:45.270Z]  + 69b5ebbb9...084578e9a refs/merge-requests/1041/merge -> refs/merge-requests/1041/merge  (forced update)
[2019-10-26T15:26:45.270Z]  + 4e2011e48...fe57a6060 refs/merge-requests/1060/merge -> refs/merge-requests/1060/merge  (forced update)
[2019-10-26T15:26:45.270Z]  + 72019820d...8316f9762 refs/merge-requests/1067/merge -> refs/merge-requests/1067/merge  (forced update)
[2019-10-26T15:26:45.270Z]  + e03e12847...ab914f07d refs/merge-requests/1070/head -> refs/merge-requests/1070/head  (forced update)
[2019-10-26T15:26:45.270Z]  + 9d154569f...44b6ce3f3 refs/merge-requests/1070/merge -> refs/merge-requests/1070/merge  (forced update)
[2019-10-26T15:26:45.270Z]  + 54eb602c9...22b5f5c9b refs/merge-requests/1078/head -> refs/merge-requests/1078/head  (forced update)
[2019-10-26T15:26:45.270Z]  + b3fca4053...b21025c98 refs/merge-requests/1078/merge -> refs/merge-requests/1078/merge  (forced update)
[2019-10-26T15:26:45.270Z]  + 265605fea...a2e821c64 refs/merge-requests/1083/merge -> refs/merge-requests/1083/merge  (forced update)
[2019-10-26T15:26:45.270Z]  + ac87baaf4...a837bfe88 refs/merge-requests/1096/merge -> refs/merge-requests/1096/merge  (forced update)
[2019-10-26T15:26:45.270Z]  + c7b1563ef...c0c6922a5 refs/merge-requests/1105/merge -> refs/merge-requests/1105/merge  (forced update)
[2019-10-26T15:26:45.270Z]  + bcf3e98a0...bfd36d6fe refs/merge-requests/1111/merge -> refs/merge-requests/1111/merge  (forced update)
[2019-10-26T15:26:45.270Z]  + 6aa3a0e73...adaa93686 refs/merge-requests/1113/merge -> refs/merge-requests/1113/merge  (forced update)
[2019-10-26T15:26:45.270Z]  + e20cb87d0...0a90b217e refs/merge-requests/1120/merge -> refs/merge-requests/1120/merge  (forced update)
[2019-10-26T15:26:45.270Z]  + c92fa7bd7...d1d17879f refs/merge-requests/1123/merge -> refs/merge-requests/1123/merge  (forced update)
[2019-10-26T15:26:45.270Z]  + 760c2d289...70eee1ca5 refs/merge-requests/1136/merge -> refs/merge-requests/1136/merge  (forced update)
[2019-10-26T15:26:45.270Z]  + 3980dbeb7...b230e5622 refs/merge-requests/1143/merge -> refs/merge-requests/1143/merge  (forced update)
[2019-10-26T15:26:45.270Z]  + a9547e944...c16e9d482 refs/merge-requests/1144/merge -> refs/merge-requests/1144/merge  (forced update)
[2019-10-26T15:26:45.270Z]  + a184d2d23...a1f96efc0 refs/merge-requests/1166/merge -> refs/merge-requests/1166/merge  (forced update)
[2019-10-26T15:26:45.270Z]  + 998f7d49e...9ed21cbc9 refs/merge-requests/1169/merge -> refs/merge-requests/1169/merge  (forced update)
[2019-10-26T15:26:45.270Z]  + 96339b091...095a31ecb refs/merge-requests/1170/merge -> refs/merge-requests/1170/merge  (forced update)
[2019-10-26T15:26:45.270Z]  + d9eaff2ab...52b9d7557 refs/merge-requests/1171/merge -> refs/merge-requests/1171/merge  (forced update)
[2019-10-26T15:26:45.270Z]  + 4e7912fa9...75fd9d524 refs/merge-requests/1172/merge -> refs/merge-requests/1172/merge  (forced update)
[2019-10-26T15:26:45.270Z]  + 7fcabcb28...19ee3f7e8 refs/merge-requests/1173/merge -> refs/merge-requests/1173/merge  (forced update)
[2019-10-26T15:26:45.270Z]  + 8d113972c...daeb435c5 refs/merge-requests/1175/merge -> refs/merge-requests/1175/merge  (forced update)
[2019-10-26T15:26:45.270Z]  + d27b6c7a4...f27f9af67 refs/merge-requests/1176/head -> refs/merge-requests/1176/head  (forced update)
[2019-10-26T15:26:45.270Z]  + 8f03f814b...f3dd020f1 refs/merge-requests/1176/merge -> refs/merge-requests/1176/merge  (forced update)
[2019-10-26T15:26:45.270Z]  + 0a6b4e6f6...e77c0047d refs/merge-requests/1177/merge -> refs/merge-requests/1177/merge  (forced update)
[2019-10-26T15:26:45.270Z]  * [new ref]             refs/merge-requests/1178/head -> refs/merge-requests/1178/head
[2019-10-26T15:26:45.270Z]  * [new ref]             refs/merge-requests/1178/merge -> refs/merge-requests/1178/merge
[2019-10-26T15:26:45.270Z]  * [new ref]             refs/merge-requests/1179/head -> refs/merge-requests/1179/head
[2019-10-26T15:26:45.270Z]  * [new ref]             refs/merge-requests/1179/merge -> refs/merge-requests/1179/merge
[2019-10-26T15:26:45.270Z]  * [new ref]             refs/merge-requests/1180/head -> refs/merge-requests/1180/head
[2019-10-26T15:26:45.270Z]  * [new ref]             refs/merge-requests/1180/merge -> refs/merge-requests/1180/merge
[2019-10-26T15:26:45.270Z]  * [new ref]             refs/merge-requests/1181/head -> refs/merge-requests/1181/head
[2019-10-26T15:26:45.270Z]  * [new ref]             refs/merge-requests/1181/merge -> refs/merge-requests/1181/merge
[2019-10-26T15:26:45.270Z]  * [new ref]             refs/merge-requests/1182/head -> refs/merge-requests/1182/head
[2019-10-26T15:26:45.270Z]  * [new ref]             refs/merge-requests/1182/merge -> refs/merge-requests/1182/merge
[2019-10-26T15:26:45.270Z]  * [new ref]             refs/merge-requests/1183/head -> refs/merge-requests/1183/head
[2019-10-26T15:26:45.270Z]  * [new ref]             refs/merge-requests/1183/merge -> refs/merge-requests/1183/merge
[2019-10-26T15:26:45.270Z]  * [new ref]             refs/merge-requests/1184/head -> refs/merge-requests/1184/head
[2019-10-26T15:26:45.270Z]  * [new ref]             refs/merge-requests/1184/merge -> refs/merge-requests/1184/merge
[2019-10-26T15:26:45.270Z]  * [new ref]             refs/merge-requests/1185/head -> refs/merge-requests/1185/head
[2019-10-26T15:26:45.270Z]  * [new ref]             refs/merge-requests/1185/merge -> refs/merge-requests/1185/merge
[2019-10-26T15:26:45.270Z]  * [new ref]             refs/merge-requests/1186/head -> refs/merge-requests/1186/head
[2019-10-26T15:26:45.270Z]  * [new ref]             refs/merge-requests/1186/merge -> refs/merge-requests/1186/merge
[2019-10-26T15:26:45.270Z]  + b417dbf9b...c594f5d3e refs/merge-requests/167/merge -> refs/merge-requests/167/merge  (forced update)
[2019-10-26T15:26:45.270Z]  + b315d4296...0c4b0a7ed refs/merge-requests/175/merge -> refs/merge-requests/175/merge  (forced update)
[2019-10-26T15:26:45.270Z]  + 3e5a1197b...5a77dce9f refs/merge-requests/369/merge -> refs/merge-requests/369/merge  (forced update)
[2019-10-26T15:26:45.270Z]  + 25061e791...d9aac2950 refs/merge-requests/382/merge -> refs/merge-requests/382/merge  (forced update)
[2019-10-26T15:26:45.270Z]  + 2193d4aa8...973f40d5f refs/merge-requests/385/merge -> refs/merge-requests/385/merge  (forced update)
[2019-10-26T15:26:45.270Z]  + 771244a46...5be351307 refs/merge-requests/386/merge -> refs/merge-requests/386/merge  (forced update)
[2019-10-26T15:26:45.270Z]  + 5c52c4312...dc7b1ae84 refs/merge-requests/390/merge -> refs/merge-requests/390/merge  (forced update)
[2019-10-26T15:26:45.270Z]  + 05d8e7ad4...46b3b3429 refs/merge-requests/479/merge -> refs/merge-requests/479/merge  (forced update)
[2019-10-26T15:26:45.270Z]  + d5aca88ea...1b781283d refs/merge-requests/562/merge -> refs/merge-requests/562/merge  (forced update)
[2019-10-26T15:26:45.270Z]  + c30d9308b...05d26594b refs/merge-requests/576/merge -> refs/merge-requests/576/merge  (forced update)
[2019-10-26T15:26:45.270Z]  + eed84d60a...b6a3e8ceb refs/merge-requests/610/merge -> refs/merge-requests/610/merge  (forced update)
[2019-10-26T15:26:45.270Z]  + 0e6366f96...7a44ddf90 refs/merge-requests/621/merge -> refs/merge-requests/621/merge  (forced update)
[2019-10-26T15:26:45.270Z]  + 417104c4b...980c6507d refs/merge-requests/643/merge -> refs/merge-requests/643/merge  (forced update)
[2019-10-26T15:26:45.270Z]  + 9c98995e4...7898b933e refs/merge-requests/681/merge -> refs/merge-requests/681/merge  (forced update)
[2019-10-26T15:26:45.270Z]  + 67c946dcd...7e501c5bf refs/merge-requests/683/merge -> refs/merge-requests/683/merge  (forced update)
[2019-10-26T15:26:45.270Z]  + 98acfdf2f...4e513e169 refs/merge-requests/734/head -> refs/merge-requests/734/head  (forced update)
[2019-10-26T15:26:45.270Z]  + 8ad474c8c...3883f8f47 refs/merge-requests/734/merge -> refs/merge-requests/734/merge  (forced update)
[2019-10-26T15:26:45.270Z]  + 786eca347...d74094fe0 refs/merge-requests/744/head -> refs/merge-requests/744/head  (forced update)
[2019-10-26T15:26:45.270Z]  + c61ab4bb5...0dfa970a2 refs/merge-requests/744/merge -> refs/merge-requests/744/merge  (forced update)
[2019-10-26T15:26:45.270Z]  + 44abf669c...ae90dc4fe refs/merge-requests/751/merge -> refs/merge-requests/751/merge  (forced update)
[2019-10-26T15:26:45.270Z]  + 8433ce4d2...bddb53207 refs/merge-requests/756/merge -> refs/merge-requests/756/merge  (forced update)
[2019-10-26T15:26:45.270Z]  + 3d59ac89c...6c7cbfc90 refs/merge-requests/794/merge -> refs/merge-requests/794/merge  (forced update)
[2019-10-26T15:26:45.270Z]  + 83a402380...757835e9a refs/merge-requests/812/head -> refs/merge-requests/812/head  (forced update)
[2019-10-26T15:26:45.270Z]  + 531a0eb26...aefcf2a54 refs/merge-requests/812/merge -> refs/merge-requests/812/merge  (forced update)
[2019-10-26T15:26:45.270Z]  + 59e9d1dee...6b0343477 refs/merge-requests/818/merge -> refs/merge-requests/818/merge  (forced update)
[2019-10-26T15:26:45.270Z]  + 16f469c88...b323b277d refs/merge-requests/827/merge -> refs/merge-requests/827/merge  (forced update)
[2019-10-26T15:26:45.270Z]  + a57e14095...fa4c2a846 refs/merge-requests/861/merge -> refs/merge-requests/861/merge  (forced update)
[2019-10-26T15:26:45.270Z]  + 14f5ad547...a3445448e refs/merge-requests/888/merge -> refs/merge-requests/888/merge  (forced update)
[2019-10-26T15:26:45.270Z]  + 0b4e6773f...a28f4132f refs/merge-requests/890/merge -> refs/merge-requests/890/merge  (forced update)
[2019-10-26T15:26:45.270Z]  + b8c7cf08e...52f818b07 refs/merge-requests/900/merge -> refs/merge-requests/900/merge  (forced update)
[2019-10-26T15:26:45.270Z]  + 89c23624c...187ca3b3c refs/merge-requests/926/merge -> refs/merge-requests/926/merge  (forced update)
[2019-10-26T15:26:45.270Z]  + 78b2a9212...281723418 refs/merge-requests/932/merge -> refs/merge-requests/932/merge  (forced update)
[2019-10-26T15:26:45.270Z]  + f509a0768...d57c765fc refs/merge-requests/942/merge -> refs/merge-requests/942/merge  (forced update)
[2019-10-26T15:26:45.270Z]  + 17de24522...21f8f8982 refs/merge-requests/983/head -> refs/merge-requests/983/head  (forced update)
[2019-10-26T15:26:45.270Z]  + cb64c6638...5fdcc0e28 refs/merge-requests/983/merge -> refs/merge-requests/983/merge  (forced update)
[2019-10-26T15:26:45.270Z] ==> Validating source files with sha512sums...
[2019-10-26T15:26:45.270Z]     gobject-introspection ... Skipped
[2019-10-26T15:26:45.270Z]     glib ... Skipped
[2019-10-26T15:26:45.270Z] ==> Verifying source file signatures with gpg...
[2019-10-26T15:26:45.270Z]     glib git repo ... Passed
[2019-10-26T15:26:49.392Z] ==> Making package: gobject-introspection 1.62.0-2 (Sat 26 Oct 2019 03:26:48 PM UTC)
[2019-10-26T15:26:49.392Z] ==> Checking runtime dependencies...
[2019-10-26T15:26:49.392Z] ==> Installing missing dependencies...
[2019-10-26T15:26:49.392Z] resolving dependencies...
[2019-10-26T15:26:49.392Z] looking for conflicting packages...
[2019-10-26T15:26:49.392Z] 
[2019-10-26T15:26:49.392Z] Package (11)               New Version  Net Change  Download Size
[2019-10-26T15:26:49.392Z] 
[2019-10-26T15:26:49.393Z] system/libnsl              1.2.0-1        0.21 MiB               
[2019-10-26T15:26:49.393Z] goblins/python             3.8.0-1      151.60 MiB               
[2019-10-26T15:26:49.393Z] goblins/python-appdirs     1.4.3-4        0.07 MiB               
[2019-10-26T15:26:49.393Z] goblins/python-beaker      1.11.0-2       0.47 MiB               
[2019-10-26T15:26:49.393Z] goblins/python-markupsafe  1.1.1-2        0.08 MiB               
[2019-10-26T15:26:49.393Z] goblins/python-packaging   19.2-4         0.14 MiB               
[2019-10-26T15:26:49.393Z] goblins/python-pyparsing   2.4.2-3        0.70 MiB               
[2019-10-26T15:26:49.393Z] goblins/python-setuptools  1:41.2.0-4     1.54 MiB               
[2019-10-26T15:26:49.393Z] goblins/python-six         1.12.0-3       0.08 MiB               
[2019-10-26T15:26:49.393Z] goblins/python-mako        1.0.14-2       0.68 MiB       0.12 MiB
[2019-10-26T15:26:49.393Z] galaxy/python-markdown     3.1.1-2        0.50 MiB               
[2019-10-26T15:26:49.393Z] 
[2019-10-26T15:26:49.393Z] Total Download Size:     0.12 MiB
[2019-10-26T15:26:49.393Z] Total Installed Size:  156.09 MiB
[2019-10-26T15:26:49.393Z] 
[2019-10-26T15:26:49.393Z] :: Proceed with installation? [Y/n] 
[2019-10-26T15:26:49.393Z] :: Retrieving packages...
[2019-10-26T15:26:49.393Z] downloading python-mako-1.0.14-2-any.pkg.tar.xz...
[2019-10-26T15:26:49.393Z] checking keyring...
[2019-10-26T15:26:49.393Z] checking package integrity...
[2019-10-26T15:26:49.943Z] loading package files...
[2019-10-26T15:26:49.943Z] checking for file conflicts...
[2019-10-26T15:26:49.943Z] checking available disk space...
[2019-10-26T15:26:49.943Z] :: Processing package changes...
[2019-10-26T15:26:49.943Z] installing libnsl...
[2019-10-26T15:26:49.943Z] installing python...
[2019-10-26T15:26:54.065Z] Optional dependencies for python
[2019-10-26T15:26:54.065Z]     python-setuptools [pending]
[2019-10-26T15:26:54.065Z]     python-pip
[2019-10-26T15:26:54.065Z]     sqlite [installed]
[2019-10-26T15:26:54.065Z]     mpdecimal: for decimal
[2019-10-26T15:26:54.065Z]     xz: for lzma [installed]
[2019-10-26T15:26:54.065Z]     tk: for tkinter
[2019-10-26T15:26:54.065Z] installing python-markupsafe...
[2019-10-26T15:26:54.065Z] installing python-beaker...
[2019-10-26T15:26:54.065Z] installing python-appdirs...
[2019-10-26T15:26:54.065Z] installing python-pyparsing...
[2019-10-26T15:26:54.065Z] installing python-six...
[2019-10-26T15:26:54.065Z] installing python-packaging...
[2019-10-26T15:26:54.065Z] installing python-setuptools...
[2019-10-26T15:26:54.065Z] installing python-mako...
[2019-10-26T15:26:54.065Z] installing python-markdown...
[2019-10-26T15:26:54.065Z] ==> Checking buildtime dependencies...
[2019-10-26T15:26:54.065Z] ==> Installing missing dependencies...
[2019-10-26T15:26:54.065Z] resolving dependencies...
[2019-10-26T15:26:54.065Z] :: There are 2 providers available for xproto:
[2019-10-26T15:26:54.065Z] :: Repository world
[2019-10-26T15:26:54.065Z]    1) xorgproto
[2019-10-26T15:26:54.065Z] :: Repository extra
[2019-10-26T15:26:54.065Z]    2) xorgproto
[2019-10-26T15:26:54.065Z] 
[2019-10-26T15:26:54.065Z] Enter a number (default=1): 
[2019-10-26T15:26:54.065Z] looking for conflicting packages...
[2019-10-26T15:26:54.065Z] warning: dependency cycle detected:
[2019-10-26T15:26:54.065Z] warning: harfbuzz will be installed before its freetype2 dependency
[2019-10-26T15:26:54.065Z] 
[2019-10-26T15:26:54.065Z] Package (49)                                         New Version              Net Change  Download Size
[2019-10-26T15:26:54.065Z] 
[2019-10-26T15:26:54.065Z] world/docbook-xml                                    4.5-8                      2.04 MiB               
[2019-10-26T15:26:54.065Z] world/docbook-xsl                                    1.79.2-5                  26.59 MiB               
[2019-10-26T15:26:54.065Z] world/fontconfig                                     2:2.13.91+24+g75eadca-1    2.23 MiB               
[2019-10-26T15:26:54.065Z] world/freetype2                                      2.10.1-1                   1.61 MiB               
[2019-10-26T15:26:54.065Z] system/glib2-docs                                    2.62.2-1                  19.49 MiB               
[2019-10-26T15:26:54.065Z] world/graphite                                       1:1.3.13-2                 0.76 MiB               
[2019-10-26T15:26:54.065Z] world/harfbuzz                                       2.6.2-1                    4.47 MiB               
[2019-10-26T15:26:54.065Z] world/libpng                                         1.6.37-1                   0.61 MiB               
[2019-10-26T15:26:54.065Z] world/libx11                                         1.6.9-3                   10.53 MiB               
[2019-10-26T15:26:54.065Z] world/libxau                                         1.0.9-1                    0.06 MiB               
[2019-10-26T15:26:54.065Z] world/libxcb                                         1.13.1-1                   4.00 MiB               
[2019-10-26T15:26:54.065Z] world/libxdmcp                                       1.1.3-1                    0.17 MiB               
[2019-10-26T15:26:54.065Z] world/libxext                                        1.3.4-1                    0.36 MiB               
[2019-10-26T15:26:54.065Z] world/libxrender                                     0.9.10-2                   0.12 MiB               
[2019-10-26T15:26:54.065Z] world/libxslt                                        1.1.33-1                   2.40 MiB               
[2019-10-26T15:26:54.065Z] system/lzo                                           2.10-2                     0.42 MiB               
[2019-10-26T15:26:54.065Z] galaxy/ninja                                         1.9.0-1                    0.31 MiB               
[2019-10-26T15:26:54.065Z] system/pcre2                                         10.33-1                    3.77 MiB               
[2019-10-26T15:26:54.065Z] world/perl-error                                     0.17028-1                  0.10 MiB               
[2019-10-26T15:26:54.065Z] world/perl-mailtools                                 2.21-2                     0.17 MiB               
[2019-10-26T15:26:54.065Z] world/perl-timedate                                  2.30-6                     0.15 MiB               
[2019-10-26T15:26:54.066Z] world/pixman                                         0.38.4-1                   0.74 MiB               
[2019-10-26T15:26:54.066Z] goblins/python-anytree                               2.7.2-2                    0.29 MiB       0.04 MiB
[2019-10-26T15:26:54.066Z] galaxy-goblins/python-babel                          2.7.0-2                   25.76 MiB               
[2019-10-26T15:26:54.066Z] goblins/python-chardet                               3.0.4-3                    1.12 MiB               
[2019-10-26T15:26:54.066Z] galaxy-goblins/python-docutils                       0.14-3                     4.18 MiB               
[2019-10-26T15:26:54.066Z] goblins/python-idna                                  2.8-2                      0.66 MiB               
[2019-10-26T15:26:54.066Z] galaxy-goblins/python-imagesize                      1.1.0-2                    0.02 MiB               
[2019-10-26T15:26:54.066Z] galaxy-goblins/python-jinja                          2.10.3-2                   1.16 MiB               
[2019-10-26T15:26:54.066Z] goblins/python-lxml                                  4.4.1-2                    4.98 MiB       1.38 MiB
[2019-10-26T15:26:54.066Z] galaxy-goblins/python-pygments                       2.4.2-2                    7.19 MiB               
[2019-10-26T15:26:54.066Z] galaxy-goblins/python-pytz                           2019.3-2                   0.95 MiB               
[2019-10-26T15:26:54.066Z] goblins/python-requests                              2.22.0-3                   0.44 MiB               
[2019-10-26T15:26:54.066Z] galaxy-goblins/python-snowballstemmer                2.0.0-2                    1.44 MiB               
[2019-10-26T15:26:54.066Z] galaxy-goblins/python-sphinx-alabaster-theme         0.7.12-2                   0.04 MiB               
[2019-10-26T15:26:54.066Z] galaxy-goblins/python-sphinxcontrib-applehelp        1.0.1-3                    0.24 MiB               
[2019-10-26T15:26:54.066Z] galaxy-goblins/python-sphinxcontrib-devhelp          1.0.1-3                    0.12 MiB               
[2019-10-26T15:26:54.066Z] galaxy-goblins/python-sphinxcontrib-htmlhelp         1.0.2-3                    0.15 MiB               
[2019-10-26T15:26:54.066Z] galaxy-goblins/python-sphinxcontrib-jsmath           1.0.1-3                    0.01 MiB               
[2019-10-26T15:26:54.066Z] galaxy-goblins/python-sphinxcontrib-qthelp           1.0.2-3                    0.15 MiB               
[2019-10-26T15:26:54.066Z] galaxy-goblins/python-sphinxcontrib-serializinghtml  1.1.3-3                    0.12 MiB               
[2019-10-26T15:26:54.066Z] goblins/python-urllib3                               1.25.6-3                   0.64 MiB               
[2019-10-26T15:26:54.066Z] goblins/xcb-proto                                    1.13-3                     0.82 MiB               
[2019-10-26T15:26:54.066Z] world/xorgproto                                      2019.2-1                   1.61 MiB               
[2019-10-26T15:26:54.066Z] world/cairo                                          1.17.2+17+g52a7c79fd-2     3.47 MiB               
[2019-10-26T15:26:54.066Z] world/git                                            2.23.0-1                  36.64 MiB               
[2019-10-26T15:26:54.066Z] world/gtk-doc                                        1.31-2                     2.95 MiB               
[2019-10-26T15:26:54.066Z] goblins/meson                                        0.52.0-2                   5.13 MiB       0.84 MiB
[2019-10-26T15:26:54.066Z] galaxy-goblins/python-sphinx                         2.2.0-2                   16.14 MiB               
[2019-10-26T15:26:54.066Z] 
[2019-10-26T15:26:54.066Z] Total Download Size:     2.25 MiB
[2019-10-26T15:26:54.066Z] Total Installed Size:  197.52 MiB
[2019-10-26T15:26:54.066Z] 
[2019-10-26T15:26:54.066Z] :: Proceed with installation? [Y/n] 
[2019-10-26T15:26:54.066Z] :: Retrieving packages...
[2019-10-26T15:26:54.066Z] downloading python-lxml-4.4.1-2-x86_64.pkg.tar.xz...
[2019-10-26T15:26:54.066Z] downloading python-anytree-2.7.2-2-any.pkg.tar.xz...
[2019-10-26T15:26:54.066Z] downloading meson-0.52.0-2-any.pkg.tar.xz...
[2019-10-26T15:26:54.066Z] checking keyring...
[2019-10-26T15:26:54.066Z] checking package integrity...
[2019-10-26T15:26:55.927Z] loading package files...
[2019-10-26T15:26:55.927Z] checking for file conflicts...
[2019-10-26T15:26:55.927Z] checking available disk space...
[2019-10-26T15:26:55.927Z] :: Processing package changes...
[2019-10-26T15:26:55.927Z] installing libpng...
[2019-10-26T15:26:55.927Z] installing xcb-proto...
[2019-10-26T15:26:55.927Z] installing xorgproto...
[2019-10-26T15:26:55.927Z] installing libxdmcp...
[2019-10-26T15:26:55.927Z] installing libxau...
[2019-10-26T15:26:55.927Z] installing libxcb...
[2019-10-26T15:26:56.178Z] installing libx11...
[2019-10-26T15:26:56.428Z] installing libxrender...
[2019-10-26T15:26:56.428Z] installing libxext...
[2019-10-26T15:26:56.428Z] installing graphite...
[2019-10-26T15:26:56.428Z] installing harfbuzz...
[2019-10-26T15:26:56.428Z] Optional dependencies for harfbuzz
[2019-10-26T15:26:56.428Z]     cairo: hb-view program [pending]
[2019-10-26T15:26:56.428Z] installing freetype2...
[2019-10-26T15:26:56.678Z] installing fontconfig...
[2019-10-26T15:26:56.678Z]   
[2019-10-26T15:26:56.678Z]   Fontconfig configuration is done via /etc/fonts/conf.avail and conf.d.
[2019-10-26T15:26:56.678Z]   Read /etc/fonts/conf.d/README for more information.
[2019-10-26T15:26:56.678Z] 
[2019-10-26T15:26:56.678Z]   Configuration via /etc/fonts/local.conf is still possible,
[2019-10-26T15:26:56.678Z]   but is no longer recommended for options available in conf.avail.
[2019-10-26T15:26:56.678Z] 
[2019-10-26T15:26:56.678Z]   Main systemwide configuration should be done by symlinks
[2019-10-26T15:26:56.678Z]   (especially for autohinting, sub-pixel and lcdfilter):
[2019-10-26T15:26:56.678Z]   
[2019-10-26T15:26:56.678Z]   cd /etc/fonts/conf.d
[2019-10-26T15:26:56.678Z]   ln -s ../conf.avail/XX-foo.conf
[2019-10-26T15:26:56.678Z]   
[2019-10-26T15:26:56.678Z]   Check also https://wiki.archlinux.org/index.php/Font_Configuration
[2019-10-26T15:26:56.678Z]   and https://wiki.archlinux.org/index.php/Fonts.
[2019-10-26T15:26:56.678Z] 
[2019-10-26T15:26:56.678Z] Rebuilding fontconfig cache... done.
[2019-10-26T15:26:56.678Z] installing pixman...
[2019-10-26T15:26:56.678Z] installing lzo...
[2019-10-26T15:26:56.678Z] installing cairo...
[2019-10-26T15:26:56.929Z] installing perl-error...
[2019-10-26T15:26:56.929Z] installing perl-timedate...
[2019-10-26T15:26:56.929Z] installing perl-mailtools...
[2019-10-26T15:26:56.929Z] installing pcre2...
[2019-10-26T15:26:56.929Z] installing git...
[2019-10-26T15:26:57.479Z] Optional dependencies for git
[2019-10-26T15:26:57.479Z]     tk: gitk and git gui
[2019-10-26T15:26:57.479Z]     perl-libwww: git svn
[2019-10-26T15:26:57.479Z]     perl-term-readkey: git svn and interactive.singlekey setting
[2019-10-26T15:26:57.479Z]     perl-mime-tools: git send-email
[2019-10-26T15:26:57.479Z]     perl-net-smtp-ssl: git send-email TLS support
[2019-10-26T15:26:57.479Z]     perl-authen-sasl: git send-email TLS support
[2019-10-26T15:26:57.479Z]     perl-mediawiki-api: git mediawiki support
[2019-10-26T15:26:57.479Z]     perl-datetime-format-iso8601: git mediawiki support
[2019-10-26T15:26:57.479Z]     perl-lwp-protocol-https: git mediawiki https support
[2019-10-26T15:26:57.479Z]     perl-cgi: gitweb (web interface) support
[2019-10-26T15:26:57.479Z]     python2: various helper scripts
[2019-10-26T15:26:57.479Z]     subversion: git svn
[2019-10-26T15:26:57.479Z]     gnome-keyring: GNOME keyring credential helper
[2019-10-26T15:26:57.479Z]     libsecret: libsecret credential helper [installed]
[2019-10-26T15:26:57.479Z] installing libxslt...
[2019-10-26T15:26:57.729Z] installing docbook-xml...
[2019-10-26T15:26:57.729Z] installing docbook-xsl...
[2019-10-26T15:26:57.980Z] installing glib2-docs...
[2019-10-26T15:26:58.230Z] installing python-lxml...
[2019-10-26T15:26:58.480Z] Optional dependencies for python-lxml
[2019-10-26T15:26:58.480Z]     python-beautifulsoup4: support for beautifulsoup parser to parse not well formed HTML
[2019-10-26T15:26:58.480Z]     python-cssselect: support for cssselect
[2019-10-26T15:26:58.480Z]     python-html5lib: support for html5lib parser
[2019-10-26T15:26:58.480Z]     python-lxml-docs: offline docs
[2019-10-26T15:26:58.480Z] installing python-pygments...
[2019-10-26T15:26:58.480Z] installing python-anytree...
[2019-10-26T15:26:58.480Z] installing gtk-doc...
[2019-10-26T15:26:58.480Z] Optional dependencies for gtk-doc
[2019-10-26T15:26:58.480Z]     dblatex: PDF support
[2019-10-26T15:26:58.480Z] installing python-pytz...
[2019-10-26T15:26:58.731Z] installing python-babel...
[2019-10-26T15:26:59.281Z] installing python-docutils...
[2019-10-26T15:26:59.281Z] installing python-imagesize...
[2019-10-26T15:26:59.281Z] installing python-jinja...
[2019-10-26T15:26:59.281Z] Optional dependencies for python-jinja
[2019-10-26T15:26:59.281Z]     python-babel: for i18n support [installed]
[2019-10-26T15:26:59.281Z] installing python-urllib3...
[2019-10-26T15:26:59.281Z] Optional dependencies for python-urllib3
[2019-10-26T15:26:59.281Z]     python-pysocks: SOCKS support
[2019-10-26T15:26:59.281Z]     python-brotlipy: Brotli support
[2019-10-26T15:26:59.281Z]     python-pyopenssl: security support
[2019-10-26T15:26:59.281Z] installing python-chardet...
[2019-10-26T15:26:59.281Z] installing python-idna...
[2019-10-26T15:26:59.281Z] installing python-requests...
[2019-10-26T15:26:59.281Z] Optional dependencies for python-requests
[2019-10-26T15:26:59.281Z]     python-pysocks: SOCKS proxy support
[2019-10-26T15:26:59.281Z] installing python-snowballstemmer...
[2019-10-26T15:26:59.281Z] Optional dependencies for python-snowballstemmer
[2019-10-26T15:26:59.281Z]     python-pystemmer: for improved performance
[2019-10-26T15:26:59.281Z] installing python-sphinx-alabaster-theme...
[2019-10-26T15:26:59.281Z] installing python-sphinxcontrib-applehelp...
[2019-10-26T15:26:59.281Z] installing python-sphinxcontrib-devhelp...
[2019-10-26T15:26:59.281Z] installing python-sphinxcontrib-htmlhelp...
[2019-10-26T15:26:59.531Z] installing python-sphinxcontrib-jsmath...
[2019-10-26T15:26:59.531Z] installing python-sphinxcontrib-qthelp...
[2019-10-26T15:26:59.531Z] installing python-sphinxcontrib-serializinghtml...
[2019-10-26T15:26:59.531Z] installing python-sphinx...
[2019-10-26T15:26:59.782Z] Optional dependencies for python-sphinx
[2019-10-26T15:26:59.782Z]     imagemagick: for ext.imgconverter
[2019-10-26T15:26:59.782Z]     texlive-latexextra: for generation of PDF documentation
[2019-10-26T15:26:59.782Z] installing ninja...
[2019-10-26T15:26:59.782Z] installing meson...
[2019-10-26T15:26:59.782Z] :: Running post-transaction hooks...
[2019-10-26T15:26:59.782Z] (1/2) Creating system user accounts...
[2019-10-26T15:27:00.032Z] (2/2) Warn about old perl modules
[2019-10-26T15:27:00.032Z] ==> Retrieving sources...
[2019-10-26T15:27:00.032Z] ==> WARNING: Skipping all source file integrity checks.
[2019-10-26T15:27:00.032Z] ==> Extracting sources...
[2019-10-26T15:27:00.032Z]   -> Creating working copy of gobject-introspection git repo...
[2019-10-26T15:27:00.032Z] Cloning into 'gobject-introspection'...
[2019-10-26T15:27:00.032Z] done.
[2019-10-26T15:27:00.282Z] Switched to a new branch 'makepkg'
[2019-10-26T15:27:00.282Z]   -> Creating working copy of glib git repo...
[2019-10-26T15:27:00.282Z] Cloning into 'glib'...
[2019-10-26T15:27:00.282Z] done.
[2019-10-26T15:27:01.193Z] Switched to a new branch 'makepkg'
[2019-10-26T15:27:01.193Z] ==> Starting prepare()...
[2019-10-26T15:27:01.193Z] ==> Starting pkgver()...
[2019-10-26T15:27:01.193Z] ==> Starting build()...
[2019-10-26T15:27:01.193Z] + exec meson setup --prefix /usr --libexecdir lib --sbindir bin --buildtype plain --auto-features enabled --wrap-mode nodownload -D b_lto=true -D b_pie=true gobject-introspection build -D cairo=true -D gtk_doc=true -D doctool=true -D glib_src_dir=/build/gobject-introspection/src/glib
[2019-10-26T15:27:03.676Z] The Meson build system
[2019-10-26T15:27:03.676Z] Version: 0.52.0
[2019-10-26T15:27:03.676Z] Source dir: /build/gobject-introspection/src/gobject-introspection
[2019-10-26T15:27:03.676Z] Build dir: /build/gobject-introspection/src/build
[2019-10-26T15:27:03.676Z] Build type: native build
[2019-10-26T15:27:03.676Z] Project name: gobject-introspection
[2019-10-26T15:27:03.676Z] Project version: 1.62.0
[2019-10-26T15:27:03.676Z] Appending CFLAGS from environment: '-march=x86-64 -mtune=generic -O2 -pipe -fno-plt'
[2019-10-26T15:27:03.676Z] Appending LDFLAGS from environment: ['-Wl,-O1,--sort-common,--as-needed,-z,relro,-z,now']
[2019-10-26T15:27:03.676Z] Appending CPPFLAGS from environment: '-D_FORTIFY_SOURCE=2'
[2019-10-26T15:27:03.676Z] Appending CFLAGS from environment: '-march=x86-64 -mtune=generic -O2 -pipe -fno-plt'
[2019-10-26T15:27:03.676Z] Appending LDFLAGS from environment: ['-Wl,-O1,--sort-common,--as-needed,-z,relro,-z,now']
[2019-10-26T15:27:03.676Z] Appending CPPFLAGS from environment: '-D_FORTIFY_SOURCE=2'
[2019-10-26T15:27:03.676Z] C compiler for the host machine: cc (gcc 9.2.0 "cc (GCC) 9.2.0")
[2019-10-26T15:27:03.676Z] C linker for the host machine: GNU ld.bfd 2.33.1
[2019-10-26T15:27:03.676Z] Host machine cpu family: x86_64
[2019-10-26T15:27:03.676Z] Host machine cpu: x86_64
[2019-10-26T15:27:03.676Z] Program python3 found: YES (/usr/bin/python3)
[2019-10-26T15:27:03.676Z] Compiler for C supports arguments -Wall: YES 
[2019-10-26T15:27:03.676Z] Compiler for C supports arguments -Warray-bounds: YES 
[2019-10-26T15:27:03.676Z] Compiler for C supports arguments -Wcast-align: YES 
[2019-10-26T15:27:03.676Z] Compiler for C supports arguments -Wdeclaration-after-statement: YES 
[2019-10-26T15:27:03.676Z] Compiler for C supports arguments -Wduplicated-branches: YES 
[2019-10-26T15:27:03.676Z] Compiler for C supports arguments -Wextra: YES 
[2019-10-26T15:27:03.676Z] Compiler for C supports arguments -Wformat=2: YES 
[2019-10-26T15:27:03.676Z] Compiler for C supports arguments -Wformat-nonliteral: YES 
[2019-10-26T15:27:03.676Z] Compiler for C supports arguments -Wformat-security: YES 
[2019-10-26T15:27:03.676Z] Compiler for C supports arguments -Wimplicit-function-declaration: YES 
[2019-10-26T15:27:03.676Z] Compiler for C supports arguments -Winit-self: YES 
[2019-10-26T15:27:03.676Z] Compiler for C supports arguments -Wjump-misses-init: YES 
[2019-10-26T15:27:03.676Z] Compiler for C supports arguments -Wlogical-op: YES 
[2019-10-26T15:27:03.676Z] Compiler for C supports arguments -Wmissing-declarations: YES 
[2019-10-26T15:27:03.676Z] Compiler for C supports arguments -Wmissing-format-attribute: YES 
[2019-10-26T15:27:03.676Z] Compiler for C supports arguments -Wmissing-include-dirs: YES 
[2019-10-26T15:27:03.676Z] Compiler for C supports arguments -Wmissing-noreturn: YES 
[2019-10-26T15:27:03.676Z] Compiler for C supports arguments -Wmissing-prototypes: YES 
[2019-10-26T15:27:03.676Z] Compiler for C supports arguments -Wnested-externs: YES 
[2019-10-26T15:27:03.676Z] Compiler for C supports arguments -Wnull-dereference: YES 
[2019-10-26T15:27:03.676Z] Compiler for C supports arguments -Wold-style-definition: YES 
[2019-10-26T15:27:03.676Z] Compiler for C supports arguments -Wpacked: YES 
[2019-10-26T15:27:03.676Z] Compiler for C supports arguments -Wpointer-arith: YES 
[2019-10-26T15:27:03.676Z] Compiler for C supports arguments -Wrestrict: YES 
[2019-10-26T15:27:03.676Z] Compiler for C supports arguments -Wreturn-type: YES 
[2019-10-26T15:27:03.676Z] Compiler for C supports arguments -Wshadow: YES 
[2019-10-26T15:27:03.676Z] Compiler for C supports arguments -Wsign-compare: YES 
[2019-10-26T15:27:03.676Z] Compiler for C supports arguments -Wstrict-aliasing: YES 
[2019-10-26T15:27:03.676Z] Compiler for C supports arguments -Wstrict-prototypes: YES 
[2019-10-26T15:27:03.676Z] Compiler for C supports arguments -Wundef: YES 
[2019-10-26T15:27:03.676Z] Compiler for C supports arguments -Wunused-but-set-variable: YES 
[2019-10-26T15:27:03.676Z] Compiler for C supports arguments -Wwrite-strings: YES 
[2019-10-26T15:27:03.676Z] Compiler for C supports arguments -fno-strict-aliasing: YES 
[2019-10-26T15:27:03.676Z] WARNING: Consider using the builtin warning_level option instead of adding warning flags by hand.
[2019-10-26T15:27:03.676Z] WARNING: Consider using the builtin warning_level option instead of adding warning flags by hand.
[2019-10-26T15:27:03.676Z] Checking for size of "char" : 1
[2019-10-26T15:27:03.676Z] Checking for size of "short" : 2
[2019-10-26T15:27:03.676Z] Checking for size of "int" : 4
[2019-10-26T15:27:03.676Z] Checking for size of "long" : 8
[2019-10-26T15:27:03.676Z] Configuring config.h using configuration
[2019-10-26T15:27:03.676Z] Found pkg-config: /usr/bin/pkg-config (1.6.3)
[2019-10-26T15:27:03.676Z] Run-time dependency glib-2.0 found: YES 2.62.2
[2019-10-26T15:27:03.676Z] Run-time dependency gobject-2.0 found: YES 2.62.2
[2019-10-26T15:27:03.676Z] Run-time dependency gio-2.0 found: YES 2.62.2
[2019-10-26T15:27:03.676Z] Run-time dependency gmodule-2.0 found: YES 2.62.2
[2019-10-26T15:27:03.676Z] Run-time dependency gio-unix-2.0 found: YES 2.62.2
[2019-10-26T15:27:03.676Z] Run-time dependency libffi found: YES 3.2.1
[2019-10-26T15:27:03.676Z] Run-time dependency cairo found: YES 1.17.3
[2019-10-26T15:27:03.676Z] Run-time dependency cairo-gobject found: YES 1.17.3
[2019-10-26T15:27:03.676Z] Library m found: YES
[2019-10-26T15:27:03.676Z] Compiler for C supports arguments -Wno-implicit-fallthrough -Wimplicit-fallthrough: YES 
[2019-10-26T15:27:03.676Z] Compiler for C supports arguments -Wno-old-style-definition -Wold-style-definition: YES 
[2019-10-26T15:27:03.676Z] Compiler for C supports arguments -Wno-suggest-attribute=noreturn -Wsuggest-attribute=noreturn: YES 
[2019-10-26T15:27:03.676Z] Compiler for C supports arguments -Wno-type-limits -Wtype-limits: YES 
[2019-10-26T15:27:03.676Z] Compiler for C supports arguments -Wno-undef -Wundef: YES 
[2019-10-26T15:27:03.676Z] Compiler for C supports arguments -Wno-unused-parameter -Wunused-parameter: YES 
[2019-10-26T15:27:03.676Z] Compiler for C supports arguments -Wno-cast-align -Wcast-align: YES 
[2019-10-26T15:27:03.676Z] Compiler for C supports arguments -Wno-unused-function -Wunused-function: YES 
[2019-10-26T15:27:03.676Z] Compiler for C supports arguments -Wno-return-type -Wreturn-type: YES 
[2019-10-26T15:27:03.676Z] Compiler for C supports arguments -Wno-old-style-definition -Wold-style-definition: YES (cached)
[2019-10-26T15:27:03.676Z] Compiler for C supports arguments -Wno-type-limits -Wtype-limits: YES (cached)
[2019-10-26T15:27:03.676Z] Compiler for C supports arguments -Wno-old-style-definition -Wold-style-definition: YES (cached)
[2019-10-26T15:27:03.676Z] Compiler for C supports arguments -Wno-cast-align -Wcast-align: YES (cached)
[2019-10-26T15:27:03.676Z] Compiler for C supports arguments -Wno-unused-parameter -Wunused-parameter: YES (cached)
[2019-10-26T15:27:03.676Z] Compiler for C supports arguments -Wno-duplicated-branches -Wduplicated-branches: YES 
[2019-10-26T15:27:03.676Z] Compiler for C supports arguments -Wno-cast-align -Wcast-align: YES (cached)
[2019-10-26T15:27:03.676Z] Configuring giversion.h using configuration
[2019-10-26T15:27:03.676Z] Compiler for C supports arguments -Wno-unused-parameter -Wunused-parameter: YES (cached)
[2019-10-26T15:27:03.676Z] Compiler for C supports arguments -Wno-duplicated-branches -Wduplicated-branches: YES (cached)
[2019-10-26T15:27:03.676Z] Compiler for C supports arguments -Wno-type-limits -Wtype-limits: YES (cached)
[2019-10-26T15:27:03.676Z] Compiler for C supports arguments -Wno-cast-align -Wcast-align: YES (cached)
[2019-10-26T15:27:03.676Z] Compiler for C supports arguments -Wno-missing-field-initializers -Wmissing-field-initializers: YES 
[2019-10-26T15:27:03.676Z] Configuring g-ir-scanner using configuration
[2019-10-26T15:27:03.676Z] Program /build/gobject-introspection/src/build/tools/g-ir-scanner found: YES (/build/gobject-introspection/src/build/tools/g-ir-scanner)
[2019-10-26T15:27:03.676Z] Configuring g-ir-annotation-tool using configuration
[2019-10-26T15:27:03.676Z] Program /build/gobject-introspection/src/build/tools/g-ir-annotation-tool found: YES (/build/gobject-introspection/src/build/tools/g-ir-annotation-tool)
[2019-10-26T15:27:03.676Z] Configuring g-ir-doc-tool using configuration
[2019-10-26T15:27:03.676Z] Program /build/gobject-introspection/src/build/tools/g-ir-doc-tool found: YES (/build/gobject-introspection/src/build/tools/g-ir-doc-tool)
[2019-10-26T15:27:03.676Z] Compiler for C supports arguments -Wno-missing-field-initializers -Wmissing-field-initializers: YES (cached)
[2019-10-26T15:27:03.676Z] Configuring _version.py using configuration
[2019-10-26T15:27:03.676Z] Configuring __init__.py using configuration
[2019-10-26T15:27:03.676Z] Configuring annotationmain.py using configuration
[2019-10-26T15:27:03.676Z] Configuring annotationparser.py using configuration
[2019-10-26T15:27:03.676Z] Configuring ast.py using configuration
[2019-10-26T15:27:03.676Z] Configuring cachestore.py using configuration
[2019-10-26T15:27:03.676Z] Configuring ccompiler.py using configuration
[2019-10-26T15:27:03.676Z] Configuring codegen.py using configuration
[2019-10-26T15:27:03.676Z] Configuring docmain.py using configuration
[2019-10-26T15:27:03.676Z] Configuring docwriter.py using configuration
[2019-10-26T15:27:03.676Z] Configuring dumper.py using configuration
[2019-10-26T15:27:03.676Z] Configuring introspectablepass.py using configuration
[2019-10-26T15:27:03.676Z] Configuring girparser.py using configuration
[2019-10-26T15:27:03.676Z] Configuring girwriter.py using configuration
[2019-10-26T15:27:03.676Z] Configuring gdumpparser.py using configuration
[2019-10-26T15:27:03.676Z] Configuring libtoolimporter.py using configuration
[2019-10-26T15:27:03.676Z] Configuring maintransformer.py using configuration
[2019-10-26T15:27:03.677Z] Configuring mdextensions.py using configuration
[2019-10-26T15:27:03.677Z] Configuring message.py using configuration
[2019-10-26T15:27:03.677Z] Configuring msvccompiler.py using configuration
[2019-10-26T15:27:03.677Z] Configuring pkgconfig.py using configuration
[2019-10-26T15:27:03.677Z] Configuring shlibs.py using configuration
[2019-10-26T15:27:03.677Z] Configuring scannermain.py using configuration
[2019-10-26T15:27:03.677Z] Configuring sectionparser.py using configuration
[2019-10-26T15:27:03.677Z] Configuring sourcescanner.py using configuration
[2019-10-26T15:27:03.677Z] Configuring testcodegen.py using configuration
[2019-10-26T15:27:03.677Z] Configuring transformer.py using configuration
[2019-10-26T15:27:03.677Z] Configuring utils.py using configuration
[2019-10-26T15:27:03.677Z] Configuring xmlwriter.py using configuration
[2019-10-26T15:27:03.677Z] giscanner/meson.build:52: WARNING: Custom target input 'doctemplates' can't be converted to File object(s).
[2019-10-26T15:27:03.677Z] This will become a hard error in the future.
[2019-10-26T15:27:03.677Z] Program flex found: YES (/usr/bin/flex)
[2019-10-26T15:27:03.677Z] Program bison found: YES (/usr/bin/bison)
[2019-10-26T15:27:03.677Z] Has header "unistd.h" : YES 
[2019-10-26T15:27:03.677Z] Compiler for C supports arguments -Wno-missing-field-initializers -Wmissing-field-initializers: YES (cached)
[2019-10-26T15:27:03.677Z] Compiler for C supports arguments -Wno-unused-parameter -Wunused-parameter: YES (cached)
[2019-10-26T15:27:03.677Z] Dependency python found: YES (pkgconfig)
[2019-10-26T15:27:03.677Z] Configuring cairo-1.0.gir using configuration
[2019-10-26T15:27:03.677Z] Configuring version.xml using configuration
[2019-10-26T15:27:03.677Z] Compiler for C supports arguments -Wno-unused-parameter -Wunused-parameter: YES (cached)
[2019-10-26T15:27:03.677Z] Compiler for C supports arguments -Wno-unused-parameter -Wunused-parameter: YES (cached)
[2019-10-26T15:27:03.927Z] Compiler for C supports arguments -Wno-unused-parameter -Wunused-parameter: YES (cached)
[2019-10-26T15:27:03.927Z] Compiler for C supports arguments -Wno-unused-parameter -Wunused-parameter: YES (cached)
[2019-10-26T15:27:03.927Z] Compiler for C supports arguments -Wno-old-style-definition -Wold-style-definition: YES (cached)
[2019-10-26T15:27:03.927Z] Compiler for C supports arguments -Wno-missing-field-initializers -Wmissing-field-initializers: YES (cached)
[2019-10-26T15:27:03.927Z] Compiler for C supports arguments -Wno-unused-parameter -Wunused-parameter: YES (cached)
[2019-10-26T15:27:03.927Z] Program pkg-config found: YES (/usr/bin/pkg-config)
[2019-10-26T15:27:03.927Z] Configuring gobject-introspection-no-export-1.0.pc using configuration
[2019-10-26T15:27:03.927Z] Configuring gobject-introspection-1.0.pc using configuration
[2019-10-26T15:27:03.927Z] Build targets in project: 90
[2019-10-26T15:27:03.927Z] Option buildtype is: plain [default: debugoptimized]
[2019-10-26T15:27:03.927Z] Found ninja-1.9.0 at /usr/bin/ninja
[2019-10-26T15:27:03.927Z] ninja: Entering directory `build'
[2019-10-26T15:27:04.178Z] [1/170] Compiling C object 'girepository/cmph/6cca4a0@@cmph at sta/buffer_entry.c.o'.
[2019-10-26T15:27:04.178Z] [2/170] Compiling C object 'girepository/cmph/6cca4a0@@cmph at sta/buffer_manager.c.o'.
[2019-10-26T15:27:04.178Z] [3/170] Compiling C object 'girepository/cmph/6cca4a0@@cmph at sta/vstack.c.o'.
[2019-10-26T15:27:04.178Z] [4/170] Compiling C object 'girepository/cmph/6cca4a0@@cmph at sta/vqueue.c.o'.
[2019-10-26T15:27:04.178Z] [5/170] Compiling C object 'girepository/cmph/6cca4a0@@cmph at sta/miller_rabin.c.o'.
[2019-10-26T15:27:04.178Z] [6/170] Compiling C object 'girepository/cmph/6cca4a0@@cmph at sta/compressed_seq.c.o'.
[2019-10-26T15:27:04.178Z] [7/170] Compiling C object 'girepository/cmph/6cca4a0@@cmph at sta/hash.c.o'.
[2019-10-26T15:27:04.178Z] [8/170] Compiling C object 'girepository/cmph/6cca4a0@@cmph at sta/cmph_structs.c.o'.
[2019-10-26T15:27:04.178Z] [9/170] Compiling C object 'girepository/cmph/6cca4a0@@cmph-bdz-test at exe/.._cmph-bdz-test.c.o'.
[2019-10-26T15:27:04.178Z] [10/170] Compiling C object 'girepository/cmph/6cca4a0@@cmph at sta/compressed_rank.c.o'.
[2019-10-26T15:27:04.178Z] [11/170] Compiling C object 'girepository/cmph/6cca4a0@@cmph at sta/fch_buckets.c.o'.
[2019-10-26T15:27:04.178Z] [12/170] Compiling C object 'girepository/cmph/6cca4a0@@cmph at sta/select.c.o'.
[2019-10-26T15:27:04.178Z] [13/170] Compiling C object 'girepository/cmph/6cca4a0@@cmph at sta/cmph.c.o'.
[2019-10-26T15:27:04.178Z] ../gobject-introspection/girepository/cmph/cmph.c: In function ‘count_nlfile_keys’:
[2019-10-26T15:27:04.178Z] ../gobject-introspection/girepository/cmph/cmph.c:158:3: warning: ignoring return value of ‘fgets’, declared with attribute warn_unused_result [-Wunused-result]
[2019-10-26T15:27:04.178Z]   158 |   fgets(buf, BUFSIZ, fd);
[2019-10-26T15:27:04.178Z]       |   ^~~~~~~~~~~~~~~~~~~~~~
[2019-10-26T15:27:04.178Z] [14/170] Compiling C object 'girepository/cmph/6cca4a0@@cmph at sta/graph.c.o'.
[2019-10-26T15:27:04.178Z] [15/170] Compiling C object 'girepository/cmph/6cca4a0@@cmph at sta/jenkins_hash.c.o'.
[2019-10-26T15:27:04.178Z] [16/170] Compiling C object 'girepository/667a256@@girepository-internals at sta/giroffsets.c.o'.
[2019-10-26T15:27:04.178Z] [17/170] Compiling C object 'girepository/cmph/6cca4a0@@cmph at sta/chd.c.o'.
[2019-10-26T15:27:04.178Z] [18/170] Compiling C object 'girepository/cmph/6cca4a0@@cmph at sta/bdz.c.o'.
[2019-10-26T15:27:04.178Z] [19/170] Compiling C object 'girepository/cmph/6cca4a0@@cmph at sta/fch.c.o'.
[2019-10-26T15:27:04.178Z] [20/170] Compiling C object 'girepository/667a256@@girepository-gthash at sta/gthash.c.o'.
[2019-10-26T15:27:04.178Z] [21/170] Compiling C object 'girepository/667a256@@girepository-1.0 at sha/gibaseinfo.c.o'.
[2019-10-26T15:27:04.178Z] [22/170] Compiling C object 'girepository/cmph/6cca4a0@@cmph at sta/bdz_ph.c.o'.
[2019-10-26T15:27:04.178Z] [23/170] Compiling C object 'girepository/cmph/6cca4a0@@cmph at sta/bmz.c.o'.
[2019-10-26T15:27:04.178Z] [24/170] Compiling C object 'girepository/667a256@@girepository-1.0 at sha/gicallableinfo.c.o'.
[2019-10-26T15:27:04.178Z] [25/170] Compiling C object 'girepository/667a256@@girepository-internals at sta/girmodule.c.o'.
[2019-10-26T15:27:04.178Z] [26/170] Compiling C object 'girepository/cmph/6cca4a0@@cmph at sta/chm.c.o'.
[2019-10-26T15:27:04.178Z] [27/170] Compiling C object 'girepository/cmph/6cca4a0@@cmph at sta/bmz8.c.o'.
[2019-10-26T15:27:04.178Z] [28/170] Compiling C object 'girepository/667a256@@girepository-1.0 at sha/giarginfo.c.o'.
[2019-10-26T15:27:04.178Z] [29/170] Compiling C object 'girepository/cmph/6cca4a0@@cmph at sta/chd_ph.c.o'.
[2019-10-26T15:27:04.428Z] [30/170] Linking static target girepository/libgirepository-gthash.a.
[2019-10-26T15:27:04.428Z] [31/170] Compiling C object 'girepository/cmph/6cca4a0@@cmph at sta/brz.c.o'.
[2019-10-26T15:27:04.428Z] [32/170] Compiling C object 'girepository/667a256@@girepository-1.0 at sha/gdump.c.o'.
[2019-10-26T15:27:04.428Z] [33/170] Compiling C object 'girepository/667a256@@girepository-1.0 at sha/giconstantinfo.c.o'.
[2019-10-26T15:27:04.428Z] [34/170] Compiling C object 'girepository/667a256@@girepository-internals at sta/girwriter.c.o'.
[2019-10-26T15:27:04.428Z] [35/170] Generating scannerlexer with a custom command.
[2019-10-26T15:27:04.428Z] [36/170] Compiling C object 'girepository/667a256@@girepository-1.0 at sha/gipropertyinfo.c.o'.
[2019-10-26T15:27:04.428Z] [37/170] Compiling C object 'girepository/667a256@@girepository-1.0 at sha/ginvoke.c.o'.
[2019-10-26T15:27:04.428Z] [38/170] Compiling C object 'girepository/667a256@@girepository-1.0 at sha/giversion.c.o'.
[2019-10-26T15:27:04.428Z] [39/170] Compiling C object 'girepository/667a256@@girepository-internals at sta/girnode.c.o'.
[2019-10-26T15:27:04.428Z] [40/170] Linking static target girepository/cmph/libcmph.a.
[2019-10-26T15:27:04.428Z] [41/170] Compiling C object 'girepository/667a256@@girepository-1.0 at sha/gienuminfo.c.o'.
[2019-10-26T15:27:04.428Z] [42/170] Compiling C object 'girepository/667a256@@girepository-1.0 at sha/gifunctioninfo.c.o'.
[2019-10-26T15:27:04.428Z] [43/170] Compiling C object 'girepository/667a256@@girepository-1.0 at sha/giregisteredtypeinfo.c.o'.
[2019-10-26T15:27:04.428Z] [44/170] Compiling C object 'girepository/667a256@@girepository-1.0 at sha/girffi.c.o'.
[2019-10-26T15:27:04.428Z] [45/170] Compiling C object 'girepository/667a256@@girepository-1.0 at sha/gifieldinfo.c.o'.
[2019-10-26T15:27:04.428Z] [46/170] Compiling C object 'girepository/667a256@@girepository-1.0 at sha/gisignalinfo.c.o'.
[2019-10-26T15:27:04.428Z] [47/170] Generating copy-templates with a custom command.
[2019-10-26T15:27:04.428Z] [48/170] Compiling C object 'girepository/667a256@@girepository-1.0 at sha/giunioninfo.c.o'.
[2019-10-26T15:27:04.428Z] [49/170] Compiling C object 'girepository/667a256@@girepository-1.0 at sha/gitypeinfo.c.o'.
[2019-10-26T15:27:04.428Z] [50/170] Compiling C object 'girepository/667a256@@girepository-1.0 at sha/giinterfaceinfo.c.o'.
[2019-10-26T15:27:04.428Z] [51/170] Compiling C object 'girepository/667a256@@girepository-1.0 at sha/gistructinfo.c.o'.
[2019-10-26T15:27:04.428Z] [52/170] Compiling C object 'girepository/667a256@@gthash-test at exe/gthash-test.c.o'.
[2019-10-26T15:27:04.428Z] [53/170] Compiling C object 'girepository/667a256@@girepository-1.0 at sha/givfuncinfo.c.o'.
[2019-10-26T15:27:04.428Z] [54/170] Compiling C object 'tools/f9d35d4@@g-ir-generate at exe/generate.c.o'.
[2019-10-26T15:27:04.428Z] [55/170] Compiling C object 'tools/f9d35d4@@g-ir-inspect at exe/g-ir-inspect.c.o'.
[2019-10-26T15:27:04.428Z] [56/170] Compiling C object 'girepository/667a256@@girepository-1.0 at sha/giobjectinfo.c.o'.
[2019-10-26T15:27:04.428Z] [57/170] Compiling C object 'examples/c590b3c@@glib-print at exe/glib-print.c.o'.
[2019-10-26T15:27:04.429Z] [58/170] Compiling C object 'tests/offsets/3bcf258@@offsets-1.0 at sha/offsets.c.o'.
[2019-10-26T15:27:04.429Z] [59/170] Compiling C object 'tests/scanner/61956ec@@gtkfrob-1.0 at sha/gtkfrob.c.o'.
[2019-10-26T15:27:04.429Z] [60/170] Compiling C object 'tests/offsets/3bcf258@@gitestoffsets at exe/gitestoffsets.c.o'.
[2019-10-26T15:27:04.429Z] [61/170] Compiling C object 'girepository/667a256@@girepository-internals at sta/girparser.c.o'.
[2019-10-26T15:27:04.429Z] [62/170] Compiling C object 'tests/scanner/61956ec@@utility-1.0 at sha/utility.c.o'.
[2019-10-26T15:27:04.429Z] [63/170] Compiling C object 'girepository/667a256@@gi-dump-types at exe/gi-dump-types.c.o'.
[2019-10-26T15:27:04.429Z] [64/170] Compiling C object 'tests/scanner/61956ec@@gettype-1.0 at sha/gettype.c.o'.
[2019-10-26T15:27:04.429Z] [65/170] Compiling C object 'tests/scanner/61956ec@@regress-1.0 at sha/drawable.c.o'.
[2019-10-26T15:27:04.429Z] [66/170] Compiling C object 'tests/scanner/61956ec@@typedef-1.0 at sha/typedefs.c.o'.
[2019-10-26T15:27:04.429Z] [67/170] Linking static target girepository/libgirepository-internals.a.
[2019-10-26T15:27:04.429Z] [68/170] Compiling C object 'girepository/667a256@@girepository-1.0 at sha/girepository.c.o'.
[2019-10-26T15:27:04.429Z] [69/170] Compiling C object 'tests/repository/3598dd2@@giteststructinfo at exe/giteststructinfo.c.o'.
[2019-10-26T15:27:04.429Z] [70/170] Compiling C object 'girepository/667a256@@girepository-1.0 at sha/gitypelib.c.o'.
[2019-10-26T15:27:04.429Z] [71/170] Compiling C object 'tests/scanner/61956ec@@regress-1.0 at sha/annotation.c.o'.
[2019-10-26T15:27:04.429Z] [72/170] Compiling C object 'tests/scanner/61956ec@@barapp-1.0 at sha/barapp.c.o'.
[2019-10-26T15:27:04.429Z] [73/170] Compiling C object 'tests/repository/3598dd2@@gitestthrows at exe/gitestthrows.c.o'.
[2019-10-26T15:27:04.679Z] [74/170] Linking target tests/offsets/liboffsets-1.0.so.1.0.0.
[2019-10-26T15:27:04.679Z] [75/170] Generating scannerparser with a custom command.
[2019-10-26T15:27:04.679Z] ../gobject-introspection/giscanner/scannerparser.y:249.1-14: warning: deprecated directive, use ‘%define parse.error verbose’ [-Wdeprecated]
[2019-10-26T15:27:04.679Z]   249 | %error-verbose
[2019-10-26T15:27:04.679Z]       | ^~~~~~~~~~~~~~
[2019-10-26T15:27:04.679Z] ../gobject-introspection/giscanner/scannerparser.y: warning: 7 shift/reduce conflicts [-Wconflicts-sr]
[2019-10-26T15:27:04.679Z] ../gobject-introspection/giscanner/scannerparser.y: warning: fix-its can be applied.  Rerun with option '--update'. [-Wother]
[2019-10-26T15:27:04.679Z] [76/170] Linking target tests/scanner/libgtkfrob-1.0.so.
[2019-10-26T15:27:04.679Z] [77/170] Compiling C object 'tests/scanner/61956ec@@sletter-1.0 at sha/sletter.c.o'.
[2019-10-26T15:27:04.679Z] [78/170] Compiling C object 'tests/repository/3598dd2@@gitypelibtest at exe/gitypelibtest.c.o'.
[2019-10-26T15:27:04.679Z] [79/170] Compiling C object 'tests/scanner/61956ec@@warnlib-1.0 at sha/warnlib.c.o'.
[2019-10-26T15:27:04.679Z] [80/170] Linking target tests/scanner/libutility-1.0.so.
[2019-10-26T15:27:04.679Z] [81/170] Compiling C object 'tools/f9d35d4@@g-ir-compiler at exe/compiler.c.o'.
[2019-10-26T15:27:04.679Z] [82/170] Linking target tests/scanner/libgettype-1.0.so.
[2019-10-26T15:27:04.679Z] [83/170] Compiling C object 'tests/repository/3598dd2@@gitestrepo at exe/gitestrepo.c.o'.
[2019-10-26T15:27:04.679Z] [84/170] Linking target tests/scanner/libtypedef-1.0.so.
[2019-10-26T15:27:04.679Z] [85/170] Linking target tests/scanner/libsletter-1.0.so.
[2019-10-26T15:27:04.679Z] [86/170] Compiling C object 'tests/scanner/61956ec@@regress-1.0 at sha/foo.c.o'.
[2019-10-26T15:27:04.679Z] [87/170] Linking target tests/scanner/libwarnlib-1.0.so.
[2019-10-26T15:27:04.679Z] [88/170] Compiling C object 'giscanner/fed4f5e@@_giscanner.cpython-38-x86_64-linux-gnu at sha/giscannermodule.c.o'.
[2019-10-26T15:27:04.679Z] [89/170] Compiling C object 'giscanner/fed4f5e@@giscanner at sta/sourcescanner.c.o'.
[2019-10-26T15:27:04.929Z] [90/170] Compiling C object 'tests/59830eb@@gimarshallingtests-1.0 at sha/gimarshallingtests.c.o'.
[2019-10-26T15:27:04.929Z] [91/170] Compiling C object 'tests/scanner/61956ec@@regress-1.0 at sha/regress.c.o'.
[2019-10-26T15:27:04.929Z] [92/170] Compiling C object 'giscanner/fed4f5e@@giscanner at sta/meson-generated_.._scannerparser.c.o'.
[2019-10-26T15:27:04.929Z] [93/170] Compiling C object 'giscanner/fed4f5e@@giscanner at sta/meson-generated_.._scannerlexer.c.o'.
[2019-10-26T15:27:04.929Z] [94/170] Linking static target giscanner/libgiscanner.a.
[2019-10-26T15:27:05.840Z] [95/170] Linking target giscanner/_giscanner.cpython-38-x86_64-linux-gnu.so.
[2019-10-26T15:27:05.840Z] [96/170] Linking target tests/scanner/libregress-1.0.so.
[2019-10-26T15:27:06.391Z] [97/170] Linking target tests/libgimarshallingtests-1.0.so.1.0.0.
[2019-10-26T15:27:06.391Z] [98/170] Linking target girepository/gthash-test.
[2019-10-26T15:27:06.391Z] [99/170] Linking target girepository/cmph/cmph-bdz-test.
[2019-10-26T15:27:06.641Z] [100/170] Linking target girepository/libgirepository-1.0.so.1.0.0.
[2019-10-26T15:27:06.891Z] [101/170] Generating symbol file 'girepository/667a256@@girepository-1.0 at sha/libgirepository-1.0.so.1.0.0.symbols'.
[2019-10-26T15:27:07.142Z] [102/170] Linking target tests/scanner/libbarapp-1.0.so.
[2019-10-26T15:27:07.142Z] [103/170] Linking target tests/repository/gitestthrows.
[2019-10-26T15:27:07.142Z] [104/170] Linking target examples/glib-print.
[2019-10-26T15:27:07.142Z] [105/170] Linking target tests/repository/giteststructinfo.
[2019-10-26T15:27:07.142Z] [106/170] Linking target tools/g-ir-inspect.
[2019-10-26T15:27:07.142Z] [107/170] Linking target tests/repository/gitestrepo.
[2019-10-26T15:27:07.142Z] [108/170] Linking target tests/repository/gitypelibtest.
[2019-10-26T15:27:07.142Z] [109/170] Linking target tests/offsets/gitestoffsets.
[2019-10-26T15:27:07.142Z] [110/170] Linking target girepository/gi-dump-types.
[2019-10-26T15:27:07.392Z] [111/170] Linking target tools/g-ir-generate.
[2019-10-26T15:27:10.620Z] [112/170] Linking target tools/g-ir-compiler.
[2019-10-26T15:27:11.170Z] [113/170] Generating gir-glib with a custom command.
[2019-10-26T15:27:11.170Z] In file included from /usr/include/bits/libc-header-start.h:33,
[2019-10-26T15:27:11.170Z]                  from /usr/include/limits.h:26,
[2019-10-26T15:27:11.170Z]                  from /usr/lib/gcc/x86_64-pc-linux-gnu/9.2.0/include-fixed/limits.h:194,
[2019-10-26T15:27:11.170Z]                  from /usr/lib/gcc/x86_64-pc-linux-gnu/9.2.0/include-fixed/syslimits.h:7,
[2019-10-26T15:27:11.170Z]                  from /usr/lib/gcc/x86_64-pc-linux-gnu/9.2.0/include-fixed/limits.h:34,
[2019-10-26T15:27:11.170Z]                  from /usr/lib/glib-2.0/include/glibconfig.h:11,
[2019-10-26T15:27:11.170Z]                  from /usr/include/glib-2.0/glib/gtypes.h:32,
[2019-10-26T15:27:11.170Z]                  from /usr/include/glib-2.0/glib/galloca.h:32,
[2019-10-26T15:27:11.170Z]                  from /usr/include/glib-2.0/glib.h:30,
[2019-10-26T15:27:11.170Z]                  from /usr/include/glib-2.0/gobject/glib-types.h:24,
[2019-10-26T15:27:11.170Z]                  from /build/gobject-introspection/src/build/g-ir-cpp-3eadi9f_.c:4:
[2019-10-26T15:27:11.170Z] /usr/include/features.h:382:4: warning: #warning _FORTIFY_SOURCE requires compiling with optimization (-O) [-Wcpp]
[2019-10-26T15:27:11.170Z]   382 | #  warning _FORTIFY_SOURCE requires compiling with optimization (-O)
[2019-10-26T15:27:11.170Z]       |    ^~~~~~~
[2019-10-26T15:27:12.081Z] [114/170] Generating gir-gmodule with a custom command.
[2019-10-26T15:27:12.081Z] In file included from /usr/include/bits/libc-header-start.h:33,
[2019-10-26T15:27:12.081Z]                  from /usr/include/limits.h:26,
[2019-10-26T15:27:12.081Z]                  from /usr/lib/gcc/x86_64-pc-linux-gnu/9.2.0/include-fixed/limits.h:194,
[2019-10-26T15:27:12.081Z]                  from /usr/lib/gcc/x86_64-pc-linux-gnu/9.2.0/include-fixed/syslimits.h:7,
[2019-10-26T15:27:12.081Z]                  from /usr/lib/gcc/x86_64-pc-linux-gnu/9.2.0/include-fixed/limits.h:34,
[2019-10-26T15:27:12.081Z]                  from /usr/lib/glib-2.0/include/glibconfig.h:11,
[2019-10-26T15:27:12.081Z]                  from /usr/include/glib-2.0/glib/gtypes.h:32,
[2019-10-26T15:27:12.081Z]                  from /usr/include/glib-2.0/glib/galloca.h:32,
[2019-10-26T15:27:12.081Z]                  from /usr/include/glib-2.0/glib.h:30,
[2019-10-26T15:27:12.081Z]                  from /usr/include/glib-2.0/gmodule.h:28,
[2019-10-26T15:27:12.081Z]                  from /build/gobject-introspection/src/build/g-ir-cpp-62uskya1.c:4:
[2019-10-26T15:27:12.081Z] /usr/include/features.h:382:4: warning: #warning _FORTIFY_SOURCE requires compiling with optimization (-O) [-Wcpp]
[2019-10-26T15:27:12.081Z]   382 | #  warning _FORTIFY_SOURCE requires compiling with optimization (-O)
[2019-10-26T15:27:12.081Z]       |    ^~~~~~~
[2019-10-26T15:27:13.424Z] [115/170] Generating gir-gobject with a custom command.
[2019-10-26T15:27:13.424Z] In file included from /usr/include/bits/libc-header-start.h:33,
[2019-10-26T15:27:13.424Z]                  from /usr/include/limits.h:26,
[2019-10-26T15:27:13.424Z]                  from /usr/lib/gcc/x86_64-pc-linux-gnu/9.2.0/include-fixed/limits.h:194,
[2019-10-26T15:27:13.424Z]                  from /usr/lib/gcc/x86_64-pc-linux-gnu/9.2.0/include-fixed/syslimits.h:7,
[2019-10-26T15:27:13.424Z]                  from /usr/lib/gcc/x86_64-pc-linux-gnu/9.2.0/include-fixed/limits.h:34,
[2019-10-26T15:27:13.424Z]                  from /usr/lib/glib-2.0/include/glibconfig.h:11,
[2019-10-26T15:27:13.424Z]                  from /usr/include/glib-2.0/glib/gtypes.h:32,
[2019-10-26T15:27:13.424Z]                  from /usr/include/glib-2.0/glib/galloca.h:32,
[2019-10-26T15:27:13.424Z]                  from /usr/include/glib-2.0/glib.h:30,
[2019-10-26T15:27:13.424Z]                  from /usr/include/glib-2.0/gobject/gbinding.h:28,
[2019-10-26T15:27:13.424Z]                  from /build/gobject-introspection/src/build/g-ir-cpp-p1mbhisq.c:4:
[2019-10-26T15:27:13.424Z] /usr/include/features.h:382:4: warning: #warning _FORTIFY_SOURCE requires compiling with optimization (-O) [-Wcpp]
[2019-10-26T15:27:13.425Z]   382 | #  warning _FORTIFY_SOURCE requires compiling with optimization (-O)
[2019-10-26T15:27:13.425Z]       |    ^~~~~~~
[2019-10-26T15:27:13.425Z] [116/170] Generating generate_typelib_xfixes_4_0_gir with a custom command.
[2019-10-26T15:27:13.425Z] [117/170] Generating generate_typelib_win32_1_0_gir with a custom command.
[2019-10-26T15:27:13.425Z] [118/170] Generating generate_typelib_xft_2_0_gir with a custom command.
[2019-10-26T15:27:13.425Z] [119/170] Generating generate_typelib_xlib_2_0_gir with a custom command.
[2019-10-26T15:27:13.425Z] [120/170] Generating generate_typelib_DBus_1_0_gir with a custom command.
[2019-10-26T15:27:13.425Z] [121/170] Generating generate_typelib_xrandr_1_3_gir with a custom command.
[2019-10-26T15:27:13.425Z] [122/170] Generating generate_typelib_gir_cairo_1_0_gir with a custom command.
[2019-10-26T15:27:13.425Z] [123/170] Generating generate_typelib_fontconfig_2_0_gir with a custom command.
[2019-10-26T15:27:13.425Z] [124/170] Generating generate_typelib_freetype2_2_0_gir with a custom command.
[2019-10-26T15:27:13.425Z] [125/170] Generating generate_typelib_GL_1_0_gir with a custom command.
[2019-10-26T15:27:13.425Z] [126/170] Generating generate_typelib_libxml2_2_0_gir with a custom command.
[2019-10-26T15:27:13.675Z] [127/170] Generating generate_typelib_Vulkan_1_0_gir with a custom command.
[2019-10-26T15:27:13.675Z] [128/170] Generating generate_typelib__CustomTargetHolder_327a146__gir_gmodule_cus_____usr_bin_python3____File__tools_g_ir_scanner______output__OUTPUT_______no_libtool______quiet______reparse_validate______add_include_path_____build_gobject_introspection_src_build_gir______add_include_path_____build_gobject_introspection_src_gobject_introspection_gir______identifier_prefix_G______symbol_prefix_g______c_include_gmodule_h______namespace_GModule______nsversion_2_0______library_gmodule_2_0______external_library______pkg_gmodule_2_0______include_uninstalled__build_gobject_introspection_src_build_gir_GLib_2_0_gir______cflags_begin_____I_usr_include_glib_2_0_____I_usr_lib_glib_2_0_include______cflags_end_____INPUT____ with a custom command.
[2019-10-26T15:27:13.675Z] [129/170] Generating generate_typelib_DBusGLib_1_0_gir with a custom command.
[2019-10-26T15:27:13.675Z] [130/170] Generating generate_typelib__CustomTargetHolder_327a146__gir_glib_cus_____usr_bin_python3____File__tools_g_ir_scanner______output__OUTPUT_______no_libtool______quiet______reparse_validate______add_include_path_____build_gobject_introspection_src_build_gir______add_include_path_____build_gobject_introspection_src_gobject_introspection_gir______identifier_prefix_G______symbol_prefix_g______symbol_prefix_glib______c_include_glib_h______namespace_GLib______nsversion_2_0______library_glib_2_0______library_gobject_2_0______external_library______pkg_glib_2_0______cflags_begin_____I_usr_include_glib_2_0_____I_usr_lib_glib_2_0_include_____DGLIB_COMPILATION_____D__G_I18N_LIB_H_______DGETTEXT_PACKAGE_Dummy______cflags_end_____INPUT____ with a custom command.
[2019-10-26T15:27:13.675Z] [131/170] Generating generate_typelib__CustomTargetHolder_327a146__gir_gobject_cus_____usr_bin_python3____File__tools_g_ir_scanner______output__OUTPUT_______no_libtool______quiet______reparse_validate______add_include_path_____build_gobject_introspection_src_build_gir______add_include_path_____build_gobject_introspection_src_gobject_introspection_gir______identifier_prefix_G______c_include_glib_object_h______namespace_GObject______nsversion_2_0______library_gobject_2_0______external_library______pkg_gobject_2_0______include_uninstalled__build_gobject_introspection_src_build_gir_GLib_2_0_gir______cflags_begin_____I_usr_include_glib_2_0_____I_usr_lib_glib_2_0_include_____DGOBJECT_COMPILATION______cflags_end_____INPUT____ with a custom command.
[2019-10-26T15:27:15.018Z] [132/170] Generating gir-girepository with a custom command.
[2019-10-26T15:27:15.018Z] In file included from /usr/include/bits/libc-header-start.h:33,
[2019-10-26T15:27:15.018Z]                  from /usr/include/limits.h:26,
[2019-10-26T15:27:15.018Z]                  from /usr/lib/gcc/x86_64-pc-linux-gnu/9.2.0/include-fixed/limits.h:194,
[2019-10-26T15:27:15.018Z]                  from /usr/lib/gcc/x86_64-pc-linux-gnu/9.2.0/include-fixed/syslimits.h:7,
[2019-10-26T15:27:15.018Z]                  from /usr/lib/gcc/x86_64-pc-linux-gnu/9.2.0/include-fixed/limits.h:34,
[2019-10-26T15:27:15.018Z]                  from /usr/lib/glib-2.0/include/glibconfig.h:11,
[2019-10-26T15:27:15.018Z]                  from /usr/include/glib-2.0/glib/gtypes.h:32,
[2019-10-26T15:27:15.018Z]                  from /usr/include/glib-2.0/glib/galloca.h:32,
[2019-10-26T15:27:15.018Z]                  from /usr/include/glib-2.0/glib.h:30,
[2019-10-26T15:27:15.018Z]                  from /build/gobject-introspection/src/gobject-introspection/girepository/giversionmacros.h:22,
[2019-10-26T15:27:15.018Z]                  from /build/gobject-introspection/src/gobject-introspection/girepository/gitypes.h:30,
[2019-10-26T15:27:15.018Z]                  from /build/gobject-introspection/src/gobject-introspection/girepository/giarginfo.h:30,
[2019-10-26T15:27:15.018Z]                  from /build/gobject-introspection/src/build/g-ir-cpp-89xy6wzp.c:4:
[2019-10-26T15:27:15.018Z] /usr/include/features.h:382:4: warning: #warning _FORTIFY_SOURCE requires compiling with optimization (-O) [-Wcpp]
[2019-10-26T15:27:15.018Z]   382 | #  warning _FORTIFY_SOURCE requires compiling with optimization (-O)
[2019-10-26T15:27:15.018Z]       |    ^~~~~~~
[2019-10-26T15:27:15.268Z] [133/170] Generating generate_typelib__CustomTargetHolder_327a146__gir_girepository_cus_____usr_bin_python3____File__tools_g_ir_scanner______output__OUTPUT_______no_libtool______quiet______reparse_validate______add_include_path_____build_gobject_introspection_src_build_gir______add_include_path_____build_gobject_introspection_src_gobject_introspection_gir______identifier_prefix_GI______symbol_prefix_g______symbol_prefix_gi______c_include_girepository_h______namespace_GIRepository______nsversion_2_0______library_girepository_1_0______pkg_export_gobject_introspection_1_0_____L_build_gobject_introspection_src_build_gir____girepository______include_uninstalled__build_gobject_introspection_src_build_gir_GObject_2_0_gir______cflags_begin_____I_usr_include_glib_2_0_____I_usr_lib_glib_2_0_include_____I_build_gobject_introspection_src_gobject_introspection_gir____girepository_____I_build_gobject_introspection_src_build_gir____girepository_____DGI_COMPILATION______cflags_end_____INPUT____ with a custom command.
[2019-10-26T15:27:21.749Z] [134/170] Generating gir-gio with a custom command.
[2019-10-26T15:27:21.749Z] In file included from /usr/include/bits/libc-header-start.h:33,
[2019-10-26T15:27:21.749Z]                  from /usr/include/limits.h:26,
[2019-10-26T15:27:21.749Z]                  from /usr/lib/gcc/x86_64-pc-linux-gnu/9.2.0/include-fixed/limits.h:194,
[2019-10-26T15:27:21.749Z]                  from /usr/lib/gcc/x86_64-pc-linux-gnu/9.2.0/include-fixed/syslimits.h:7,
[2019-10-26T15:27:21.749Z]                  from /usr/lib/gcc/x86_64-pc-linux-gnu/9.2.0/include-fixed/limits.h:34,
[2019-10-26T15:27:21.749Z]                  from /usr/lib/glib-2.0/include/glibconfig.h:11,
[2019-10-26T15:27:21.749Z]                  from /usr/include/glib-2.0/glib/gtypes.h:32,
[2019-10-26T15:27:21.749Z]                  from /usr/include/glib-2.0/glib/galloca.h:32,
[2019-10-26T15:27:21.749Z]                  from /usr/include/glib-2.0/glib.h:30,
[2019-10-26T15:27:21.749Z]                  from /usr/include/glib-2.0/gobject/gbinding.h:28,
[2019-10-26T15:27:21.749Z]                  from /usr/include/glib-2.0/glib-object.h:23,
[2019-10-26T15:27:21.749Z]                  from /usr/include/glib-2.0/gio/gioenums.h:28,
[2019-10-26T15:27:21.749Z]                  from /usr/include/glib-2.0/gio/giotypes.h:28,
[2019-10-26T15:27:21.749Z]                  from /usr/include/glib-2.0/gio/gaction.h:27,
[2019-10-26T15:27:21.749Z]                  from /build/gobject-introspection/src/build/g-ir-cpp-wk2b6x2d.c:4:
[2019-10-26T15:27:21.749Z] /usr/include/features.h:382:4: warning: #warning _FORTIFY_SOURCE requires compiling with optimization (-O) [-Wcpp]
[2019-10-26T15:27:21.749Z]   382 | #  warning _FORTIFY_SOURCE requires compiling with optimization (-O)
[2019-10-26T15:27:21.749Z]       |    ^~~~~~~
[2019-10-26T15:27:22.660Z] [135/170] Generating generate_typelib__CustomTargetHolder_327a146__gir_gio_cus_____usr_bin_python3____File__tools_g_ir_scanner______output__OUTPUT_______no_libtool______quiet______reparse_validate______add_include_path_____build_gobject_introspection_src_build_gir______add_include_path_____build_gobject_introspection_src_gobject_introspection_gir______identifier_prefix_G______symbol_prefix_g______c_include_gio_gio_h______namespace_Gio______nsversion_2_0______library_gio_2_0______external_library______pkg_gio_2_0______pkg_gio_unix_2_0______c_include_gio_gdesktopappinfo_h______c_include_gio_gfiledescriptorbased_h______c_include_gio_gunixconnection_h______c_include_gio_gunixcredentialsmessage_h______c_include_gio_gunixfdlist_h______c_include_gio_gunixfdmessage_h______c_include_gio_gunixinputstream_h______c_include_gio_gunixmounts_h______c_include_gio_gunixoutputstream_h______c_include_gio_gunixsocketaddress_h______include_uninstalled__build_gobject_introspection_src_build_gir_GObject_2_0_gir______cflags_begin_____I_usr_include_glib_2_0_____I_usr_lib_glib_2_0_include_____DGIO_COMPILATION_____DG_SETTINGS_ENABLE_BACKEND______cflags_end_____INPUT____ with a custom command.
[2019-10-26T15:27:22.660Z] [136/170] Generating everything with a custom command.
[2019-10-26T15:27:22.660Z] [137/170] Generating gir-headeronly with a custom command.
[2019-10-26T15:27:22.660Z] [138/170] Generating generate-typelib-headeronly with a custom command.
[2019-10-26T15:27:22.660Z] [139/170] Compiling C object 'tests/59830eb@@everything-1.0 at sha/meson-generated_.._everything.c.o'.
[2019-10-26T15:27:22.910Z] [140/170] Generating gir-identfilter with a custom command.
[2019-10-26T15:27:22.910Z] [141/170] Generating generate-typelib-identfilter with a custom command.
[2019-10-26T15:27:22.910Z] [142/170] Linking target tests/libeverything-1.0.so.1.0.0.
[2019-10-26T15:27:22.910Z] [143/170] Generating gir-symbolfilter with a custom command.
[2019-10-26T15:27:22.911Z] [144/170] Generating generate-typelib-symbolfilter with a custom command.
[2019-10-26T15:27:23.821Z] [145/170] Generating gir-typedef with a custom command.
[2019-10-26T15:27:23.821Z] In file included from /usr/include/bits/libc-header-start.h:33,
[2019-10-26T15:27:23.821Z]                  from /usr/include/limits.h:26,
[2019-10-26T15:27:23.821Z]                  from /usr/lib/gcc/x86_64-pc-linux-gnu/9.2.0/include-fixed/limits.h:194,
[2019-10-26T15:27:23.821Z]                  from /usr/lib/gcc/x86_64-pc-linux-gnu/9.2.0/include-fixed/syslimits.h:7,
[2019-10-26T15:27:23.821Z]                  from /usr/lib/gcc/x86_64-pc-linux-gnu/9.2.0/include-fixed/limits.h:34,
[2019-10-26T15:27:23.821Z]                  from /usr/lib/glib-2.0/include/glibconfig.h:11,
[2019-10-26T15:27:23.821Z]                  from /usr/include/glib-2.0/glib/gtypes.h:32,
[2019-10-26T15:27:23.822Z]                  from /usr/include/glib-2.0/glib/galloca.h:32,
[2019-10-26T15:27:23.822Z]                  from /usr/include/glib-2.0/glib.h:30,
[2019-10-26T15:27:23.822Z]                  from /usr/include/glib-2.0/gobject/gbinding.h:28,
[2019-10-26T15:27:23.822Z]                  from /usr/include/glib-2.0/glib-object.h:23,
[2019-10-26T15:27:23.822Z]                  from /build/gobject-introspection/src/gobject-introspection/tests/scanner/typedefs.h:4,
[2019-10-26T15:27:23.822Z]                  from /build/gobject-introspection/src/build/g-ir-cpp-9iugcsz7.c:4:
[2019-10-26T15:27:23.822Z] /usr/include/features.h:382:4: warning: #warning _FORTIFY_SOURCE requires compiling with optimization (-O) [-Wcpp]
[2019-10-26T15:27:23.822Z]   382 | #  warning _FORTIFY_SOURCE requires compiling with optimization (-O)
[2019-10-26T15:27:23.822Z]       |    ^~~~~~~
[2019-10-26T15:27:23.822Z] [146/170] Generating gir-gettype with a custom command.
[2019-10-26T15:27:23.822Z] In file included from /usr/include/bits/libc-header-start.h:33,
[2019-10-26T15:27:23.822Z]                  from /usr/include/limits.h:26,
[2019-10-26T15:27:23.822Z]                  from /usr/lib/gcc/x86_64-pc-linux-gnu/9.2.0/include-fixed/limits.h:194,
[2019-10-26T15:27:23.822Z]                  from /usr/lib/gcc/x86_64-pc-linux-gnu/9.2.0/include-fixed/syslimits.h:7,
[2019-10-26T15:27:23.822Z]                  from /usr/lib/gcc/x86_64-pc-linux-gnu/9.2.0/include-fixed/limits.h:34,
[2019-10-26T15:27:23.822Z]                  from /usr/lib/glib-2.0/include/glibconfig.h:11,
[2019-10-26T15:27:23.822Z]                  from /usr/include/glib-2.0/glib/gtypes.h:32,
[2019-10-26T15:27:23.822Z]                  from /usr/include/glib-2.0/glib/galloca.h:32,
[2019-10-26T15:27:23.822Z]                  from /usr/include/glib-2.0/glib.h:30,
[2019-10-26T15:27:23.822Z]                  from /usr/include/glib-2.0/gobject/gbinding.h:28,
[2019-10-26T15:27:23.822Z]                  from /usr/include/glib-2.0/glib-object.h:23,
[2019-10-26T15:27:23.822Z]                  from /build/gobject-introspection/src/gobject-introspection/tests/scanner/gettype.h:4,
[2019-10-26T15:27:23.822Z]                  from /build/gobject-introspection/src/build/g-ir-cpp-_c16jtka.c:4:
[2019-10-26T15:27:23.822Z] /usr/include/features.h:382:4: warning: #warning _FORTIFY_SOURCE requires compiling with optimization (-O) [-Wcpp]
[2019-10-26T15:27:23.822Z]   382 | #  warning _FORTIFY_SOURCE requires compiling with optimization (-O)
[2019-10-26T15:27:23.822Z]       |    ^~~~~~~
[2019-10-26T15:27:23.822Z] [147/170] Generating gir-bar with a custom command.
[2019-10-26T15:27:23.822Z] In file included from /usr/include/bits/libc-header-start.h:33,
[2019-10-26T15:27:23.822Z]                  from /usr/include/limits.h:26,
[2019-10-26T15:27:23.822Z]                  from /usr/lib/gcc/x86_64-pc-linux-gnu/9.2.0/include-fixed/limits.h:194,
[2019-10-26T15:27:23.822Z]                  from /usr/lib/gcc/x86_64-pc-linux-gnu/9.2.0/include-fixed/syslimits.h:7,
[2019-10-26T15:27:23.822Z]                  from /usr/lib/gcc/x86_64-pc-linux-gnu/9.2.0/include-fixed/limits.h:34,
[2019-10-26T15:27:23.822Z]                  from /usr/lib/glib-2.0/include/glibconfig.h:11,
[2019-10-26T15:27:23.822Z]                  from /usr/include/glib-2.0/glib/gtypes.h:32,
[2019-10-26T15:27:23.822Z]                  from /usr/include/glib-2.0/glib/galloca.h:32,
[2019-10-26T15:27:23.822Z]                  from /usr/include/glib-2.0/glib.h:30,
[2019-10-26T15:27:23.822Z]                  from /usr/include/glib-2.0/gobject/gbinding.h:28,
[2019-10-26T15:27:23.822Z]                  from /usr/include/glib-2.0/glib-object.h:23,
[2019-10-26T15:27:23.822Z]                  from /build/gobject-introspection/src/gobject-introspection/tests/scanner/barapp.h:2,
[2019-10-26T15:27:23.822Z]                  from /build/gobject-introspection/src/build/g-ir-cpp-rz09lnbx.c:4:
[2019-10-26T15:27:23.822Z] /usr/include/features.h:382:4: warning: #warning _FORTIFY_SOURCE requires compiling with optimization (-O) [-Wcpp]
[2019-10-26T15:27:23.822Z]   382 | #  warning _FORTIFY_SOURCE requires compiling with optimization (-O)
[2019-10-26T15:27:23.822Z]       |    ^~~~~~~
[2019-10-26T15:27:23.822Z] [148/170] Generating gir-utility with a custom command.
[2019-10-26T15:27:23.822Z] In file included from /usr/include/bits/libc-header-start.h:33,
[2019-10-26T15:27:23.822Z]                  from /usr/include/limits.h:26,
[2019-10-26T15:27:23.822Z]                  from /usr/lib/gcc/x86_64-pc-linux-gnu/9.2.0/include-fixed/limits.h:194,
[2019-10-26T15:27:23.822Z]                  from /usr/lib/gcc/x86_64-pc-linux-gnu/9.2.0/include-fixed/syslimits.h:7,
[2019-10-26T15:27:23.822Z]                  from /usr/lib/gcc/x86_64-pc-linux-gnu/9.2.0/include-fixed/limits.h:34,
[2019-10-26T15:27:23.822Z]                  from /usr/lib/glib-2.0/include/glibconfig.h:11,
[2019-10-26T15:27:23.822Z]                  from /usr/include/glib-2.0/glib/gtypes.h:32,
[2019-10-26T15:27:23.822Z]                  from /usr/include/glib-2.0/glib/galloca.h:32,
[2019-10-26T15:27:23.822Z]                  from /usr/include/glib-2.0/glib.h:30,
[2019-10-26T15:27:23.822Z]                  from /usr/include/glib-2.0/gobject/gbinding.h:28,
[2019-10-26T15:27:23.822Z]                  from /usr/include/glib-2.0/glib-object.h:23,
[2019-10-26T15:27:23.822Z]                  from /build/gobject-introspection/src/gobject-introspection/tests/scanner/utility.h:4,
[2019-10-26T15:27:23.822Z]                  from /build/gobject-introspection/src/build/g-ir-cpp-j086as_v.c:4:
[2019-10-26T15:27:23.822Z] /usr/include/features.h:382:4: warning: #warning _FORTIFY_SOURCE requires compiling with optimization (-O) [-Wcpp]
[2019-10-26T15:27:23.822Z]   382 | #  warning _FORTIFY_SOURCE requires compiling with optimization (-O)
[2019-10-26T15:27:23.822Z]       |    ^~~~~~~
[2019-10-26T15:27:23.822Z] [149/170] Generating gir-offsets with a custom command.
[2019-10-26T15:27:23.822Z] In file included from /usr/include/bits/libc-header-start.h:33,
[2019-10-26T15:27:23.822Z]                  from /usr/include/limits.h:26,
[2019-10-26T15:27:23.822Z]                  from /usr/lib/gcc/x86_64-pc-linux-gnu/9.2.0/include-fixed/limits.h:194,
[2019-10-26T15:27:23.822Z]                  from /usr/lib/gcc/x86_64-pc-linux-gnu/9.2.0/include-fixed/syslimits.h:7,
[2019-10-26T15:27:23.822Z]                  from /usr/lib/gcc/x86_64-pc-linux-gnu/9.2.0/include-fixed/limits.h:34,
[2019-10-26T15:27:23.822Z]                  from /usr/lib/glib-2.0/include/glibconfig.h:11,
[2019-10-26T15:27:23.822Z]                  from /usr/include/glib-2.0/glib/gtypes.h:32,
[2019-10-26T15:27:23.822Z]                  from /usr/include/glib-2.0/glib/galloca.h:32,
[2019-10-26T15:27:23.822Z]                  from /usr/include/glib-2.0/glib.h:30,
[2019-10-26T15:27:23.822Z]                  from /build/gobject-introspection/src/gobject-introspection/tests/offsets/offsets.h:4,
[2019-10-26T15:27:23.822Z]                  from /build/gobject-introspection/src/build/g-ir-cpp-ywm7tf_d.c:4:
[2019-10-26T15:27:23.822Z] /usr/include/features.h:382:4: warning: #warning _FORTIFY_SOURCE requires compiling with optimization (-O) [-Wcpp]
[2019-10-26T15:27:23.822Z]   382 | #  warning _FORTIFY_SOURCE requires compiling with optimization (-O)
[2019-10-26T15:27:23.822Z]       |    ^~~~~~~
[2019-10-26T15:27:23.822Z] [150/170] Generating gir-gtkfrob with a custom command.
[2019-10-26T15:27:23.822Z] In file included from /usr/include/bits/libc-header-start.h:33,
[2019-10-26T15:27:23.822Z]                  from /usr/include/limits.h:26,
[2019-10-26T15:27:23.822Z]                  from /usr/lib/gcc/x86_64-pc-linux-gnu/9.2.0/include-fixed/limits.h:194,
[2019-10-26T15:27:23.822Z]                  from /usr/lib/gcc/x86_64-pc-linux-gnu/9.2.0/include-fixed/syslimits.h:7,
[2019-10-26T15:27:23.822Z]                  from /usr/lib/gcc/x86_64-pc-linux-gnu/9.2.0/include-fixed/limits.h:34,
[2019-10-26T15:27:23.822Z]                  from /usr/lib/glib-2.0/include/glibconfig.h:11,
[2019-10-26T15:27:23.822Z]                  from /usr/include/glib-2.0/glib/gtypes.h:32,
[2019-10-26T15:27:23.822Z]                  from /usr/include/glib-2.0/glib/galloca.h:32,
[2019-10-26T15:27:23.822Z]                  from /usr/include/glib-2.0/glib.h:30,
[2019-10-26T15:27:23.822Z]                  from /usr/include/glib-2.0/gobject/gbinding.h:28,
[2019-10-26T15:27:23.822Z]                  from /usr/include/glib-2.0/glib-object.h:23,
[2019-10-26T15:27:23.822Z]                  from /build/gobject-introspection/src/gobject-introspection/tests/scanner/gtkfrob.h:4,
[2019-10-26T15:27:23.822Z]                  from /build/gobject-introspection/src/build/g-ir-cpp-x_w3f1jt.c:4:
[2019-10-26T15:27:23.822Z] /usr/include/features.h:382:4: warning: #warning _FORTIFY_SOURCE requires compiling with optimization (-O) [-Wcpp]
[2019-10-26T15:27:23.822Z]   382 | #  warning _FORTIFY_SOURCE requires compiling with optimization (-O)
[2019-10-26T15:27:23.822Z]       |    ^~~~~~~
[2019-10-26T15:27:24.073Z] [151/170] Generating generate-typelib-gettype with a custom command.
[2019-10-26T15:27:24.073Z] [152/170] Generating generate-typelib-typedef with a custom command.
[2019-10-26T15:27:24.073Z] [153/170] Generating generate-typelib-bar with a custom command.
[2019-10-26T15:27:24.073Z] [154/170] Generating generate-typelib-utility with a custom command.
[2019-10-26T15:27:24.073Z] [155/170] Generating generate-typelib-offsets with a custom command.
[2019-10-26T15:27:24.073Z] [156/170] Generating generate-typelib-gtkfrob with a custom command.
[2019-10-26T15:27:24.623Z] [157/170] Generating gir-sletter with a custom command.
[2019-10-26T15:27:24.623Z] In file included from /usr/include/bits/libc-header-start.h:33,
[2019-10-26T15:27:24.623Z]                  from /usr/include/limits.h:26,
[2019-10-26T15:27:24.623Z]                  from /usr/lib/gcc/x86_64-pc-linux-gnu/9.2.0/include-fixed/limits.h:194,
[2019-10-26T15:27:24.623Z]                  from /usr/lib/gcc/x86_64-pc-linux-gnu/9.2.0/include-fixed/syslimits.h:7,
[2019-10-26T15:27:24.623Z]                  from /usr/lib/gcc/x86_64-pc-linux-gnu/9.2.0/include-fixed/limits.h:34,
[2019-10-26T15:27:24.623Z]                  from /usr/lib/glib-2.0/include/glibconfig.h:11,
[2019-10-26T15:27:24.623Z]                  from /usr/include/glib-2.0/glib/gtypes.h:32,
[2019-10-26T15:27:24.623Z]                  from /usr/include/glib-2.0/glib/galloca.h:32,
[2019-10-26T15:27:24.623Z]                  from /usr/include/glib-2.0/glib.h:30,
[2019-10-26T15:27:24.623Z]                  from /usr/include/glib-2.0/gobject/gbinding.h:28,
[2019-10-26T15:27:24.623Z]                  from /usr/include/glib-2.0/glib-object.h:23,
[2019-10-26T15:27:24.623Z]                  from /usr/include/glib-2.0/gio/gioenums.h:28,
[2019-10-26T15:27:24.623Z]                  from /usr/include/glib-2.0/gio/giotypes.h:28,
[2019-10-26T15:27:24.623Z]                  from /usr/include/glib-2.0/gio/gio.h:26,
[2019-10-26T15:27:24.623Z]                  from /build/gobject-introspection/src/gobject-introspection/tests/scanner/sletter.h:4,
[2019-10-26T15:27:24.623Z]                  from /build/gobject-introspection/src/build/g-ir-cpp-xqgn91op.c:4:
[2019-10-26T15:27:24.623Z] /usr/include/features.h:382:4: warning: #warning _FORTIFY_SOURCE requires compiling with optimization (-O) [-Wcpp]
[2019-10-26T15:27:24.623Z]   382 | #  warning _FORTIFY_SOURCE requires compiling with optimization (-O)
[2019-10-26T15:27:24.623Z]       |    ^~~~~~~
[2019-10-26T15:27:24.874Z] [158/170] Generating gir-warnlib with a custom command.
[2019-10-26T15:27:24.874Z] In file included from /usr/include/bits/libc-header-start.h:33,
[2019-10-26T15:27:24.874Z]                  from /usr/include/limits.h:26,
[2019-10-26T15:27:24.874Z]                  from /usr/lib/gcc/x86_64-pc-linux-gnu/9.2.0/include-fixed/limits.h:194,
[2019-10-26T15:27:24.874Z]                  from /usr/lib/gcc/x86_64-pc-linux-gnu/9.2.0/include-fixed/syslimits.h:7,
[2019-10-26T15:27:24.874Z]                  from /usr/lib/gcc/x86_64-pc-linux-gnu/9.2.0/include-fixed/limits.h:34,
[2019-10-26T15:27:24.874Z]                  from /usr/lib/glib-2.0/include/glibconfig.h:11,
[2019-10-26T15:27:24.874Z]                  from /usr/include/glib-2.0/glib/gtypes.h:32,
[2019-10-26T15:27:24.874Z]                  from /usr/include/glib-2.0/glib/galloca.h:32,
[2019-10-26T15:27:24.874Z]                  from /usr/include/glib-2.0/glib.h:30,
[2019-10-26T15:27:24.874Z]                  from /usr/include/glib-2.0/gobject/gbinding.h:28,
[2019-10-26T15:27:24.874Z]                  from /usr/include/glib-2.0/glib-object.h:23,
[2019-10-26T15:27:24.874Z]                  from /usr/include/glib-2.0/gio/gioenums.h:28,
[2019-10-26T15:27:24.874Z]                  from /usr/include/glib-2.0/gio/giotypes.h:28,
[2019-10-26T15:27:24.874Z]                  from /usr/include/glib-2.0/gio/gio.h:26,
[2019-10-26T15:27:24.874Z]                  from /build/gobject-introspection/src/gobject-introspection/tests/scanner/warnlib.h:6,
[2019-10-26T15:27:24.874Z]                  from /build/gobject-introspection/src/build/g-ir-cpp-sc_zwaj3.c:4:
[2019-10-26T15:27:24.874Z] /usr/include/features.h:382:4: warning: #warning _FORTIFY_SOURCE requires compiling with optimization (-O) [-Wcpp]
[2019-10-26T15:27:24.874Z]   382 | #  warning _FORTIFY_SOURCE requires compiling with optimization (-O)
[2019-10-26T15:27:24.874Z]       |    ^~~~~~~
[2019-10-26T15:27:24.874Z] [159/170] Generating generate-typelib-sletter with a custom command.
[2019-10-26T15:27:25.124Z] [160/170] Generating gir-gimarshallingtests with a custom command.
[2019-10-26T15:27:25.124Z] In file included from /usr/include/bits/libc-header-start.h:33,
[2019-10-26T15:27:25.124Z]                  from /usr/include/limits.h:26,
[2019-10-26T15:27:25.124Z]                  from /usr/lib/gcc/x86_64-pc-linux-gnu/9.2.0/include-fixed/limits.h:194,
[2019-10-26T15:27:25.124Z]                  from /usr/lib/gcc/x86_64-pc-linux-gnu/9.2.0/include-fixed/syslimits.h:7,
[2019-10-26T15:27:25.124Z]                  from /usr/lib/gcc/x86_64-pc-linux-gnu/9.2.0/include-fixed/limits.h:34,
[2019-10-26T15:27:25.124Z]                  from /usr/lib/glib-2.0/include/glibconfig.h:11,
[2019-10-26T15:27:25.124Z]                  from /usr/include/glib-2.0/glib/gtypes.h:32,
[2019-10-26T15:27:25.124Z]                  from /usr/include/glib-2.0/glib/galloca.h:32,
[2019-10-26T15:27:25.124Z]                  from /usr/include/glib-2.0/glib.h:30,
[2019-10-26T15:27:25.124Z]                  from /usr/include/glib-2.0/gobject/gbinding.h:28,
[2019-10-26T15:27:25.124Z]                  from /usr/include/glib-2.0/glib-object.h:23,
[2019-10-26T15:27:25.124Z]                  from /build/gobject-introspection/src/gobject-introspection/tests/gimarshallingtests.h:5,
[2019-10-26T15:27:25.124Z]                  from /build/gobject-introspection/src/build/g-ir-cpp-7pc88g5v.c:4:
[2019-10-26T15:27:25.124Z] /usr/include/features.h:382:4: warning: #warning _FORTIFY_SOURCE requires compiling with optimization (-O) [-Wcpp]
[2019-10-26T15:27:25.124Z]   382 | #  warning _FORTIFY_SOURCE requires compiling with optimization (-O)
[2019-10-26T15:27:25.124Z]       |    ^~~~~~~
[2019-10-26T15:27:25.124Z] [161/170] Generating generate-typelib-warnlib with a custom command.
[2019-10-26T15:27:25.375Z] [162/170] Generating gir-everything with a custom command.
[2019-10-26T15:27:25.375Z] In file included from /usr/include/bits/libc-header-start.h:33,
[2019-10-26T15:27:25.375Z]                  from /usr/include/limits.h:26,
[2019-10-26T15:27:25.375Z]                  from /usr/lib/gcc/x86_64-pc-linux-gnu/9.2.0/include-fixed/limits.h:194,
[2019-10-26T15:27:25.375Z]                  from /usr/lib/gcc/x86_64-pc-linux-gnu/9.2.0/include-fixed/syslimits.h:7,
[2019-10-26T15:27:25.375Z]                  from /usr/lib/gcc/x86_64-pc-linux-gnu/9.2.0/include-fixed/limits.h:34,
[2019-10-26T15:27:25.375Z]                  from /usr/lib/glib-2.0/include/glibconfig.h:11,
[2019-10-26T15:27:25.375Z]                  from /usr/include/glib-2.0/glib/gtypes.h:32,
[2019-10-26T15:27:25.375Z]                  from /usr/include/glib-2.0/glib/galloca.h:32,
[2019-10-26T15:27:25.375Z]                  from /usr/include/glib-2.0/glib.h:30,
[2019-10-26T15:27:25.375Z]                  from /usr/include/glib-2.0/gobject/gbinding.h:28,
[2019-10-26T15:27:25.375Z]                  from /usr/include/glib-2.0/glib-object.h:23,
[2019-10-26T15:27:25.375Z]                  from /build/gobject-introspection/src/build/tests/everything.h:7,
[2019-10-26T15:27:25.375Z]                  from /build/gobject-introspection/src/build/g-ir-cpp-cqzdnhi3.c:4:
[2019-10-26T15:27:25.375Z] /usr/include/features.h:382:4: warning: #warning _FORTIFY_SOURCE requires compiling with optimization (-O) [-Wcpp]
[2019-10-26T15:27:25.375Z]   382 | #  warning _FORTIFY_SOURCE requires compiling with optimization (-O)
[2019-10-26T15:27:25.375Z]       |    ^~~~~~~
[2019-10-26T15:27:25.375Z] [163/170] Generating generate_typelib__CustomTargetHolder_59830eb__gir_gimarshallingtests_cus_____usr_bin_python3____File__tools_g_ir_scanner______quiet______output__OUTPUT_______no_libtool______reparse_validate______add_include_path_____build_gobject_introspection_src_gobject_introspection_gir______add_include_path_____build_gobject_introspection_src_build_gir______warn_all______warn_error______namespace_GIMarshallingTests______symbol_prefix_gi_marshalling_tests______nsversion_1_0______include_Gio_2_0______library_gimarshallingtests_1_0_____L_build_gobject_introspection_src_build_tests______c_include__tests_gimarshallingtests_h______INPUT____ with a custom command.
[2019-10-26T15:27:25.625Z] [164/170] Generating generate_typelib__CustomTargetHolder_59830eb__gir_everything_cus_____usr_bin_python3____File__tools_g_ir_scanner______quiet______output__OUTPUT_______no_libtool______reparse_validate______add_include_path_____build_gobject_introspection_src_gobject_introspection_gir______add_include_path_____build_gobject_introspection_src_build_gir______warn_all______warn_error______namespace_Everything______nsversion_1_0______include_Gio_2_0______library_everything_1_0_____L_____build_gobject_introspection_src_build_tests_____I_____build_gobject_introspection_src_gobject_introspection_tests_____INPUT____ with a custom command.
[2019-10-26T15:27:26.968Z] [165/170] Generating gir-regress with a custom command.
[2019-10-26T15:27:26.968Z] In file included from /usr/include/bits/libc-header-start.h:33,
[2019-10-26T15:27:26.968Z]                  from /usr/include/limits.h:26,
[2019-10-26T15:27:26.968Z]                  from /usr/lib/gcc/x86_64-pc-linux-gnu/9.2.0/include-fixed/limits.h:194,
[2019-10-26T15:27:26.968Z]                  from /usr/lib/gcc/x86_64-pc-linux-gnu/9.2.0/include-fixed/syslimits.h:7,
[2019-10-26T15:27:26.968Z]                  from /usr/lib/gcc/x86_64-pc-linux-gnu/9.2.0/include-fixed/limits.h:34,
[2019-10-26T15:27:26.968Z]                  from /usr/lib/glib-2.0/include/glibconfig.h:11,
[2019-10-26T15:27:26.968Z]                  from /usr/include/glib-2.0/glib/gtypes.h:32,
[2019-10-26T15:27:26.968Z]                  from /usr/include/glib-2.0/glib/galloca.h:32,
[2019-10-26T15:27:26.968Z]                  from /usr/include/glib-2.0/glib.h:30,
[2019-10-26T15:27:26.968Z]                  from /usr/include/glib-2.0/gobject/gbinding.h:28,
[2019-10-26T15:27:26.968Z]                  from /usr/include/glib-2.0/glib-object.h:23,
[2019-10-26T15:27:26.968Z]                  from /usr/include/cairo/cairo-gobject.h:44,
[2019-10-26T15:27:26.968Z]                  from /build/gobject-introspection/src/gobject-introspection/tests/scanner/regress.h:5,
[2019-10-26T15:27:26.968Z]                  from /build/gobject-introspection/src/build/g-ir-cpp-8h_g5lsx.c:4:
[2019-10-26T15:27:26.968Z] /usr/include/features.h:382:4: warning: #warning _FORTIFY_SOURCE requires compiling with optimization (-O) [-Wcpp]
[2019-10-26T15:27:26.968Z]   382 | #  warning _FORTIFY_SOURCE requires compiling with optimization (-O)
[2019-10-26T15:27:26.968Z]       |    ^~~~~~~
[2019-10-26T15:27:26.968Z] [166/170] Generating generate-docs-sections with a custom command.
[2019-10-26T15:27:26.968Z] FAILED: tests/scanner/Regress-1.0-sections.txt 
[2019-10-26T15:27:26.968Z] /usr/bin/python3 tools/g-ir-doc-tool --add-include-path=/build/gobject-introspection/src/build/gir --add-include-path=/build/gobject-introspection/src/build/tests/scanner --write-sections-file tests/scanner/Regress-1.0.gir -o tests/scanner/Regress-1.0-sections.txt
[2019-10-26T15:27:26.968Z] Traceback (most recent call last):
[2019-10-26T15:27:26.968Z]   File "tools/g-ir-doc-tool", line 99, in <module>
[2019-10-26T15:27:26.968Z]     from giscanner.docmain import doc_main
[2019-10-26T15:27:26.968Z]   File "/build/gobject-introspection/src/build/giscanner/docmain.py", line 25, in <module>
[2019-10-26T15:27:26.968Z]     from .docwriter import DocWriter
[2019-10-26T15:27:26.968Z]   File "/build/gobject-introspection/src/build/giscanner/docwriter.py", line 30, in <module>
[2019-10-26T15:27:26.968Z]     import markdown
[2019-10-26T15:27:26.968Z] ModuleNotFoundError: No module named 'markdown'
[2019-10-26T15:27:26.968Z] [167/170] Generating generate-docs-Python with a custom command.
[2019-10-26T15:27:26.968Z] FAILED: tests/scanner/Regress-1.0-Python 
[2019-10-26T15:27:26.968Z] /usr/bin/python3 tools/g-ir-doc-tool --add-include-path=/build/gobject-introspection/src/build/gir --add-include-path=/build/gobject-introspection/src/build/tests/scanner --language Python tests/scanner/Regress-1.0.gir -o tests/scanner/Regress-1.0-Python
[2019-10-26T15:27:26.968Z] Traceback (most recent call last):
[2019-10-26T15:27:26.968Z]   File "tools/g-ir-doc-tool", line 99, in <module>
[2019-10-26T15:27:26.969Z]     from giscanner.docmain import doc_main
[2019-10-26T15:27:26.969Z]   File "/build/gobject-introspection/src/build/giscanner/docmain.py", line 25, in <module>
[2019-10-26T15:27:26.969Z]     from .docwriter import DocWriter
[2019-10-26T15:27:26.969Z]   File "/build/gobject-introspection/src/build/giscanner/docwriter.py", line 30, in <module>
[2019-10-26T15:27:26.969Z]     import markdown
[2019-10-26T15:27:26.969Z] ModuleNotFoundError: No module named 'markdown'
[2019-10-26T15:27:26.969Z] [168/170] Generating generate-docs-C with a custom command.
[2019-10-26T15:27:26.969Z] FAILED: tests/scanner/Regress-1.0-C 
[2019-10-26T15:27:26.969Z] /usr/bin/python3 tools/g-ir-doc-tool --add-include-path=/build/gobject-introspection/src/build/gir --add-include-path=/build/gobject-introspection/src/build/tests/scanner --language C tests/scanner/Regress-1.0.gir -o tests/scanner/Regress-1.0-C
[2019-10-26T15:27:26.969Z] Traceback (most recent call last):
[2019-10-26T15:27:26.969Z]   File "tools/g-ir-doc-tool", line 99, in <module>
[2019-10-26T15:27:26.969Z]     from giscanner.docmain import doc_main
[2019-10-26T15:27:26.969Z]   File "/build/gobject-introspection/src/build/giscanner/docmain.py", line 25, in <module>
[2019-10-26T15:27:26.969Z]     from .docwriter import DocWriter
[2019-10-26T15:27:26.969Z]   File "/build/gobject-introspection/src/build/giscanner/docwriter.py", line 30, in <module>
[2019-10-26T15:27:26.969Z]     import markdown
[2019-10-26T15:27:26.969Z] ModuleNotFoundError: No module named 'markdown'
[2019-10-26T15:27:26.969Z] [169/170] Generating generate-docs-Gjs with a custom command.
[2019-10-26T15:27:26.969Z] FAILED: tests/scanner/Regress-1.0-Gjs 
[2019-10-26T15:27:26.969Z] /usr/bin/python3 tools/g-ir-doc-tool --add-include-path=/build/gobject-introspection/src/build/gir --add-include-path=/build/gobject-introspection/src/build/tests/scanner --language Gjs tests/scanner/Regress-1.0.gir -o tests/scanner/Regress-1.0-Gjs
[2019-10-26T15:27:26.969Z] Traceback (most recent call last):
[2019-10-26T15:27:26.969Z]   File "tools/g-ir-doc-tool", line 99, in <module>
[2019-10-26T15:27:26.969Z]     from giscanner.docmain import doc_main
[2019-10-26T15:27:26.969Z]   File "/build/gobject-introspection/src/build/giscanner/docmain.py", line 25, in <module>
[2019-10-26T15:27:26.969Z]     from .docwriter import DocWriter
[2019-10-26T15:27:26.969Z]   File "/build/gobject-introspection/src/build/giscanner/docwriter.py", line 30, in <module>
[2019-10-26T15:27:26.969Z]     import markdown
[2019-10-26T15:27:26.969Z] ModuleNotFoundError: No module named 'markdown'
[2019-10-26T15:27:26.969Z] [170/170] Generating generate-typelib-regress with a custom command.
[2019-10-26T15:27:26.969Z] ninja: build stopped: subcommand failed.
[2019-10-26T15:27:26.969Z] ==> ERROR: A failure occurred in build().
[2019-10-26T15:27:26.969Z]     Aborting...
[2019-10-26T15:27:27.880Z] ==> ERROR: Build failed, check /build/buildpkg/goblins-x86_64/jenkins/build
[Pipeline] }
[Pipeline] // dir
Post stage
[Pipeline] emailext
[2019-10-26T15:27:27.985Z] Sending email to: artix-build-failures at artixlinux.org


More information about the artix-build-failures mailing list