[artix-build-failures] [galaxy] Failure: python-aiobotocore

jenkins at artixlinux.org jenkins at artixlinux.org
Sat Nov 16 10:58:24 CET 2019


   Failure

   Build: repos/community-any

   Packages:

   [python-aiobotocore-0.11.0-2-any.pkg.tar.xz]

   authorName: alium

   authorEmail: alium at artixlinux.org

   [1]https://orion.artixlinux.org/job/packagesPython/job/python-aiobotoco
   re/job/master/9/

References

   1. https://orion.artixlinux.org/job/packagesPython/job/python-aiobotocore/job/master/9/
-------------- next part --------------
Push event to branch master
Querying the current revision of branch master...
Current revision of branch master is 87d25c4a13cc41c0c1019fce709619d7055ff4cc
Obtained Jenkinsfile from 87d25c4a13cc41c0c1019fce709619d7055ff4cc
Running in Durability level: PERFORMANCE_OPTIMIZED
Loading library artix-ci at master
Attempting to resolve master from remote references...
 > git --version # timeout=10
 > git ls-remote -- https://gitea.artixlinux.org/artix/pipeline-libs.git # timeout=10
Found match: refs/heads/master revision 77f77ff85eedb6eb60b64faf8c328ab86dbb479c
Warning: CredentialId "gitea-ci" could not be found.
 > git rev-parse --is-inside-work-tree # timeout=10
Fetching changes from the remote Git repository
 > git config remote.origin.url https://gitea.artixlinux.org/artix/pipeline-libs.git # timeout=10
Fetching without tags
Fetching upstream changes from https://gitea.artixlinux.org/artix/pipeline-libs.git
 > git --version # timeout=10
 > git fetch --no-tags --force --progress -- https://gitea.artixlinux.org/artix/pipeline-libs.git +refs/heads/master:refs/remotes/origin/master # timeout=10
Checking out Revision 77f77ff85eedb6eb60b64faf8c328ab86dbb479c (master)
 > git config core.sparsecheckout # timeout=10
 > git checkout -f 77f77ff85eedb6eb60b64faf8c328ab86dbb479c # timeout=10
Commit message: "Notify: remove fail condition"
[Gitea] Notifying branch build status: PENDING Build started...
[Gitea] Notified
[Pipeline] Start of Pipeline
[Pipeline] node
Running on Jenkins in /build/jenkins/workspace/Python_python-aiobotocore_master
[Pipeline] {
[Pipeline] timestamps
[Pipeline] {
[Pipeline] stage
[Pipeline] { (Prepare)
[Pipeline] checkout
[2019-11-16T09:57:25.189Z] Warning: CredentialId "jenkins-ci" could not be found.
[2019-11-16T09:57:25.190Z]  > git rev-parse --is-inside-work-tree # timeout=10
[2019-11-16T09:57:25.194Z] Fetching changes from the remote Git repository
[2019-11-16T09:57:25.194Z]  > git config remote.origin.url https://237b7412742b4068af4173944de150f12959f4d3@gitea.artixlinux.org/packagesPython/python-aiobotocore.git # timeout=10
[2019-11-16T09:57:25.200Z] Cleaning workspace
[2019-11-16T09:57:25.200Z]  > git rev-parse --verify HEAD # timeout=10
[2019-11-16T09:57:25.205Z] Resetting working tree
[2019-11-16T09:57:25.205Z]  > git reset --hard # timeout=10
[2019-11-16T09:57:25.213Z]  > git clean -fdx # timeout=10
[2019-11-16T09:57:25.217Z] Fetching without tags
[2019-11-16T09:57:25.217Z] Fetching upstream changes from https://237b7412742b4068af4173944de150f12959f4d3@gitea.artixlinux.org/packagesPython/python-aiobotocore.git
[2019-11-16T09:57:25.217Z]  > git --version # timeout=10
[2019-11-16T09:57:25.221Z]  > git fetch --no-tags --force --progress -- https://237b7412742b4068af4173944de150f12959f4d3@gitea.artixlinux.org/packagesPython/python-aiobotocore.git +refs/heads/master:refs/remotes/origin/master # timeout=10
[2019-11-16T09:57:25.464Z] Checking out Revision 87d25c4a13cc41c0c1019fce709619d7055ff4cc (master)
[2019-11-16T09:57:25.464Z]  > git config core.sparsecheckout # timeout=10
[2019-11-16T09:57:25.470Z]  > git checkout -f 87d25c4a13cc41c0c1019fce709619d7055ff4cc # timeout=10
[2019-11-16T09:57:25.480Z] Commit message: "[trunk] -> [community] 'python-aiobotocore-0.11.0-2' add"
[2019-11-16T09:57:25.480Z]  > git rev-list --no-walk 79fb690e673d19340cc02947c34d4c2c568913d2 # timeout=10
[2019-11-16T09:57:25.492Z] [Gitea] Notifying branch build status: PENDING Build started...
[2019-11-16T09:57:25.628Z] [Gitea] Notified
[Pipeline] libraryResource
[Pipeline] readYaml
[Pipeline] sh
[2019-11-16T09:57:25.900Z] + git rev-parse @
[Pipeline] sh
[2019-11-16T09:57:26.156Z] + git show -s --format=%an 87d25c4a13cc41c0c1019fce709619d7055ff4cc
[Pipeline] sh
[2019-11-16T09:57:26.411Z] + git show -s --format=%ae 87d25c4a13cc41c0c1019fce709619d7055ff4cc
[Pipeline] sh
[2019-11-16T09:57:26.665Z] + git show --pretty=format: --name-status 87d25c4a13cc41c0c1019fce709619d7055ff4cc
[Pipeline] fileExists
[Pipeline] sh
[2019-11-16T09:57:26.932Z] + pkg2yaml repos/community-any
[Pipeline] readYaml
[Pipeline] }
[Pipeline] // stage
[Pipeline] stage
[Pipeline] { (Build)
[Pipeline] echo
[2019-11-16T09:57:27.075Z] isRebuild: false
[Pipeline] dir
[2019-11-16T09:57:27.081Z] Running in /build/jenkins/workspace/Python_python-aiobotocore_master/repos/community-any
[Pipeline] {
[Pipeline] sh
[2019-11-16T09:57:27.341Z] + buildpkg-galaxy
[2019-11-16T09:57:29.823Z] :: Synchronizing package databases...
[2019-11-16T09:57:29.823Z]  system is up to date
[2019-11-16T09:57:29.823Z] downloading world.db...
[2019-11-16T09:57:29.823Z]  galaxy is up to date
[2019-11-16T09:57:29.823Z] downloading extra.db...
[2019-11-16T09:57:30.374Z] downloading community.db...
[2019-11-16T09:57:30.625Z] :: Starting full system upgrade...
[2019-11-16T09:57:30.875Z]  there is nothing to do
[2019-11-16T09:57:31.425Z] ==> Building in chroot for [default] (x86_64)...
[2019-11-16T09:57:34.158Z] ==> Synchronizing chroot copy [/build/buildpkg/default-x86_64/root] -> [jenkins]...done
[2019-11-16T09:57:34.708Z] ==> Making package: python-aiobotocore 0.11.0-2 (Sat Nov 16 10:57:34 2019)
[2019-11-16T09:57:34.708Z] ==> Retrieving sources...
[2019-11-16T09:57:34.708Z]   -> Found python-aiobotocore-0.11.0.tar.gz
[2019-11-16T09:57:34.708Z]   -> Found fix-tests-with-proxies.patch
[2019-11-16T09:57:34.708Z]   -> Found python-aiobotocore-moto-1.3.14.diff
[2019-11-16T09:57:34.708Z] ==> Validating source files with sha256sums...
[2019-11-16T09:57:34.708Z]     python-aiobotocore-0.11.0.tar.gz ... Passed
[2019-11-16T09:57:34.708Z]     fix-tests-with-proxies.patch ... Passed
[2019-11-16T09:57:34.708Z]     python-aiobotocore-moto-1.3.14.diff ... Passed
[2019-11-16T09:57:38.830Z] ==> Making package: python-aiobotocore 0.11.0-2 (Sat 16 Nov 2019 10:57:38 AM CET)
[2019-11-16T09:57:38.830Z] ==> Checking runtime dependencies...
[2019-11-16T09:57:38.830Z] ==> Installing missing dependencies...
[2019-11-16T09:57:38.830Z] resolving dependencies...
[2019-11-16T09:57:38.830Z] looking for conflicting packages...
[2019-11-16T09:57:38.830Z] 
[2019-11-16T09:57:38.830Z] Package (22)                   New Version  Net Change  Download Size
[2019-11-16T09:57:38.830Z] 
[2019-11-16T09:57:38.830Z] galaxy/gunicorn                19.9.0-3       1.00 MiB               
[2019-11-16T09:57:38.830Z] system/libnsl                  1.2.0-1        0.21 MiB               
[2019-11-16T09:57:38.830Z] world/python-appdirs           1.4.3-5        0.07 MiB               
[2019-11-16T09:57:38.830Z] galaxy/python-async-timeout    3.0.1-3        0.02 MiB               
[2019-11-16T09:57:38.830Z] world/python-attrs             19.3.0-3       0.30 MiB               
[2019-11-16T09:57:38.830Z] world/python-chardet           3.0.4-4        1.12 MiB               
[2019-11-16T09:57:38.830Z] galaxy/python-dateutil         2.8.1-2        0.79 MiB               
[2019-11-16T09:57:38.830Z] galaxy/python-docutils         0.14-4         4.18 MiB               
[2019-11-16T09:57:38.830Z] world/python-idna              2.8-3          0.66 MiB               
[2019-11-16T09:57:38.830Z] galaxy/python-jmespath         0.9.4-3        0.17 MiB               
[2019-11-16T09:57:38.830Z] galaxy/python-multidict        4.5.2-3        0.75 MiB               
[2019-11-16T09:57:38.830Z] world/python-packaging         19.2-5         0.14 MiB               
[2019-11-16T09:57:38.830Z] world/python-pyparsing         2.4.5-1        0.70 MiB               
[2019-11-16T09:57:38.830Z] world/python-setuptools        1:41.2.0-5     1.54 MiB               
[2019-11-16T09:57:38.830Z] world/python-six               1.13.0-2       0.09 MiB               
[2019-11-16T09:57:38.830Z] world/python-urllib3           1.25.7-1       0.64 MiB       0.16 MiB
[2019-11-16T09:57:38.830Z] galaxy/python-yarl             1.3.0-3        0.67 MiB               
[2019-11-16T09:57:38.830Z] world/python                   3.8.0-1      151.60 MiB               
[2019-11-16T09:57:38.830Z] galaxy/python-aiohttp          3.6.2-2        4.19 MiB               
[2019-11-16T09:57:38.830Z] galaxy/python-async_generator  1.10-3         0.16 MiB               
[2019-11-16T09:57:38.830Z] galaxy/python-botocore         1.13.17-1     38.46 MiB       2.89 MiB
[2019-11-16T09:57:38.830Z] world/python-wrapt             1.11.2-3       0.19 MiB               
[2019-11-16T09:57:38.830Z] 
[2019-11-16T09:57:38.830Z] Total Download Size:     3.05 MiB
[2019-11-16T09:57:38.830Z] Total Installed Size:  207.63 MiB
[2019-11-16T09:57:38.830Z] 
[2019-11-16T09:57:38.830Z] :: Proceed with installation? [Y/n] 
[2019-11-16T09:57:38.830Z] :: Retrieving packages...
[2019-11-16T09:57:38.830Z] downloading python-urllib3-1.25.7-1-any.pkg.tar.xz...
[2019-11-16T09:57:38.830Z] downloading python-botocore-1.13.17-1-any.pkg.tar.xz...
[2019-11-16T09:57:38.830Z] checking keyring...
[2019-11-16T09:57:38.830Z] checking package integrity...
[2019-11-16T09:57:39.741Z] loading package files...
[2019-11-16T09:57:39.741Z] checking for file conflicts...
[2019-11-16T09:57:39.741Z] checking available disk space...
[2019-11-16T09:57:39.741Z] :: Processing package changes...
[2019-11-16T09:57:39.741Z] installing libnsl...
[2019-11-16T09:57:39.741Z] installing python...
[2019-11-16T09:57:42.968Z] Optional dependencies for python
[2019-11-16T09:57:42.968Z]     python-setuptools [pending]
[2019-11-16T09:57:42.968Z]     python-pip
[2019-11-16T09:57:42.968Z]     sqlite [installed]
[2019-11-16T09:57:42.968Z]     mpdecimal: for decimal
[2019-11-16T09:57:42.968Z]     xz: for lzma [installed]
[2019-11-16T09:57:42.968Z]     tk: for tkinter
[2019-11-16T09:57:42.968Z] installing python-appdirs...
[2019-11-16T09:57:42.968Z] installing python-pyparsing...
[2019-11-16T09:57:42.968Z] installing python-six...
[2019-11-16T09:57:42.968Z] installing python-packaging...
[2019-11-16T09:57:42.968Z] installing python-setuptools...
[2019-11-16T09:57:42.968Z] installing python-chardet...
[2019-11-16T09:57:43.219Z] installing python-multidict...
[2019-11-16T09:57:43.219Z] installing python-async-timeout...
[2019-11-16T09:57:43.219Z] installing python-idna...
[2019-11-16T09:57:43.219Z] installing python-yarl...
[2019-11-16T09:57:43.219Z] installing python-attrs...
[2019-11-16T09:57:43.219Z] installing gunicorn...
[2019-11-16T09:57:43.219Z] Optional dependencies for gunicorn
[2019-11-16T09:57:43.219Z]     python-eventlet: For asynchronous request handling with eventlet.
[2019-11-16T09:57:43.219Z]     python-gevent: For asynchronous request handling with gevent.
[2019-11-16T09:57:43.219Z] installing python-aiohttp...
[2019-11-16T09:57:43.219Z] installing python-dateutil...
[2019-11-16T09:57:43.219Z] installing python-jmespath...
[2019-11-16T09:57:43.219Z] installing python-docutils...
[2019-11-16T09:57:43.469Z] installing python-urllib3...
[2019-11-16T09:57:43.469Z] Optional dependencies for python-urllib3
[2019-11-16T09:57:43.469Z]     python-pysocks: SOCKS support
[2019-11-16T09:57:43.469Z]     python-brotlipy: Brotli support
[2019-11-16T09:57:43.469Z]     python-pyopenssl: security support
[2019-11-16T09:57:43.469Z] installing python-botocore...
[2019-11-16T09:57:43.719Z] installing python-wrapt...
[2019-11-16T09:57:43.719Z] installing python-async_generator...
[2019-11-16T09:57:43.969Z] ==> Checking buildtime dependencies...
[2019-11-16T09:57:43.969Z] ==> Installing missing dependencies...
[2019-11-16T09:57:44.220Z] resolving dependencies...
[2019-11-16T09:57:44.220Z] looking for conflicting packages...
[2019-11-16T09:57:44.220Z] 
[2019-11-16T09:57:44.220Z] Package (57)                      New Version  Net Change  Download Size
[2019-11-16T09:57:44.220Z] 
[2019-11-16T09:57:44.220Z] galaxy/libsodium                  1.0.18-1       0.53 MiB               
[2019-11-16T09:57:44.220Z] world/libyaml                     0.2.2-1        0.21 MiB               
[2019-11-16T09:57:44.220Z] galaxy/python-apipkg              1.5-3          0.02 MiB               
[2019-11-16T09:57:44.220Z] world/python-asn1crypto           1.2.0-3        1.20 MiB               
[2019-11-16T09:57:44.220Z] galaxy/python-atomicwrites        1.3.0-3        0.03 MiB               
[2019-11-16T09:57:44.220Z] galaxy/python-aws-sam-translator  1.15.1-2       1.95 MiB               
[2019-11-16T09:57:44.220Z] galaxy/python-aws-xray-sdk        2.4.2-7        0.59 MiB       0.11 MiB
[2019-11-16T09:57:44.220Z] galaxy/python-bcrypt              3.1.7-3        0.07 MiB               
[2019-11-16T09:57:44.220Z] galaxy/python-biscuits            0.2.1-3        0.10 MiB               
[2019-11-16T09:57:44.220Z] galaxy/python-boto                2.49.0-3      12.26 MiB               
[2019-11-16T09:57:44.220Z] galaxy/python-boto3               1.10.14-2      1.31 MiB               
[2019-11-16T09:57:44.220Z] world/python-cffi                 1.13.2-2       1.01 MiB               
[2019-11-16T09:57:44.220Z] galaxy/python-cfn-lint            0.25.0-1      44.87 MiB       0.55 MiB
[2019-11-16T09:57:44.220Z] galaxy/python-click               7.0-3          0.70 MiB               
[2019-11-16T09:57:44.220Z] world/python-cryptography         2.8-1          2.35 MiB               
[2019-11-16T09:57:44.220Z] galaxy/python-docker              4.1.0-3        1.24 MiB               
[2019-11-16T09:57:44.220Z] galaxy/python-docker-pycreds      0.4.0-5        0.02 MiB               
[2019-11-16T09:57:44.220Z] galaxy/python-ecdsa               0.13.3-3       0.38 MiB               
[2019-11-16T09:57:44.220Z] galaxy/python-future              0.18.2-2       3.69 MiB               
[2019-11-16T09:57:44.220Z] galaxy/python-importlib-metadata  0.23-2         0.16 MiB               
[2019-11-16T09:57:44.220Z] galaxy/python-iniconfig           1.0.0-4        0.02 MiB               
[2019-11-16T09:57:44.220Z] galaxy/python-itsdangerous        1.1.0-3        0.11 MiB               
[2019-11-16T09:57:44.220Z] galaxy/python-jinja               2.10.3-3       1.16 MiB               
[2019-11-16T09:57:44.220Z] galaxy/python-jose                3.0.1-3        0.18 MiB               
[2019-11-16T09:57:44.220Z] galaxy/python-jsondiff            1.2.0-3        0.06 MiB               
[2019-11-16T09:57:44.220Z] galaxy/python-jsonpatch           1.24-3         0.05 MiB               
[2019-11-16T09:57:44.220Z] galaxy/python-jsonpickle          1.2-3          0.27 MiB               
[2019-11-16T09:57:44.220Z] galaxy/python-jsonpointer         2.0-4          0.02 MiB               
[2019-11-16T09:57:44.220Z] galaxy/python-jsonschema          3.0.2-3        0.55 MiB               
[2019-11-16T09:57:44.220Z] world/python-markupsafe           1.1.1-3        0.08 MiB               
[2019-11-16T09:57:44.220Z] galaxy/python-mock                3.0.5-3        0.21 MiB               
[2019-11-16T09:57:44.220Z] galaxy/python-more-itertools      7.2.0-3        0.48 MiB               
[2019-11-16T09:57:44.220Z] galaxy/python-paramiko            2.6.0-3        1.70 MiB               
[2019-11-16T09:57:44.220Z] galaxy/python-pbr                 5.4.3-3        0.64 MiB               
[2019-11-16T09:57:44.220Z] galaxy/python-pluggy              0.13.0-3       0.12 MiB               
[2019-11-16T09:57:44.220Z] world/python-ply                  3.11-4         0.31 MiB               
[2019-11-16T09:57:44.220Z] galaxy/python-py                  1.8.0-3        0.70 MiB               
[2019-11-16T09:57:44.220Z] world/python-pyasn1               0.4.7-3        0.60 MiB               
[2019-11-16T09:57:44.220Z] world/python-pycparser            2.19-3         1.27 MiB               
[2019-11-16T09:57:44.220Z] galaxy/python-pynacl              1.3.0-3        0.57 MiB               
[2019-11-16T09:57:44.220Z] galaxy/python-pyrsistent          0.15.5-2       0.48 MiB               
[2019-11-16T09:57:44.220Z] galaxy/python-pytz                2019.3-3       0.95 MiB               
[2019-11-16T09:57:44.220Z] world/python-requests             2.22.0-3       0.44 MiB               
[2019-11-16T09:57:44.220Z] galaxy/python-responses           0.10.6-3       0.07 MiB               
[2019-11-16T09:57:44.220Z] galaxy/python-rsa                 4.0-3          0.24 MiB               
[2019-11-16T09:57:44.220Z] galaxy/python-s3transfer          0.2.1-4        0.66 MiB               
[2019-11-16T09:57:44.220Z] galaxy/python-sshpubkeys          3.1.0-3        0.06 MiB               
[2019-11-16T09:57:44.220Z] galaxy/python-wcwidth             0.1.7-5        0.08 MiB               
[2019-11-16T09:57:44.220Z] galaxy/python-websocket-client    0.56.0-3       0.32 MiB               
[2019-11-16T09:57:44.220Z] galaxy/python-werkzeug            0.16.0-3       2.40 MiB               
[2019-11-16T09:57:44.220Z] galaxy/python-xmltodict           0.12.0-3       0.04 MiB               
[2019-11-16T09:57:44.220Z] galaxy/python-yaml                5.1.2-3        0.76 MiB               
[2019-11-16T09:57:44.220Z] galaxy/python-zipp                0.6.0-3        0.02 MiB               
[2019-11-16T09:57:44.220Z] galaxy/python-flask               1.1.1-3        0.80 MiB               
[2019-11-16T09:57:44.220Z] galaxy/python-moto                1.3.13-4       9.81 MiB               
[2019-11-16T09:57:44.220Z] galaxy/python-pytest              5.2.3-1        2.49 MiB               
[2019-11-16T09:57:44.220Z] galaxy/python-pytest-asyncio      0.10.0-3       0.03 MiB               
[2019-11-16T09:57:44.220Z] 
[2019-11-16T09:57:44.220Z] Total Download Size:     0.67 MiB
[2019-11-16T09:57:44.220Z] Total Installed Size:  101.42 MiB
[2019-11-16T09:57:44.220Z] 
[2019-11-16T09:57:44.220Z] :: Proceed with installation? [Y/n] 
[2019-11-16T09:57:44.220Z] :: Retrieving packages...
[2019-11-16T09:57:44.220Z] downloading python-aws-xray-sdk-2.4.2-7-any.pkg.tar.xz...
[2019-11-16T09:57:44.220Z] downloading python-cfn-lint-0.25.0-1-any.pkg.tar.xz...
[2019-11-16T09:57:44.220Z] checking keyring...
[2019-11-16T09:57:44.220Z] checking package integrity...
[2019-11-16T09:57:46.081Z] loading package files...
[2019-11-16T09:57:46.081Z] checking for file conflicts...
[2019-11-16T09:57:46.081Z] checking available disk space...
[2019-11-16T09:57:46.081Z] :: Processing package changes...
[2019-11-16T09:57:46.081Z] installing python-werkzeug...
[2019-11-16T09:57:46.081Z] installing python-markupsafe...
[2019-11-16T09:57:46.081Z] installing python-jinja...
[2019-11-16T09:57:46.081Z] Optional dependencies for python-jinja
[2019-11-16T09:57:46.081Z]     python-babel: for i18n support
[2019-11-16T09:57:46.081Z] installing python-itsdangerous...
[2019-11-16T09:57:46.081Z] installing python-click...
[2019-11-16T09:57:46.081Z] installing python-flask...
[2019-11-16T09:57:46.081Z] installing python-future...
[2019-11-16T09:57:46.331Z] Optional dependencies for python-future
[2019-11-16T09:57:46.331Z]     python-setuptools: futurize and pasteurize scripts [installed]
[2019-11-16T09:57:46.331Z] installing python-jsonpickle...
[2019-11-16T09:57:46.331Z] installing python-aws-xray-sdk...
[2019-11-16T09:57:46.331Z] installing python-boto...
[2019-11-16T09:57:46.331Z] installing python-s3transfer...
[2019-11-16T09:57:46.582Z] installing python-boto3...
[2019-11-16T09:57:46.582Z] installing python-ply...
[2019-11-16T09:57:46.582Z] installing python-pycparser...
[2019-11-16T09:57:46.582Z] installing python-cffi...
[2019-11-16T09:57:46.582Z] installing python-asn1crypto...
[2019-11-16T09:57:46.582Z] installing python-cryptography...
[2019-11-16T09:57:46.582Z] installing python-requests...
[2019-11-16T09:57:46.582Z] Optional dependencies for python-requests
[2019-11-16T09:57:46.582Z]     python-pysocks: SOCKS proxy support
[2019-11-16T09:57:46.582Z] installing python-websocket-client...
[2019-11-16T09:57:46.582Z] installing python-docker-pycreds...
[2019-11-16T09:57:46.582Z] installing python-bcrypt...
[2019-11-16T09:57:46.582Z] installing python-pyasn1...
[2019-11-16T09:57:46.582Z] installing libsodium...
[2019-11-16T09:57:46.582Z] installing python-pynacl...
[2019-11-16T09:57:46.582Z] installing python-paramiko...
[2019-11-16T09:57:46.582Z] installing python-docker...
[2019-11-16T09:57:46.832Z] installing python-jsondiff...
[2019-11-16T09:57:46.832Z] installing python-rsa...
[2019-11-16T09:57:46.832Z] installing python-ecdsa...
[2019-11-16T09:57:46.832Z] installing python-jose...
[2019-11-16T09:57:46.832Z] Optional dependencies for python-jose
[2019-11-16T09:57:46.832Z]     python-cryptography: one option for better performance [installed]
[2019-11-16T09:57:46.832Z]     python-pycryptodome: one option for better performance
[2019-11-16T09:57:46.832Z] installing python-pbr...
[2019-11-16T09:57:46.832Z] installing python-mock...
[2019-11-16T09:57:46.832Z] installing libyaml...
[2019-11-16T09:57:46.832Z] installing python-yaml...
[2019-11-16T09:57:46.832Z] installing python-pytz...
[2019-11-16T09:57:46.832Z] installing python-biscuits...
[2019-11-16T09:57:46.832Z] installing python-responses...
[2019-11-16T09:57:46.832Z] installing python-xmltodict...
[2019-11-16T09:57:46.832Z] installing python-pyrsistent...
[2019-11-16T09:57:46.832Z] installing python-jsonschema...
[2019-11-16T09:57:46.832Z] installing python-aws-sam-translator...
[2019-11-16T09:57:46.832Z] installing python-jsonpointer...
[2019-11-16T09:57:46.832Z] installing python-jsonpatch...
[2019-11-16T09:57:46.832Z] installing python-cfn-lint...
[2019-11-16T09:57:47.082Z] installing python-sshpubkeys...
[2019-11-16T09:57:47.082Z] installing python-moto...
[2019-11-16T09:57:47.332Z] Optional dependencies for python-moto
[2019-11-16T09:57:47.332Z]     python-flask: for moto_server [installed]
[2019-11-16T09:57:47.332Z] installing python-iniconfig...
[2019-11-16T09:57:47.332Z] installing python-apipkg...
[2019-11-16T09:57:47.332Z] installing python-py...
[2019-11-16T09:57:47.332Z] installing python-more-itertools...
[2019-11-16T09:57:47.332Z] installing python-zipp...
[2019-11-16T09:57:47.332Z] installing python-importlib-metadata...
[2019-11-16T09:57:47.332Z] installing python-pluggy...
[2019-11-16T09:57:47.332Z] installing python-atomicwrites...
[2019-11-16T09:57:47.332Z] installing python-wcwidth...
[2019-11-16T09:57:47.332Z] installing python-pytest...
[2019-11-16T09:57:47.332Z] installing python-pytest-asyncio...
[2019-11-16T09:57:47.583Z] ==> Retrieving sources...
[2019-11-16T09:57:47.583Z]   -> Found python-aiobotocore-0.11.0.tar.gz
[2019-11-16T09:57:47.583Z]   -> Found fix-tests-with-proxies.patch
[2019-11-16T09:57:47.583Z]   -> Found python-aiobotocore-moto-1.3.14.diff
[2019-11-16T09:57:47.583Z] ==> WARNING: Skipping all source file integrity checks.
[2019-11-16T09:57:47.583Z] ==> Extracting sources...
[2019-11-16T09:57:47.583Z]   -> Extracting python-aiobotocore-0.11.0.tar.gz with bsdtar
[2019-11-16T09:57:47.583Z] ==> Starting prepare()...
[2019-11-16T09:57:47.583Z] patching file tests/conftest.py
[2019-11-16T09:57:47.583Z] Hunk #1 succeeded at 68 (offset -3 lines).
[2019-11-16T09:57:47.583Z] patching file tests/test_sns.py
[2019-11-16T09:57:47.583Z] removed 'tests/test_patches.py'
[2019-11-16T09:57:47.583Z] ==> Starting build()...
[2019-11-16T09:57:47.833Z] running build
[2019-11-16T09:57:47.833Z] running build_py
[2019-11-16T09:57:47.833Z] creating build
[2019-11-16T09:57:47.833Z] creating build/lib
[2019-11-16T09:57:47.833Z] creating build/lib/aiobotocore
[2019-11-16T09:57:47.833Z] copying aiobotocore/config.py -> build/lib/aiobotocore
[2019-11-16T09:57:47.833Z] copying aiobotocore/client.py -> build/lib/aiobotocore
[2019-11-16T09:57:47.833Z] copying aiobotocore/response.py -> build/lib/aiobotocore
[2019-11-16T09:57:47.833Z] copying aiobotocore/_endpoint_helpers.py -> build/lib/aiobotocore
[2019-11-16T09:57:47.833Z] copying aiobotocore/waiter.py -> build/lib/aiobotocore
[2019-11-16T09:57:47.833Z] copying aiobotocore/paginate.py -> build/lib/aiobotocore
[2019-11-16T09:57:47.833Z] copying aiobotocore/__init__.py -> build/lib/aiobotocore
[2019-11-16T09:57:47.833Z] copying aiobotocore/endpoint.py -> build/lib/aiobotocore
[2019-11-16T09:57:47.833Z] copying aiobotocore/args.py -> build/lib/aiobotocore
[2019-11-16T09:57:47.833Z] copying aiobotocore/session.py -> build/lib/aiobotocore
[2019-11-16T09:57:47.833Z] running egg_info
[2019-11-16T09:57:47.833Z] creating aiobotocore.egg-info
[2019-11-16T09:57:47.833Z] writing aiobotocore.egg-info/PKG-INFO
[2019-11-16T09:57:47.833Z] writing dependency_links to aiobotocore.egg-info/dependency_links.txt
[2019-11-16T09:57:47.833Z] writing requirements to aiobotocore.egg-info/requires.txt
[2019-11-16T09:57:47.833Z] writing top-level names to aiobotocore.egg-info/top_level.txt
[2019-11-16T09:57:47.833Z] writing manifest file 'aiobotocore.egg-info/SOURCES.txt'
[2019-11-16T09:57:47.833Z] reading manifest file 'aiobotocore.egg-info/SOURCES.txt'
[2019-11-16T09:57:47.833Z] reading manifest template 'MANIFEST.in'
[2019-11-16T09:57:47.833Z] warning: no previously-included files matching '*.pyc' found anywhere in distribution
[2019-11-16T09:57:47.833Z] warning: no previously-included files matching '*.swp' found anywhere in distribution
[2019-11-16T09:57:47.833Z] writing manifest file 'aiobotocore.egg-info/SOURCES.txt'
[2019-11-16T09:57:47.833Z] ==> Starting check()...
[2019-11-16T09:57:49.176Z] ============================= test session starts ==============================
[2019-11-16T09:57:49.176Z] platform linux -- Python 3.8.0, pytest-5.2.3, py-1.8.0, pluggy-0.13.0 -- /usr/bin/python
[2019-11-16T09:57:49.176Z] cachedir: .pytest_cache
[2019-11-16T09:57:49.176Z] rootdir: /build/python-aiobotocore/src/aiobotocore-0.11.0
[2019-11-16T09:57:49.176Z] plugins: asyncio-0.10.0
[2019-11-16T09:57:49.176Z] collecting ... collected 63 items / 8 deselected / 55 selected
[2019-11-16T09:57:49.176Z] 
[2019-11-16T09:57:51.658Z] tests/test_basic_s3.py::test_can_make_request PASSED                     [  1%]
[2019-11-16T09:58:01.533Z] tests/test_basic_s3.py::test_fail_proxy_request PASSED                   [  3%]
[2019-11-16T09:58:01.533Z] tests/test_basic_s3.py::test_can_get_bucket_location PASSED              [  5%]
[2019-11-16T09:58:01.533Z] tests/test_basic_s3.py::test_can_delete_urlencoded_object PASSED         [  7%]
[2019-11-16T09:58:01.533Z] tests/test_basic_s3.py::test_can_paginate PASSED                         [  9%]
[2019-11-16T09:58:01.783Z] tests/test_basic_s3.py::test_can_paginate_with_page_size PASSED          [ 10%]
[2019-11-16T09:58:02.034Z] tests/test_basic_s3.py::test_can_paginate_iterator PASSED                [ 12%]
[2019-11-16T09:58:02.034Z] tests/test_basic_s3.py::test_result_key_iters PASSED                     [ 14%]
[2019-11-16T09:58:02.284Z] tests/test_basic_s3.py::test_can_get_and_put_object PASSED               [ 16%]
[2019-11-16T09:58:02.284Z] tests/test_basic_s3.py::test_get_object_stream_wrapper PASSED            [ 18%]
[2019-11-16T09:58:02.284Z] tests/test_basic_s3.py::test_get_object_stream_context PASSED            [ 20%]
[2019-11-16T09:58:02.534Z] tests/test_basic_s3.py::test_paginate_max_items PASSED                   [ 21%]
[2019-11-16T09:58:02.785Z] tests/test_basic_s3.py::test_paginate_within_page_boundaries PASSED      [ 23%]
[2019-11-16T09:58:03.035Z] tests/test_basic_s3.py::test_non_normalized_key_paths PASSED             [ 25%]
[2019-11-16T09:58:03.035Z] tests/test_basic_s3.py::test_copy_with_quoted_char PASSED                [ 27%]
[2019-11-16T09:58:03.285Z] tests/test_basic_s3.py::test_copy_with_query_string FAILED               [ 29%]
[2019-11-16T09:58:03.285Z] tests/test_basic_s3.py::test_can_copy_with_dict_form FAILED              [ 30%]
[2019-11-16T09:58:03.536Z] tests/test_basic_s3.py::test_can_copy_with_dict_form_with_version FAILED [ 32%]
[2019-11-16T09:58:03.536Z] tests/test_basic_s3.py::test_copy_with_s3_metadata PASSED                [ 34%]
[2019-11-16T09:58:03.786Z] tests/test_basic_s3.py::test_head_object_keys[s3v4] PASSED               [ 36%]
[2019-11-16T09:58:03.786Z] tests/test_config.py::test_connector_args PASSED                         [ 38%]
[2019-11-16T09:58:07.908Z] tests/test_config.py::test_connector_timeout PASSED                      [ 40%]
[2019-11-16T09:58:08.819Z] tests/test_config.py::test_connector_timeout2 PASSED                     [ 41%]
[2019-11-16T09:58:11.301Z] tests/test_dynamodb.py::test_get_item[v4] PASSED                         [ 43%]
[2019-11-16T09:58:11.301Z] tests/test_dynamodb.py::test_create_waiter[v4] PASSED                    [ 45%]
[2019-11-16T09:58:11.301Z] tests/test_dynamodb.py::test_batch_write_scan[v4] PASSED                 [ 47%]
[2019-11-16T09:58:11.301Z] tests/test_dynamodb.py::test_delete_table[v4] PASSED                     [ 49%]
[2019-11-16T09:58:11.301Z] tests/test_dynamodb.py::test_waiter_table_exists_failure[v4] PASSED      [ 50%]
[2019-11-16T09:58:13.783Z] tests/test_dynamodb.py::test_waiter_table_exists[v4] PASSED              [ 52%]
[2019-11-16T09:58:13.784Z] tests/test_monitor.py::test_monitor_response_received PASSED             [ 54%]
[2019-11-16T09:58:13.784Z] tests/test_response.py::test_streaming_wrapper_validates_content_length PASSED [ 56%]
[2019-11-16T09:58:13.784Z] tests/test_response.py::test_streaming_body_with_invalid_length PASSED   [ 58%]
[2019-11-16T09:58:13.784Z] tests/test_response.py::test_streaming_body_with_zero_read PASSED        [ 60%]
[2019-11-16T09:58:13.784Z] tests/test_response.py::test_streaming_body_with_single_read PASSED      [ 61%]
[2019-11-16T09:58:13.784Z] tests/test_response.py::test_streaming_body_closes PASSED                [ 63%]
[2019-11-16T09:58:13.784Z] tests/test_response.py::test_default_iter_behavior PASSED                [ 65%]
[2019-11-16T09:58:13.784Z] tests/test_response.py::test_iter_chunks_single_byte PASSED              [ 67%]
[2019-11-16T09:58:13.784Z] tests/test_response.py::test_iter_chunks_with_leftover PASSED            [ 69%]
[2019-11-16T09:58:13.784Z] tests/test_response.py::test_iter_chunks_single_chunk PASSED             [ 70%]
[2019-11-16T09:58:13.784Z] tests/test_response.py::test_streaming_line_iterator PASSED              [ 72%]
[2019-11-16T09:58:13.784Z] tests/test_response.py::test_streaming_line_iterator_ends_newline PASSED [ 74%]
[2019-11-16T09:58:13.784Z] tests/test_response.py::test_streaming_line_iter_chunk_sizes PASSED      [ 76%]
[2019-11-16T09:58:13.784Z] tests/test_response.py::test_streaming_body_is_an_iterator PASSED        [ 78%]
[2019-11-16T09:58:13.784Z] tests/test_response.py::test_streaming_line_abstruse_newline_standard PASSED [ 80%]
[2019-11-16T09:58:13.784Z] tests/test_response.py::test_streaming_line_empty_body PASSED            [ 81%]
[2019-11-16T09:58:15.645Z] tests/test_sns.py::test_topic_attributes PASSED                          [ 83%]
[2019-11-16T09:58:15.645Z] tests/test_sns.py::test_creating_subscription PASSED                     [ 85%]
[2019-11-16T09:58:16.196Z] tests/test_sns.py::test_publish_to_http PASSED                           [ 87%]
[2019-11-16T09:58:16.196Z] tests/test_sns.py::test_get_missing_endpoint_attributes PASSED           [ 89%]
[2019-11-16T09:58:16.196Z] tests/test_sns.py::test_platform_applications PASSED                     [ 90%]
[2019-11-16T09:58:18.678Z] tests/test_sqs.py::test_list_queues PASSED                               [ 92%]
[2019-11-16T09:58:18.678Z] tests/test_sqs.py::test_get_queue_name PASSED                            [ 94%]
[2019-11-16T09:58:18.678Z] tests/test_sqs.py::test_put_pull_delete_test PASSED                      [ 96%]
[2019-11-16T09:58:20.539Z] tests/test_sqs.py::test_put_pull_wait PASSED                             [ 98%]
[2019-11-16T09:58:23.022Z] tests/test_waiter.py::test_sqs PASSED                                    [100%]
[2019-11-16T09:58:23.022Z] 
[2019-11-16T09:58:23.022Z] =================================== FAILURES ===================================
[2019-11-16T09:58:23.022Z] _________________________ test_copy_with_query_string __________________________
[2019-11-16T09:58:23.022Z] 
[2019-11-16T09:58:23.022Z] s3_client = <aiobotocore.client.S3 object at 0x7f64b565f550>
[2019-11-16T09:58:23.022Z] create_object = <function create_object.<locals>._f at 0x7f64b47b08b0>
[2019-11-16T09:58:23.022Z] bucket_name = 'aiobotocoretest-1573898283'
[2019-11-16T09:58:23.022Z] 
[2019-11-16T09:58:23.022Z]     @pytest.mark.moto
[2019-11-16T09:58:23.022Z]     @pytest.mark.asyncio
[2019-11-16T09:58:23.022Z]     async def test_copy_with_query_string(s3_client, create_object, bucket_name):
[2019-11-16T09:58:23.022Z]         key_name = 'a+b/foo?notVersionid=bar'
[2019-11-16T09:58:23.022Z]         await create_object(key_name=key_name)
[2019-11-16T09:58:23.022Z]     
[2019-11-16T09:58:23.022Z]         key_name2 = key_name + 'bar'
[2019-11-16T09:58:23.022Z] >       await s3_client.copy_object(
[2019-11-16T09:58:23.022Z]             Bucket=bucket_name, Key=key_name2,
[2019-11-16T09:58:23.022Z]             CopySource='%s/%s' % (bucket_name, key_name))
[2019-11-16T09:58:23.022Z] 
[2019-11-16T09:58:23.022Z] tests/test_basic_s3.py:375: 
[2019-11-16T09:58:23.022Z] _ _ _ _ _ _ _ _ _ _ _ _ _ _ _ _ _ _ _ _ _ _ _ _ _ _ _ _ _ _ _ _ _ _ _ _ _ _ _ _ 
[2019-11-16T09:58:23.022Z] 
[2019-11-16T09:58:23.022Z] self = <aiobotocore.client.S3 object at 0x7f64b565f550>
[2019-11-16T09:58:23.022Z] operation_name = 'CopyObject'
[2019-11-16T09:58:23.022Z] api_params = {'Bucket': 'aiobotocoretest-1573898283', 'CopySource': 'aiobotocoretest-1573898283/a%2Bb/foo%3FnotVersionid%3Dbar', 'Key': 'a+b/foo?notVersionid=barbar'}
[2019-11-16T09:58:23.022Z] 
[2019-11-16T09:58:23.022Z]     async def _make_api_call(self, operation_name, api_params):
[2019-11-16T09:58:23.022Z]         operation_model = self._service_model.operation_model(operation_name)
[2019-11-16T09:58:23.022Z]         service_name = self._service_model.service_name
[2019-11-16T09:58:23.022Z]         history_recorder.record('API_CALL', {
[2019-11-16T09:58:23.022Z]             'service': service_name,
[2019-11-16T09:58:23.022Z]             'operation': operation_name,
[2019-11-16T09:58:23.022Z]             'params': api_params,
[2019-11-16T09:58:23.022Z]         })
[2019-11-16T09:58:23.022Z]         if operation_model.deprecated:
[2019-11-16T09:58:23.022Z]             logger.debug('Warning: %s.%s() is deprecated',
[2019-11-16T09:58:23.022Z]                          service_name, operation_name)
[2019-11-16T09:58:23.022Z]         request_context = {
[2019-11-16T09:58:23.022Z]             'client_region': self.meta.region_name,
[2019-11-16T09:58:23.022Z]             'client_config': self.meta.config,
[2019-11-16T09:58:23.022Z]             'has_streaming_input': operation_model.has_streaming_input,
[2019-11-16T09:58:23.022Z]             'auth_type': operation_model.auth_type,
[2019-11-16T09:58:23.022Z]         }
[2019-11-16T09:58:23.022Z]         request_dict = self._convert_to_request_dict(
[2019-11-16T09:58:23.022Z]             api_params, operation_model, context=request_context)
[2019-11-16T09:58:23.022Z]     
[2019-11-16T09:58:23.022Z]         service_id = self._service_model.service_id.hyphenize()
[2019-11-16T09:58:23.022Z]         handler, event_response = self.meta.events.emit_until_response(
[2019-11-16T09:58:23.022Z]             'before-call.{service_id}.{operation_name}'.format(
[2019-11-16T09:58:23.022Z]                 service_id=service_id,
[2019-11-16T09:58:23.022Z]                 operation_name=operation_name),
[2019-11-16T09:58:23.022Z]             model=operation_model, params=request_dict,
[2019-11-16T09:58:23.022Z]             request_signer=self._request_signer, context=request_context)
[2019-11-16T09:58:23.022Z]     
[2019-11-16T09:58:23.022Z]         if event_response is not None:
[2019-11-16T09:58:23.022Z]             http, parsed_response = event_response
[2019-11-16T09:58:23.022Z]         else:
[2019-11-16T09:58:23.022Z]             http, parsed_response = await self._make_request(
[2019-11-16T09:58:23.022Z]                 operation_model, request_dict, request_context)
[2019-11-16T09:58:23.022Z]     
[2019-11-16T09:58:23.022Z]         self.meta.events.emit(
[2019-11-16T09:58:23.022Z]             'after-call.{service_id}.{operation_name}'.format(
[2019-11-16T09:58:23.022Z]                 service_id=service_id,
[2019-11-16T09:58:23.022Z]                 operation_name=operation_name),
[2019-11-16T09:58:23.022Z]             http_response=http, parsed=parsed_response,
[2019-11-16T09:58:23.022Z]             model=operation_model, context=request_context
[2019-11-16T09:58:23.022Z]         )
[2019-11-16T09:58:23.022Z]     
[2019-11-16T09:58:23.022Z]         if http.status_code >= 300:
[2019-11-16T09:58:23.022Z]             error_code = parsed_response.get("Error", {}).get("Code")
[2019-11-16T09:58:23.022Z]             error_class = self.exceptions.from_code(error_code)
[2019-11-16T09:58:23.022Z] >           raise error_class(parsed_response, operation_name)
[2019-11-16T09:58:23.022Z] E           botocore.exceptions.ClientError: An error occurred (404) when calling the CopyObject operation: Not Found
[2019-11-16T09:58:23.022Z] 
[2019-11-16T09:58:23.022Z] build/lib/aiobotocore/client.py:102: ClientError
[2019-11-16T09:58:23.022Z] ---------------------------- Captured stderr setup -----------------------------
[2019-11-16T09:58:23.022Z] 127.0.0.1 - - [16/Nov/2019 10:58:03] "PUT /aiobotocoretest-1573898283 HTTP/1.1" 200 -
[2019-11-16T09:58:23.022Z] 127.0.0.1 - - [16/Nov/2019 10:58:03] "PUT /aiobotocoretest-1573898283?versioning HTTP/1.1" 200 -
[2019-11-16T09:58:23.022Z] ----------------------------- Captured stderr call -----------------------------
[2019-11-16T09:58:23.022Z] 127.0.0.1 - - [16/Nov/2019 10:58:03] "PUT /aiobotocoretest-1573898283/a%2Bb/foo%3FnotVersionid%3Dbar HTTP/1.1" 200 -
[2019-11-16T09:58:23.022Z] 127.0.0.1 - - [16/Nov/2019 10:58:03] "PUT /aiobotocoretest-1573898283/a%2Bb/foo%3FnotVersionid%3Dbarbar HTTP/1.1" 404 -
[2019-11-16T09:58:23.022Z] --------------------------- Captured stderr teardown ---------------------------
[2019-11-16T09:58:23.022Z] 127.0.0.1 - - [16/Nov/2019 10:58:03] "GET /aiobotocoretest-1573898283?versions&prefix=&encoding-type=url HTTP/1.1" 200 -
[2019-11-16T09:58:23.022Z] 127.0.0.1 - - [16/Nov/2019 10:58:03] "DELETE /aiobotocoretest-1573898283/a%2Bb/foo%3FnotVersionid%3Dbar?versionId=029408c2-81b3-42bf-ade5-91cdbc71e280 HTTP/1.1" 204 -
[2019-11-16T09:58:23.022Z] 127.0.0.1 - - [16/Nov/2019 10:58:03] "DELETE /aiobotocoretest-1573898283 HTTP/1.1" 204 -
[2019-11-16T09:58:23.022Z] _________________________ test_can_copy_with_dict_form _________________________
[2019-11-16T09:58:23.022Z] 
[2019-11-16T09:58:23.022Z] s3_client = <aiobotocore.client.S3 object at 0x7f64b4506730>
[2019-11-16T09:58:23.022Z] create_object = <function create_object.<locals>._f at 0x7f64b5570a60>
[2019-11-16T09:58:23.022Z] bucket_name = 'aiobotocoretest-1573898283'
[2019-11-16T09:58:23.022Z] 
[2019-11-16T09:58:23.022Z]     @pytest.mark.moto
[2019-11-16T09:58:23.023Z]     @pytest.mark.asyncio
[2019-11-16T09:58:23.023Z]     async def test_can_copy_with_dict_form(s3_client, create_object, bucket_name):
[2019-11-16T09:58:23.023Z]         key_name = 'a+b/foo?versionId=abcd'
[2019-11-16T09:58:23.023Z]         await create_object(key_name=key_name)
[2019-11-16T09:58:23.023Z]     
[2019-11-16T09:58:23.023Z]         key_name2 = key_name + 'bar'
[2019-11-16T09:58:23.023Z] >       await s3_client.copy_object(
[2019-11-16T09:58:23.023Z]             Bucket=bucket_name, Key=key_name2,
[2019-11-16T09:58:23.023Z]             CopySource={'Bucket': bucket_name, 'Key': key_name})
[2019-11-16T09:58:23.023Z] 
[2019-11-16T09:58:23.023Z] tests/test_basic_s3.py:393: 
[2019-11-16T09:58:23.023Z] _ _ _ _ _ _ _ _ _ _ _ _ _ _ _ _ _ _ _ _ _ _ _ _ _ _ _ _ _ _ _ _ _ _ _ _ _ _ _ _ 
[2019-11-16T09:58:23.023Z] 
[2019-11-16T09:58:23.023Z] self = <aiobotocore.client.S3 object at 0x7f64b4506730>
[2019-11-16T09:58:23.023Z] operation_name = 'CopyObject'
[2019-11-16T09:58:23.023Z] api_params = {'Bucket': 'aiobotocoretest-1573898283', 'CopySource': 'aiobotocoretest-1573898283/a%2Bb/foo%3FversionId%3Dabcd', 'Key': 'a+b/foo?versionId=abcdbar'}
[2019-11-16T09:58:23.023Z] 
[2019-11-16T09:58:23.023Z]     async def _make_api_call(self, operation_name, api_params):
[2019-11-16T09:58:23.023Z]         operation_model = self._service_model.operation_model(operation_name)
[2019-11-16T09:58:23.023Z]         service_name = self._service_model.service_name
[2019-11-16T09:58:23.023Z]         history_recorder.record('API_CALL', {
[2019-11-16T09:58:23.023Z]             'service': service_name,
[2019-11-16T09:58:23.023Z]             'operation': operation_name,
[2019-11-16T09:58:23.023Z]             'params': api_params,
[2019-11-16T09:58:23.023Z]         })
[2019-11-16T09:58:23.023Z]         if operation_model.deprecated:
[2019-11-16T09:58:23.023Z]             logger.debug('Warning: %s.%s() is deprecated',
[2019-11-16T09:58:23.023Z]                          service_name, operation_name)
[2019-11-16T09:58:23.023Z]         request_context = {
[2019-11-16T09:58:23.023Z]             'client_region': self.meta.region_name,
[2019-11-16T09:58:23.023Z]             'client_config': self.meta.config,
[2019-11-16T09:58:23.023Z]             'has_streaming_input': operation_model.has_streaming_input,
[2019-11-16T09:58:23.023Z]             'auth_type': operation_model.auth_type,
[2019-11-16T09:58:23.023Z]         }
[2019-11-16T09:58:23.023Z]         request_dict = self._convert_to_request_dict(
[2019-11-16T09:58:23.023Z]             api_params, operation_model, context=request_context)
[2019-11-16T09:58:23.023Z]     
[2019-11-16T09:58:23.023Z]         service_id = self._service_model.service_id.hyphenize()
[2019-11-16T09:58:23.023Z]         handler, event_response = self.meta.events.emit_until_response(
[2019-11-16T09:58:23.023Z]             'before-call.{service_id}.{operation_name}'.format(
[2019-11-16T09:58:23.023Z]                 service_id=service_id,
[2019-11-16T09:58:23.023Z]                 operation_name=operation_name),
[2019-11-16T09:58:23.023Z]             model=operation_model, params=request_dict,
[2019-11-16T09:58:23.023Z]             request_signer=self._request_signer, context=request_context)
[2019-11-16T09:58:23.023Z]     
[2019-11-16T09:58:23.023Z]         if event_response is not None:
[2019-11-16T09:58:23.023Z]             http, parsed_response = event_response
[2019-11-16T09:58:23.023Z]         else:
[2019-11-16T09:58:23.023Z]             http, parsed_response = await self._make_request(
[2019-11-16T09:58:23.023Z]                 operation_model, request_dict, request_context)
[2019-11-16T09:58:23.023Z]     
[2019-11-16T09:58:23.023Z]         self.meta.events.emit(
[2019-11-16T09:58:23.023Z]             'after-call.{service_id}.{operation_name}'.format(
[2019-11-16T09:58:23.023Z]                 service_id=service_id,
[2019-11-16T09:58:23.023Z]                 operation_name=operation_name),
[2019-11-16T09:58:23.023Z]             http_response=http, parsed=parsed_response,
[2019-11-16T09:58:23.023Z]             model=operation_model, context=request_context
[2019-11-16T09:58:23.023Z]         )
[2019-11-16T09:58:23.023Z]     
[2019-11-16T09:58:23.023Z]         if http.status_code >= 300:
[2019-11-16T09:58:23.023Z]             error_code = parsed_response.get("Error", {}).get("Code")
[2019-11-16T09:58:23.023Z]             error_class = self.exceptions.from_code(error_code)
[2019-11-16T09:58:23.023Z] >           raise error_class(parsed_response, operation_name)
[2019-11-16T09:58:23.023Z] E           botocore.exceptions.ClientError: An error occurred (404) when calling the CopyObject operation: Not Found
[2019-11-16T09:58:23.023Z] 
[2019-11-16T09:58:23.023Z] build/lib/aiobotocore/client.py:102: ClientError
[2019-11-16T09:58:23.023Z] ---------------------------- Captured stderr setup -----------------------------
[2019-11-16T09:58:23.023Z] 127.0.0.1 - - [16/Nov/2019 10:58:03] "PUT /aiobotocoretest-1573898283 HTTP/1.1" 200 -
[2019-11-16T09:58:23.023Z] 127.0.0.1 - - [16/Nov/2019 10:58:03] "PUT /aiobotocoretest-1573898283?versioning HTTP/1.1" 200 -
[2019-11-16T09:58:23.023Z] ----------------------------- Captured stderr call -----------------------------
[2019-11-16T09:58:23.023Z] 127.0.0.1 - - [16/Nov/2019 10:58:03] "PUT /aiobotocoretest-1573898283/a%2Bb/foo%3FversionId%3Dabcd HTTP/1.1" 200 -
[2019-11-16T09:58:23.023Z] 127.0.0.1 - - [16/Nov/2019 10:58:03] "PUT /aiobotocoretest-1573898283/a%2Bb/foo%3FversionId%3Dabcdbar HTTP/1.1" 404 -
[2019-11-16T09:58:23.023Z] --------------------------- Captured stderr teardown ---------------------------
[2019-11-16T09:58:23.023Z] 127.0.0.1 - - [16/Nov/2019 10:58:03] "GET /aiobotocoretest-1573898283?versions&prefix=&encoding-type=url HTTP/1.1" 200 -
[2019-11-16T09:58:23.023Z] 127.0.0.1 - - [16/Nov/2019 10:58:03] "DELETE /aiobotocoretest-1573898283/a%2Bb/foo%3FversionId%3Dabcd?versionId=6c190256-9b7b-4550-a8e4-afc421bdeadf HTTP/1.1" 204 -
[2019-11-16T09:58:23.023Z] 127.0.0.1 - - [16/Nov/2019 10:58:03] "DELETE /aiobotocoretest-1573898283 HTTP/1.1" 204 -
[2019-11-16T09:58:23.023Z] __________________ test_can_copy_with_dict_form_with_version ___________________
[2019-11-16T09:58:23.023Z] 
[2019-11-16T09:58:23.023Z] s3_client = <aiobotocore.client.S3 object at 0x7f64b515fe50>
[2019-11-16T09:58:23.023Z] create_object = <function create_object.<locals>._f at 0x7f64b515dc10>
[2019-11-16T09:58:23.023Z] bucket_name = 'aiobotocoretest-1573898283'
[2019-11-16T09:58:23.023Z] 
[2019-11-16T09:58:23.023Z]     @pytest.mark.moto
[2019-11-16T09:58:23.023Z]     @pytest.mark.asyncio
[2019-11-16T09:58:23.023Z]     async def test_can_copy_with_dict_form_with_version(
[2019-11-16T09:58:23.023Z]             s3_client, create_object, bucket_name):
[2019-11-16T09:58:23.023Z]         key_name = 'a+b/foo?versionId=abcd'
[2019-11-16T09:58:23.023Z]         response = await create_object(key_name=key_name)
[2019-11-16T09:58:23.023Z]         key_name2 = key_name + 'bar'
[2019-11-16T09:58:23.023Z] >       await s3_client.copy_object(
[2019-11-16T09:58:23.023Z]             Bucket=bucket_name, Key=key_name2,
[2019-11-16T09:58:23.023Z]             CopySource={'Bucket': bucket_name, 'Key': key_name,
[2019-11-16T09:58:23.023Z]                         'VersionId': response["VersionId"]})
[2019-11-16T09:58:23.023Z] 
[2019-11-16T09:58:23.023Z] tests/test_basic_s3.py:411: 
[2019-11-16T09:58:23.023Z] _ _ _ _ _ _ _ _ _ _ _ _ _ _ _ _ _ _ _ _ _ _ _ _ _ _ _ _ _ _ _ _ _ _ _ _ _ _ _ _ 
[2019-11-16T09:58:23.023Z] 
[2019-11-16T09:58:23.023Z] self = <aiobotocore.client.S3 object at 0x7f64b515fe50>
[2019-11-16T09:58:23.023Z] operation_name = 'CopyObject'
[2019-11-16T09:58:23.023Z] api_params = {'Bucket': 'aiobotocoretest-1573898283', 'CopySource': 'aiobotocoretest-1573898283/a%2Bb/foo%3FversionId%3Dabcd?versionId=7f4caf51-7ab3-4673-8094-f6c958b678fc', 'Key': 'a+b/foo?versionId=abcdbar'}
[2019-11-16T09:58:23.023Z] 
[2019-11-16T09:58:23.023Z]     async def _make_api_call(self, operation_name, api_params):
[2019-11-16T09:58:23.023Z]         operation_model = self._service_model.operation_model(operation_name)
[2019-11-16T09:58:23.023Z]         service_name = self._service_model.service_name
[2019-11-16T09:58:23.023Z]         history_recorder.record('API_CALL', {
[2019-11-16T09:58:23.023Z]             'service': service_name,
[2019-11-16T09:58:23.023Z]             'operation': operation_name,
[2019-11-16T09:58:23.023Z]             'params': api_params,
[2019-11-16T09:58:23.023Z]         })
[2019-11-16T09:58:23.023Z]         if operation_model.deprecated:
[2019-11-16T09:58:23.023Z]             logger.debug('Warning: %s.%s() is deprecated',
[2019-11-16T09:58:23.023Z]                          service_name, operation_name)
[2019-11-16T09:58:23.023Z]         request_context = {
[2019-11-16T09:58:23.023Z]             'client_region': self.meta.region_name,
[2019-11-16T09:58:23.023Z]             'client_config': self.meta.config,
[2019-11-16T09:58:23.023Z]             'has_streaming_input': operation_model.has_streaming_input,
[2019-11-16T09:58:23.023Z]             'auth_type': operation_model.auth_type,
[2019-11-16T09:58:23.023Z]         }
[2019-11-16T09:58:23.023Z]         request_dict = self._convert_to_request_dict(
[2019-11-16T09:58:23.023Z]             api_params, operation_model, context=request_context)
[2019-11-16T09:58:23.023Z]     
[2019-11-16T09:58:23.023Z]         service_id = self._service_model.service_id.hyphenize()
[2019-11-16T09:58:23.023Z]         handler, event_response = self.meta.events.emit_until_response(
[2019-11-16T09:58:23.023Z]             'before-call.{service_id}.{operation_name}'.format(
[2019-11-16T09:58:23.023Z]                 service_id=service_id,
[2019-11-16T09:58:23.023Z]                 operation_name=operation_name),
[2019-11-16T09:58:23.023Z]             model=operation_model, params=request_dict,
[2019-11-16T09:58:23.023Z]             request_signer=self._request_signer, context=request_context)
[2019-11-16T09:58:23.023Z]     
[2019-11-16T09:58:23.023Z]         if event_response is not None:
[2019-11-16T09:58:23.023Z]             http, parsed_response = event_response
[2019-11-16T09:58:23.023Z]         else:
[2019-11-16T09:58:23.023Z]             http, parsed_response = await self._make_request(
[2019-11-16T09:58:23.023Z]                 operation_model, request_dict, request_context)
[2019-11-16T09:58:23.023Z]     
[2019-11-16T09:58:23.024Z]         self.meta.events.emit(
[2019-11-16T09:58:23.024Z]             'after-call.{service_id}.{operation_name}'.format(
[2019-11-16T09:58:23.024Z]                 service_id=service_id,
[2019-11-16T09:58:23.024Z]                 operation_name=operation_name),
[2019-11-16T09:58:23.024Z]             http_response=http, parsed=parsed_response,
[2019-11-16T09:58:23.024Z]             model=operation_model, context=request_context
[2019-11-16T09:58:23.024Z]         )
[2019-11-16T09:58:23.024Z]     
[2019-11-16T09:58:23.024Z]         if http.status_code >= 300:
[2019-11-16T09:58:23.024Z]             error_code = parsed_response.get("Error", {}).get("Code")
[2019-11-16T09:58:23.024Z]             error_class = self.exceptions.from_code(error_code)
[2019-11-16T09:58:23.024Z] >           raise error_class(parsed_response, operation_name)
[2019-11-16T09:58:23.024Z] E           botocore.exceptions.ClientError: An error occurred (404) when calling the CopyObject operation: Not Found
[2019-11-16T09:58:23.024Z] 
[2019-11-16T09:58:23.024Z] build/lib/aiobotocore/client.py:102: ClientError
[2019-11-16T09:58:23.024Z] ---------------------------- Captured stderr setup -----------------------------
[2019-11-16T09:58:23.024Z] 127.0.0.1 - - [16/Nov/2019 10:58:03] "PUT /aiobotocoretest-1573898283 HTTP/1.1" 200 -
[2019-11-16T09:58:23.024Z] 127.0.0.1 - - [16/Nov/2019 10:58:03] "PUT /aiobotocoretest-1573898283?versioning HTTP/1.1" 200 -
[2019-11-16T09:58:23.024Z] ----------------------------- Captured stderr call -----------------------------
[2019-11-16T09:58:23.024Z] 127.0.0.1 - - [16/Nov/2019 10:58:03] "PUT /aiobotocoretest-1573898283/a%2Bb/foo%3FversionId%3Dabcd HTTP/1.1" 200 -
[2019-11-16T09:58:23.024Z] 127.0.0.1 - - [16/Nov/2019 10:58:03] "PUT /aiobotocoretest-1573898283/a%2Bb/foo%3FversionId%3Dabcdbar HTTP/1.1" 404 -
[2019-11-16T09:58:23.024Z] --------------------------- Captured stderr teardown ---------------------------
[2019-11-16T09:58:23.024Z] 127.0.0.1 - - [16/Nov/2019 10:58:03] "GET /aiobotocoretest-1573898283?versions&prefix=&encoding-type=url HTTP/1.1" 200 -
[2019-11-16T09:58:23.024Z] 127.0.0.1 - - [16/Nov/2019 10:58:03] "DELETE /aiobotocoretest-1573898283/a%2Bb/foo%3FversionId%3Dabcd?versionId=7f4caf51-7ab3-4673-8094-f6c958b678fc HTTP/1.1" 204 -
[2019-11-16T09:58:23.024Z] 127.0.0.1 - - [16/Nov/2019 10:58:03] "DELETE /aiobotocoretest-1573898283 HTTP/1.1" 204 -
[2019-11-16T09:58:23.024Z] =============================== warnings summary ===============================
[2019-11-16T09:58:23.024Z] /usr/lib/python3.8/site-packages/_pytest/mark/structures.py:321
[2019-11-16T09:58:23.024Z]   /usr/lib/python3.8/site-packages/_pytest/mark/structures.py:321: PytestUnknownMarkWarning: Unknown pytest.mark.moto - is this a typo?  You can register custom marks to avoid this warning - for details, see https://docs.pytest.org/en/latest/mark.html
[2019-11-16T09:58:23.024Z]     warnings.warn(
[2019-11-16T09:58:23.024Z] 
[2019-11-16T09:58:23.024Z] tests/test_basic_s3.py::test_can_make_request
[2019-11-16T09:58:23.024Z] tests/test_basic_s3.py::test_fail_proxy_request
[2019-11-16T09:58:23.024Z] tests/test_basic_s3.py::test_fail_proxy_request
[2019-11-16T09:58:23.024Z] tests/test_basic_s3.py::test_fail_proxy_request
[2019-11-16T09:58:23.024Z] tests/test_basic_s3.py::test_fail_proxy_request
[2019-11-16T09:58:23.024Z] tests/test_basic_s3.py::test_fail_proxy_request
[2019-11-16T09:58:23.024Z] tests/test_basic_s3.py::test_can_get_bucket_location
[2019-11-16T09:58:23.024Z] tests/test_basic_s3.py::test_can_get_bucket_location
[2019-11-16T09:58:23.024Z] tests/test_basic_s3.py::test_can_get_bucket_location
[2019-11-16T09:58:23.024Z] tests/test_basic_s3.py::test_can_get_bucket_location
[2019-11-16T09:58:23.024Z] tests/test_basic_s3.py::test_can_get_bucket_location
[2019-11-16T09:58:23.024Z] tests/test_basic_s3.py::test_can_delete_urlencoded_object
[2019-11-16T09:58:23.024Z] tests/test_basic_s3.py::test_can_delete_urlencoded_object
[2019-11-16T09:58:23.024Z] tests/test_basic_s3.py::test_can_delete_urlencoded_object
[2019-11-16T09:58:23.024Z] tests/test_basic_s3.py::test_can_delete_urlencoded_object
[2019-11-16T09:58:23.024Z] tests/test_basic_s3.py::test_can_delete_urlencoded_object
[2019-11-16T09:58:23.024Z] tests/test_basic_s3.py::test_can_delete_urlencoded_object
[2019-11-16T09:58:23.024Z] tests/test_basic_s3.py::test_can_delete_urlencoded_object
[2019-11-16T09:58:23.024Z] tests/test_basic_s3.py::test_can_delete_urlencoded_object
[2019-11-16T09:58:23.024Z] tests/test_basic_s3.py::test_can_delete_urlencoded_object
[2019-11-16T09:58:23.024Z] tests/test_basic_s3.py::test_can_delete_urlencoded_object
[2019-11-16T09:58:23.024Z] tests/test_basic_s3.py::test_can_paginate
[2019-11-16T09:58:23.024Z] tests/test_basic_s3.py::test_can_paginate
[2019-11-16T09:58:23.024Z] tests/test_basic_s3.py::test_can_paginate
[2019-11-16T09:58:23.024Z] tests/test_basic_s3.py::test_can_paginate
[2019-11-16T09:58:23.024Z] tests/test_basic_s3.py::test_can_paginate
[2019-11-16T09:58:23.024Z] tests/test_basic_s3.py::test_can_paginate
[2019-11-16T09:58:23.024Z] tests/test_basic_s3.py::test_can_paginate
[2019-11-16T09:58:23.024Z] tests/test_basic_s3.py::test_can_paginate
[2019-11-16T09:58:23.024Z] tests/test_basic_s3.py::test_can_paginate
[2019-11-16T09:58:23.024Z] tests/test_basic_s3.py::test_can_paginate
[2019-11-16T09:58:23.024Z] tests/test_basic_s3.py::test_can_paginate
[2019-11-16T09:58:23.024Z] tests/test_basic_s3.py::test_can_paginate
[2019-11-16T09:58:23.024Z] tests/test_basic_s3.py::test_can_paginate
[2019-11-16T09:58:23.024Z] tests/test_basic_s3.py::test_can_paginate
[2019-11-16T09:58:23.024Z] tests/test_basic_s3.py::test_can_paginate
[2019-11-16T09:58:23.024Z] tests/test_basic_s3.py::test_can_paginate
[2019-11-16T09:58:23.024Z] tests/test_basic_s3.py::test_can_paginate
[2019-11-16T09:58:23.024Z] tests/test_basic_s3.py::test_can_paginate
[2019-11-16T09:58:23.024Z] tests/test_basic_s3.py::test_can_paginate
[2019-11-16T09:58:23.024Z] tests/test_basic_s3.py::test_can_paginate_with_page_size
[2019-11-16T09:58:23.024Z] tests/test_basic_s3.py::test_can_paginate_with_page_size
[2019-11-16T09:58:23.024Z] tests/test_basic_s3.py::test_can_paginate_with_page_size
[2019-11-16T09:58:23.024Z] tests/test_basic_s3.py::test_can_paginate_with_page_size
[2019-11-16T09:58:23.024Z] tests/test_basic_s3.py::test_can_paginate_with_page_size
[2019-11-16T09:58:23.024Z] tests/test_basic_s3.py::test_can_paginate_with_page_size
[2019-11-16T09:58:23.024Z] tests/test_basic_s3.py::test_can_paginate_with_page_size
[2019-11-16T09:58:23.024Z] tests/test_basic_s3.py::test_can_paginate_with_page_size
[2019-11-16T09:58:23.024Z] tests/test_basic_s3.py::test_can_paginate_with_page_size
[2019-11-16T09:58:23.024Z] tests/test_basic_s3.py::test_can_paginate_with_page_size
[2019-11-16T09:58:23.024Z] tests/test_basic_s3.py::test_can_paginate_with_page_size
[2019-11-16T09:58:23.024Z] tests/test_basic_s3.py::test_can_paginate_with_page_size
[2019-11-16T09:58:23.024Z] tests/test_basic_s3.py::test_can_paginate_with_page_size
[2019-11-16T09:58:23.024Z] tests/test_basic_s3.py::test_can_paginate_with_page_size
[2019-11-16T09:58:23.024Z] tests/test_basic_s3.py::test_can_paginate_with_page_size
[2019-11-16T09:58:23.024Z] tests/test_basic_s3.py::test_can_paginate_with_page_size
[2019-11-16T09:58:23.024Z] tests/test_basic_s3.py::test_can_paginate_with_page_size
[2019-11-16T09:58:23.024Z] tests/test_basic_s3.py::test_can_paginate_with_page_size
[2019-11-16T09:58:23.024Z] tests/test_basic_s3.py::test_can_paginate_with_page_size
[2019-11-16T09:58:23.024Z] tests/test_basic_s3.py::test_can_paginate_iterator
[2019-11-16T09:58:23.024Z] tests/test_basic_s3.py::test_can_paginate_iterator
[2019-11-16T09:58:23.024Z] tests/test_basic_s3.py::test_can_paginate_iterator
[2019-11-16T09:58:23.024Z] tests/test_basic_s3.py::test_can_paginate_iterator
[2019-11-16T09:58:23.024Z] tests/test_basic_s3.py::test_can_paginate_iterator
[2019-11-16T09:58:23.024Z] tests/test_basic_s3.py::test_can_paginate_iterator
[2019-11-16T09:58:23.024Z] tests/test_basic_s3.py::test_can_paginate_iterator
[2019-11-16T09:58:23.024Z] tests/test_basic_s3.py::test_can_paginate_iterator
[2019-11-16T09:58:23.024Z] tests/test_basic_s3.py::test_can_paginate_iterator
[2019-11-16T09:58:23.024Z] tests/test_basic_s3.py::test_can_paginate_iterator
[2019-11-16T09:58:23.024Z] tests/test_basic_s3.py::test_can_paginate_iterator
[2019-11-16T09:58:23.024Z] tests/test_basic_s3.py::test_can_paginate_iterator
[2019-11-16T09:58:23.024Z] tests/test_basic_s3.py::test_can_paginate_iterator
[2019-11-16T09:58:23.024Z] tests/test_basic_s3.py::test_can_paginate_iterator
[2019-11-16T09:58:23.024Z] tests/test_basic_s3.py::test_can_paginate_iterator
[2019-11-16T09:58:23.024Z] tests/test_basic_s3.py::test_can_paginate_iterator
[2019-11-16T09:58:23.024Z] tests/test_basic_s3.py::test_can_paginate_iterator
[2019-11-16T09:58:23.024Z] tests/test_basic_s3.py::test_can_paginate_iterator
[2019-11-16T09:58:23.024Z] tests/test_basic_s3.py::test_can_paginate_iterator
[2019-11-16T09:58:23.024Z] tests/test_basic_s3.py::test_result_key_iters
[2019-11-16T09:58:23.024Z] tests/test_basic_s3.py::test_result_key_iters
[2019-11-16T09:58:23.024Z] tests/test_basic_s3.py::test_result_key_iters
[2019-11-16T09:58:23.024Z] tests/test_basic_s3.py::test_result_key_iters
[2019-11-16T09:58:23.024Z] tests/test_basic_s3.py::test_result_key_iters
[2019-11-16T09:58:23.024Z] tests/test_basic_s3.py::test_result_key_iters
[2019-11-16T09:58:23.024Z] tests/test_basic_s3.py::test_result_key_iters
[2019-11-16T09:58:23.024Z] tests/test_basic_s3.py::test_result_key_iters
[2019-11-16T09:58:23.024Z] tests/test_basic_s3.py::test_result_key_iters
[2019-11-16T09:58:23.024Z] tests/test_basic_s3.py::test_result_key_iters
[2019-11-16T09:58:23.024Z] tests/test_basic_s3.py::test_result_key_iters
[2019-11-16T09:58:23.024Z] tests/test_basic_s3.py::test_result_key_iters
[2019-11-16T09:58:23.024Z] tests/test_basic_s3.py::test_result_key_iters
[2019-11-16T09:58:23.025Z] tests/test_basic_s3.py::test_result_key_iters
[2019-11-16T09:58:23.025Z] tests/test_basic_s3.py::test_result_key_iters
[2019-11-16T09:58:23.025Z] tests/test_basic_s3.py::test_result_key_iters
[2019-11-16T09:58:23.025Z] tests/test_basic_s3.py::test_result_key_iters
[2019-11-16T09:58:23.025Z] tests/test_basic_s3.py::test_result_key_iters
[2019-11-16T09:58:23.025Z] tests/test_basic_s3.py::test_result_key_iters
[2019-11-16T09:58:23.025Z] tests/test_basic_s3.py::test_result_key_iters
[2019-11-16T09:58:23.025Z] tests/test_basic_s3.py::test_result_key_iters
[2019-11-16T09:58:23.025Z] tests/test_basic_s3.py::test_result_key_iters
[2019-11-16T09:58:23.025Z] tests/test_basic_s3.py::test_result_key_iters
[2019-11-16T09:58:23.025Z] tests/test_basic_s3.py::test_result_key_iters
[2019-11-16T09:58:23.025Z] tests/test_basic_s3.py::test_result_key_iters
[2019-11-16T09:58:23.025Z] tests/test_basic_s3.py::test_result_key_iters
[2019-11-16T09:58:23.025Z] tests/test_basic_s3.py::test_result_key_iters
[2019-11-16T09:58:23.025Z] tests/test_basic_s3.py::test_can_get_and_put_object
[2019-11-16T09:58:23.025Z] tests/test_basic_s3.py::test_can_get_and_put_object
[2019-11-16T09:58:23.025Z] tests/test_basic_s3.py::test_can_get_and_put_object
[2019-11-16T09:58:23.025Z] tests/test_basic_s3.py::test_can_get_and_put_object
[2019-11-16T09:58:23.025Z] tests/test_basic_s3.py::test_can_get_and_put_object
[2019-11-16T09:58:23.025Z] tests/test_basic_s3.py::test_can_get_and_put_object
[2019-11-16T09:58:23.025Z] tests/test_basic_s3.py::test_can_get_and_put_object
[2019-11-16T09:58:23.025Z] tests/test_basic_s3.py::test_get_object_stream_wrapper
[2019-11-16T09:58:23.025Z] tests/test_basic_s3.py::test_get_object_stream_wrapper
[2019-11-16T09:58:23.025Z] tests/test_basic_s3.py::test_get_object_stream_wrapper
[2019-11-16T09:58:23.025Z] tests/test_basic_s3.py::test_get_object_stream_wrapper
[2019-11-16T09:58:23.025Z] tests/test_basic_s3.py::test_get_object_stream_wrapper
[2019-11-16T09:58:23.025Z] tests/test_basic_s3.py::test_get_object_stream_wrapper
[2019-11-16T09:58:23.025Z] tests/test_basic_s3.py::test_get_object_stream_wrapper
[2019-11-16T09:58:23.025Z] tests/test_basic_s3.py::test_get_object_stream_context
[2019-11-16T09:58:23.025Z] tests/test_basic_s3.py::test_get_object_stream_context
[2019-11-16T09:58:23.025Z] tests/test_basic_s3.py::test_get_object_stream_context
[2019-11-16T09:58:23.025Z] tests/test_basic_s3.py::test_get_object_stream_context
[2019-11-16T09:58:23.025Z] tests/test_basic_s3.py::test_get_object_stream_context
[2019-11-16T09:58:23.025Z] tests/test_basic_s3.py::test_get_object_stream_context
[2019-11-16T09:58:23.025Z] tests/test_basic_s3.py::test_get_object_stream_context
[2019-11-16T09:58:23.025Z] tests/test_basic_s3.py::test_paginate_max_items
[2019-11-16T09:58:23.025Z] tests/test_basic_s3.py::test_paginate_max_items
[2019-11-16T09:58:23.025Z] tests/test_basic_s3.py::test_paginate_max_items
[2019-11-16T09:58:23.025Z] tests/test_basic_s3.py::test_paginate_max_items
[2019-11-16T09:58:23.025Z] tests/test_basic_s3.py::test_paginate_max_items
[2019-11-16T09:58:23.025Z] tests/test_basic_s3.py::test_paginate_max_items
[2019-11-16T09:58:23.025Z] tests/test_basic_s3.py::test_paginate_max_items
[2019-11-16T09:58:23.025Z] tests/test_basic_s3.py::test_paginate_max_items
[2019-11-16T09:58:23.025Z] tests/test_basic_s3.py::test_paginate_max_items
[2019-11-16T09:58:23.025Z] tests/test_basic_s3.py::test_paginate_max_items
[2019-11-16T09:58:23.025Z] tests/test_basic_s3.py::test_paginate_max_items
[2019-11-16T09:58:23.025Z] tests/test_basic_s3.py::test_paginate_max_items
[2019-11-16T09:58:23.025Z] tests/test_basic_s3.py::test_paginate_max_items
[2019-11-16T09:58:23.025Z] tests/test_basic_s3.py::test_paginate_max_items
[2019-11-16T09:58:23.025Z] tests/test_basic_s3.py::test_paginate_max_items
[2019-11-16T09:58:23.025Z] tests/test_basic_s3.py::test_paginate_max_items
[2019-11-16T09:58:23.025Z] tests/test_basic_s3.py::test_paginate_within_page_boundaries
[2019-11-16T09:58:23.025Z] tests/test_basic_s3.py::test_paginate_within_page_boundaries
[2019-11-16T09:58:23.025Z] tests/test_basic_s3.py::test_paginate_within_page_boundaries
[2019-11-16T09:58:23.025Z] tests/test_basic_s3.py::test_paginate_within_page_boundaries
[2019-11-16T09:58:23.025Z] tests/test_basic_s3.py::test_paginate_within_page_boundaries
[2019-11-16T09:58:23.025Z] tests/test_basic_s3.py::test_paginate_within_page_boundaries
[2019-11-16T09:58:23.025Z] tests/test_basic_s3.py::test_paginate_within_page_boundaries
[2019-11-16T09:58:23.025Z] tests/test_basic_s3.py::test_paginate_within_page_boundaries
[2019-11-16T09:58:23.025Z] tests/test_basic_s3.py::test_paginate_within_page_boundaries
[2019-11-16T09:58:23.025Z] tests/test_basic_s3.py::test_paginate_within_page_boundaries
[2019-11-16T09:58:23.025Z] tests/test_basic_s3.py::test_paginate_within_page_boundaries
[2019-11-16T09:58:23.025Z] tests/test_basic_s3.py::test_paginate_within_page_boundaries
[2019-11-16T09:58:23.025Z] tests/test_basic_s3.py::test_paginate_within_page_boundaries
[2019-11-16T09:58:23.025Z] tests/test_basic_s3.py::test_paginate_within_page_boundaries
[2019-11-16T09:58:23.025Z] tests/test_basic_s3.py::test_paginate_within_page_boundaries
[2019-11-16T09:58:23.025Z] tests/test_basic_s3.py::test_paginate_within_page_boundaries
[2019-11-16T09:58:23.025Z] tests/test_basic_s3.py::test_non_normalized_key_paths
[2019-11-16T09:58:23.025Z] tests/test_basic_s3.py::test_non_normalized_key_paths
[2019-11-16T09:58:23.025Z] tests/test_basic_s3.py::test_non_normalized_key_paths
[2019-11-16T09:58:23.025Z] tests/test_basic_s3.py::test_non_normalized_key_paths
[2019-11-16T09:58:23.025Z] tests/test_basic_s3.py::test_non_normalized_key_paths
[2019-11-16T09:58:23.025Z] tests/test_basic_s3.py::test_non_normalized_key_paths
[2019-11-16T09:58:23.025Z] tests/test_basic_s3.py::test_non_normalized_key_paths
[2019-11-16T09:58:23.025Z] tests/test_basic_s3.py::test_copy_with_quoted_char
[2019-11-16T09:58:23.025Z] tests/test_basic_s3.py::test_copy_with_quoted_char
[2019-11-16T09:58:23.025Z] tests/test_basic_s3.py::test_copy_with_quoted_char
[2019-11-16T09:58:23.025Z] tests/test_basic_s3.py::test_copy_with_quoted_char
[2019-11-16T09:58:23.025Z] tests/test_basic_s3.py::test_copy_with_quoted_char
[2019-11-16T09:58:23.025Z] tests/test_basic_s3.py::test_copy_with_quoted_char
[2019-11-16T09:58:23.025Z] tests/test_basic_s3.py::test_copy_with_quoted_char
[2019-11-16T09:58:23.025Z] tests/test_basic_s3.py::test_copy_with_quoted_char
[2019-11-16T09:58:23.025Z] tests/test_basic_s3.py::test_copy_with_quoted_char
[2019-11-16T09:58:23.025Z] tests/test_basic_s3.py::test_copy_with_query_string
[2019-11-16T09:58:23.025Z] tests/test_basic_s3.py::test_copy_with_query_string
[2019-11-16T09:58:23.025Z] tests/test_basic_s3.py::test_copy_with_query_string
[2019-11-16T09:58:23.025Z] tests/test_basic_s3.py::test_copy_with_query_string
[2019-11-16T09:58:23.025Z] tests/test_basic_s3.py::test_copy_with_query_string
[2019-11-16T09:58:23.025Z] tests/test_basic_s3.py::test_copy_with_query_string
[2019-11-16T09:58:23.025Z] tests/test_basic_s3.py::test_copy_with_query_string
[2019-11-16T09:58:23.025Z] tests/test_basic_s3.py::test_can_copy_with_dict_form
[2019-11-16T09:58:23.025Z] tests/test_basic_s3.py::test_can_copy_with_dict_form
[2019-11-16T09:58:23.025Z] tests/test_basic_s3.py::test_can_copy_with_dict_form
[2019-11-16T09:58:23.025Z] tests/test_basic_s3.py::test_can_copy_with_dict_form
[2019-11-16T09:58:23.025Z] tests/test_basic_s3.py::test_can_copy_with_dict_form
[2019-11-16T09:58:23.025Z] tests/test_basic_s3.py::test_can_copy_with_dict_form
[2019-11-16T09:58:23.025Z] tests/test_basic_s3.py::test_can_copy_with_dict_form
[2019-11-16T09:58:23.025Z] tests/test_basic_s3.py::test_can_copy_with_dict_form_with_version
[2019-11-16T09:58:23.025Z] tests/test_basic_s3.py::test_can_copy_with_dict_form_with_version
[2019-11-16T09:58:23.025Z] tests/test_basic_s3.py::test_can_copy_with_dict_form_with_version
[2019-11-16T09:58:23.025Z] tests/test_basic_s3.py::test_can_copy_with_dict_form_with_version
[2019-11-16T09:58:23.025Z] tests/test_basic_s3.py::test_can_copy_with_dict_form_with_version
[2019-11-16T09:58:23.025Z] tests/test_basic_s3.py::test_can_copy_with_dict_form_with_version
[2019-11-16T09:58:23.025Z] tests/test_basic_s3.py::test_can_copy_with_dict_form_with_version
[2019-11-16T09:58:23.025Z] tests/test_basic_s3.py::test_copy_with_s3_metadata
[2019-11-16T09:58:23.025Z] tests/test_basic_s3.py::test_copy_with_s3_metadata
[2019-11-16T09:58:23.025Z] tests/test_basic_s3.py::test_copy_with_s3_metadata
[2019-11-16T09:58:23.025Z] tests/test_basic_s3.py::test_copy_with_s3_metadata
[2019-11-16T09:58:23.025Z] tests/test_basic_s3.py::test_copy_with_s3_metadata
[2019-11-16T09:58:23.025Z] tests/test_basic_s3.py::test_copy_with_s3_metadata
[2019-11-16T09:58:23.025Z] tests/test_basic_s3.py::test_copy_with_s3_metadata
[2019-11-16T09:58:23.025Z] tests/test_basic_s3.py::test_copy_with_s3_metadata
[2019-11-16T09:58:23.025Z] tests/test_basic_s3.py::test_head_object_keys[s3v4]
[2019-11-16T09:58:23.025Z] tests/test_basic_s3.py::test_head_object_keys[s3v4]
[2019-11-16T09:58:23.025Z] tests/test_basic_s3.py::test_head_object_keys[s3v4]
[2019-11-16T09:58:23.025Z] tests/test_basic_s3.py::test_head_object_keys[s3v4]
[2019-11-16T09:58:23.025Z] tests/test_basic_s3.py::test_head_object_keys[s3v4]
[2019-11-16T09:58:23.025Z] tests/test_basic_s3.py::test_head_object_keys[s3v4]
[2019-11-16T09:58:23.025Z] tests/test_basic_s3.py::test_head_object_keys[s3v4]
[2019-11-16T09:58:23.025Z] tests/test_config.py::test_connector_timeout
[2019-11-16T09:58:23.025Z] tests/test_config.py::test_connector_timeout
[2019-11-16T09:58:23.025Z] tests/test_config.py::test_connector_timeout
[2019-11-16T09:58:23.025Z] tests/test_config.py::test_connector_timeout2
[2019-11-16T09:58:23.025Z] tests/test_config.py::test_connector_timeout2
[2019-11-16T09:58:23.025Z] tests/test_config.py::test_connector_timeout2
[2019-11-16T09:58:23.025Z] tests/test_dynamodb.py::test_get_item[v4]
[2019-11-16T09:58:23.025Z] tests/test_dynamodb.py::test_get_item[v4]
[2019-11-16T09:58:23.025Z] tests/test_dynamodb.py::test_get_item[v4]
[2019-11-16T09:58:23.025Z] tests/test_dynamodb.py::test_get_item[v4]
[2019-11-16T09:58:23.025Z] tests/test_dynamodb.py::test_get_item[v4]
[2019-11-16T09:58:23.025Z] tests/test_dynamodb.py::test_create_waiter[v4]
[2019-11-16T09:58:23.025Z] tests/test_dynamodb.py::test_create_waiter[v4]
[2019-11-16T09:58:23.026Z] tests/test_dynamodb.py::test_create_waiter[v4]
[2019-11-16T09:58:23.026Z] tests/test_dynamodb.py::test_batch_write_scan[v4]
[2019-11-16T09:58:23.026Z] tests/test_dynamodb.py::test_batch_write_scan[v4]
[2019-11-16T09:58:23.026Z] tests/test_dynamodb.py::test_batch_write_scan[v4]
[2019-11-16T09:58:23.026Z] tests/test_dynamodb.py::test_batch_write_scan[v4]
[2019-11-16T09:58:23.026Z] tests/test_dynamodb.py::test_batch_write_scan[v4]
[2019-11-16T09:58:23.026Z] tests/test_dynamodb.py::test_delete_table[v4]
[2019-11-16T09:58:23.026Z] tests/test_dynamodb.py::test_delete_table[v4]
[2019-11-16T09:58:23.026Z] tests/test_dynamodb.py::test_delete_table[v4]
[2019-11-16T09:58:23.026Z] tests/test_dynamodb.py::test_delete_table[v4]
[2019-11-16T09:58:23.026Z] tests/test_dynamodb.py::test_waiter_table_exists_failure[v4]
[2019-11-16T09:58:23.026Z] tests/test_dynamodb.py::test_waiter_table_exists[v4]
[2019-11-16T09:58:23.026Z] tests/test_dynamodb.py::test_waiter_table_exists[v4]
[2019-11-16T09:58:23.026Z] tests/test_dynamodb.py::test_waiter_table_exists[v4]
[2019-11-16T09:58:23.026Z] tests/test_dynamodb.py::test_waiter_table_exists[v4]
[2019-11-16T09:58:23.026Z] tests/test_monitor.py::test_monitor_response_received
[2019-11-16T09:58:23.026Z] tests/test_sns.py::test_topic_attributes
[2019-11-16T09:58:23.026Z] tests/test_sns.py::test_topic_attributes
[2019-11-16T09:58:23.026Z] tests/test_sns.py::test_topic_attributes
[2019-11-16T09:58:23.026Z] tests/test_sns.py::test_topic_attributes
[2019-11-16T09:58:23.026Z] tests/test_sns.py::test_topic_attributes
[2019-11-16T09:58:23.026Z] tests/test_sns.py::test_topic_attributes
[2019-11-16T09:58:23.026Z] tests/test_sns.py::test_creating_subscription
[2019-11-16T09:58:23.026Z] tests/test_sns.py::test_creating_subscription
[2019-11-16T09:58:23.026Z] tests/test_sns.py::test_creating_subscription
[2019-11-16T09:58:23.026Z] tests/test_sns.py::test_creating_subscription
[2019-11-16T09:58:23.026Z] tests/test_sns.py::test_creating_subscription
[2019-11-16T09:58:23.026Z] tests/test_sns.py::test_creating_subscription
[2019-11-16T09:58:23.026Z] tests/test_sns.py::test_publish_to_http
[2019-11-16T09:58:23.026Z] tests/test_sns.py::test_publish_to_http
[2019-11-16T09:58:23.026Z] tests/test_sns.py::test_publish_to_http
[2019-11-16T09:58:23.026Z] tests/test_sns.py::test_publish_to_http
[2019-11-16T09:58:23.026Z] tests/test_sns.py::test_publish_to_http
[2019-11-16T09:58:23.026Z] tests/test_sns.py::test_get_missing_endpoint_attributes
[2019-11-16T09:58:23.026Z] tests/test_sns.py::test_platform_applications
[2019-11-16T09:58:23.026Z] tests/test_sns.py::test_platform_applications
[2019-11-16T09:58:23.026Z] tests/test_sns.py::test_platform_applications
[2019-11-16T09:58:23.026Z] tests/test_sqs.py::test_list_queues
[2019-11-16T09:58:23.026Z] tests/test_sqs.py::test_list_queues
[2019-11-16T09:58:23.026Z] tests/test_sqs.py::test_list_queues
[2019-11-16T09:58:23.026Z] tests/test_sqs.py::test_get_queue_name
[2019-11-16T09:58:23.026Z] tests/test_sqs.py::test_get_queue_name
[2019-11-16T09:58:23.026Z] tests/test_sqs.py::test_get_queue_name
[2019-11-16T09:58:23.026Z] tests/test_sqs.py::test_put_pull_delete_test
[2019-11-16T09:58:23.026Z] tests/test_sqs.py::test_put_pull_delete_test
[2019-11-16T09:58:23.026Z] tests/test_sqs.py::test_put_pull_delete_test
[2019-11-16T09:58:23.026Z] tests/test_sqs.py::test_put_pull_delete_test
[2019-11-16T09:58:23.026Z] tests/test_sqs.py::test_put_pull_delete_test
[2019-11-16T09:58:23.026Z] tests/test_sqs.py::test_put_pull_delete_test
[2019-11-16T09:58:23.026Z] tests/test_sqs.py::test_put_pull_wait
[2019-11-16T09:58:23.026Z] tests/test_sqs.py::test_put_pull_wait
[2019-11-16T09:58:23.026Z] tests/test_sqs.py::test_put_pull_wait
[2019-11-16T09:58:23.026Z] tests/test_waiter.py::test_sqs
[2019-11-16T09:58:23.026Z] tests/test_waiter.py::test_sqs
[2019-11-16T09:58:23.026Z]   /usr/lib/python3.8/site-packages/aiohttp/connector.py:964: DeprecationWarning: The loop argument is deprecated since Python 3.8, and scheduled for removal in Python 3.10.
[2019-11-16T09:58:23.026Z]     hosts = await asyncio.shield(self._resolve_host(
[2019-11-16T09:58:23.026Z] 
[2019-11-16T09:58:23.026Z] tests/test_basic_s3.py::test_can_make_request
[2019-11-16T09:58:23.026Z] tests/test_basic_s3.py::test_fail_proxy_request
[2019-11-16T09:58:23.026Z] tests/test_basic_s3.py::test_can_get_bucket_location
[2019-11-16T09:58:23.026Z] tests/test_basic_s3.py::test_can_delete_urlencoded_object
[2019-11-16T09:58:23.026Z] tests/test_basic_s3.py::test_can_paginate
[2019-11-16T09:58:23.026Z] tests/test_basic_s3.py::test_can_paginate_with_page_size
[2019-11-16T09:58:23.026Z] tests/test_basic_s3.py::test_can_paginate_iterator
[2019-11-16T09:58:23.026Z] tests/test_basic_s3.py::test_result_key_iters
[2019-11-16T09:58:23.026Z] tests/test_basic_s3.py::test_can_get_and_put_object
[2019-11-16T09:58:23.026Z] tests/test_basic_s3.py::test_get_object_stream_wrapper
[2019-11-16T09:58:23.026Z] tests/test_basic_s3.py::test_get_object_stream_context
[2019-11-16T09:58:23.026Z] tests/test_basic_s3.py::test_paginate_max_items
[2019-11-16T09:58:23.026Z] tests/test_basic_s3.py::test_paginate_within_page_boundaries
[2019-11-16T09:58:23.026Z] tests/test_basic_s3.py::test_non_normalized_key_paths
[2019-11-16T09:58:23.026Z] tests/test_basic_s3.py::test_copy_with_quoted_char
[2019-11-16T09:58:23.026Z] tests/test_basic_s3.py::test_copy_with_query_string
[2019-11-16T09:58:23.026Z] tests/test_basic_s3.py::test_can_copy_with_dict_form
[2019-11-16T09:58:23.026Z] tests/test_basic_s3.py::test_can_copy_with_dict_form_with_version
[2019-11-16T09:58:23.026Z] tests/test_basic_s3.py::test_copy_with_s3_metadata
[2019-11-16T09:58:23.026Z] tests/test_basic_s3.py::test_head_object_keys[s3v4]
[2019-11-16T09:58:23.026Z] tests/test_config.py::test_connector_timeout
[2019-11-16T09:58:23.026Z] tests/test_config.py::test_connector_timeout
[2019-11-16T09:58:23.026Z] tests/test_config.py::test_connector_timeout2
[2019-11-16T09:58:23.026Z] tests/test_config.py::test_connector_timeout2
[2019-11-16T09:58:23.026Z] tests/test_dynamodb.py::test_get_item[v4]
[2019-11-16T09:58:23.026Z] tests/test_dynamodb.py::test_create_waiter[v4]
[2019-11-16T09:58:23.026Z] tests/test_dynamodb.py::test_batch_write_scan[v4]
[2019-11-16T09:58:23.026Z] tests/test_dynamodb.py::test_delete_table[v4]
[2019-11-16T09:58:23.026Z] tests/test_dynamodb.py::test_waiter_table_exists_failure[v4]
[2019-11-16T09:58:23.026Z] tests/test_dynamodb.py::test_waiter_table_exists[v4]
[2019-11-16T09:58:23.026Z] tests/test_monitor.py::test_monitor_response_received
[2019-11-16T09:58:23.026Z] tests/test_sns.py::test_topic_attributes
[2019-11-16T09:58:23.026Z] tests/test_sns.py::test_creating_subscription
[2019-11-16T09:58:23.026Z] tests/test_sns.py::test_publish_to_http
[2019-11-16T09:58:23.026Z] tests/test_sns.py::test_get_missing_endpoint_attributes
[2019-11-16T09:58:23.026Z] tests/test_sns.py::test_platform_applications
[2019-11-16T09:58:23.026Z] tests/test_sqs.py::test_list_queues
[2019-11-16T09:58:23.026Z] tests/test_sqs.py::test_get_queue_name
[2019-11-16T09:58:23.026Z] tests/test_sqs.py::test_put_pull_delete_test
[2019-11-16T09:58:23.026Z] tests/test_sqs.py::test_put_pull_wait
[2019-11-16T09:58:23.026Z] tests/test_waiter.py::test_sqs
[2019-11-16T09:58:23.026Z]   /usr/lib/python3.8/site-packages/aiohttp/locks.py:21: DeprecationWarning: The loop argument is deprecated since Python 3.8, and scheduled for removal in Python 3.10.
[2019-11-16T09:58:23.026Z]     self._event = asyncio.Event(loop=loop)
[2019-11-16T09:58:23.026Z] 
[2019-11-16T09:58:23.026Z] tests/test_basic_s3.py::test_fail_proxy_request
[2019-11-16T09:58:23.026Z] tests/test_basic_s3.py::test_fail_proxy_request
[2019-11-16T09:58:23.026Z] tests/test_basic_s3.py::test_fail_proxy_request
[2019-11-16T09:58:23.026Z] tests/test_basic_s3.py::test_fail_proxy_request
[2019-11-16T09:58:23.026Z]   /build/python-aiobotocore/src/aiobotocore-0.11.0/build/lib/aiobotocore/endpoint.py:187: DeprecationWarning: The loop argument is deprecated since Python 3.8, and scheduled for removal in Python 3.10.
[2019-11-16T09:58:23.026Z]     await asyncio.sleep(handler_response, loop=self._loop)
[2019-11-16T09:58:23.026Z] 
[2019-11-16T09:58:23.026Z] tests/test_basic_s3.py::test_can_paginate
[2019-11-16T09:58:23.026Z] tests/test_basic_s3.py::test_can_paginate_with_page_size
[2019-11-16T09:58:23.026Z]   /build/python-aiobotocore/src/aiobotocore-0.11.0/build/lib/aiobotocore/paginate.py:44: DeprecationWarning: next_page is deprecated, use async for instead
[2019-11-16T09:58:23.026Z]     warnings.warn("next_page is deprecated, use async for instead",
[2019-11-16T09:58:23.026Z] 
[2019-11-16T09:58:23.026Z] tests/test_config.py::test_connector_timeout
[2019-11-16T09:58:23.026Z]   /build/python-aiobotocore/src/aiobotocore-0.11.0/tests/test_config.py:67: DeprecationWarning: The loop argument is deprecated since Python 3.8, and scheduled for removal in Python 3.10.
[2019-11-16T09:58:23.026Z]     done, pending = await asyncio.wait([task1, task2],
[2019-11-16T09:58:23.026Z] 
[2019-11-16T09:58:23.026Z] tests/test_dynamodb.py::test_waiter_table_exists[v4]
[2019-11-16T09:58:23.026Z]   /build/python-aiobotocore/src/aiobotocore-0.11.0/tests/test_dynamodb.py:147: DeprecationWarning: The loop argument is deprecated since Python 3.8, and scheduled for removal in Python 3.10.
[2019-11-16T09:58:23.026Z]     await asyncio.sleep(2, loop=event_loop)
[2019-11-16T09:58:23.026Z] 
[2019-11-16T09:58:23.026Z] tests/test_dynamodb.py::test_waiter_table_exists[v4]
[2019-11-16T09:58:23.026Z] tests/test_dynamodb.py::test_waiter_table_exists[v4]
[2019-11-16T09:58:23.026Z]   /build/python-aiobotocore/src/aiobotocore-0.11.0/build/lib/aiobotocore/waiter.py:71: DeprecationWarning: The loop argument is deprecated since Python 3.8, and scheduled for removal in Python 3.10.
[2019-11-16T09:58:23.026Z]     await asyncio.sleep(sleep_amount, loop=self._loop)
[2019-11-16T09:58:23.026Z] 
[2019-11-16T09:58:23.026Z] -- Docs: https://docs.pytest.org/en/latest/warnings.html
[2019-11-16T09:58:23.026Z] ========== 3 failed, 52 passed, 8 deselected, 329 warnings in 34.03s ===========
[2019-11-16T09:58:23.026Z] ==> ERROR: A failure occurred in check().
[2019-11-16T09:58:23.026Z]     Aborting...
[2019-11-16T09:58:23.937Z] ==> ERROR: Build failed, check /build/buildpkg/default-x86_64/jenkins/build
[Pipeline] }
[Pipeline] // dir
Post stage
[Pipeline] emailext
[2019-11-16T09:58:24.030Z] Sending email to: artix-build-failures at artixlinux.org


More information about the artix-build-failures mailing list