[artix-build-failures] [goblins] Failure: python-rdflib

jenkins at artixlinux.org jenkins at artixlinux.org
Mon Nov 4 16:43:07 CET 2019


   Failure

   Build: repos/staging-any

   Packages:

   [python-rdflib-4.2.2-3-any.pkg.tar.xz]

   authorName: artoo

   authorEmail: artoo at artixlinux.org

   [1]https://orion.artixlinux.org/job/packagesPython/job/python-rdflib/jo
   b/master/3/

References

   1. https://orion.artixlinux.org/job/packagesPython/job/python-rdflib/job/master/3/
-------------- next part --------------
Push event to branch master
Querying the current revision of branch master...
Current revision of branch master is 5849b681fa74884fae3769449aaba24cb5e7ca2a
Obtained Jenkinsfile from 5849b681fa74884fae3769449aaba24cb5e7ca2a
Running in Durability level: PERFORMANCE_OPTIMIZED
Loading library artix-ci at master
Attempting to resolve master from remote references...
 > git --version # timeout=10
 > git ls-remote -- https://gitea.artixlinux.org/artix/pipeline-libs.git # timeout=10
Found match: refs/heads/master revision 77f77ff85eedb6eb60b64faf8c328ab86dbb479c
Warning: CredentialId "gitea-ci" could not be found.
 > git rev-parse --is-inside-work-tree # timeout=10
Fetching changes from the remote Git repository
 > git config remote.origin.url https://gitea.artixlinux.org/artix/pipeline-libs.git # timeout=10
Fetching without tags
Fetching upstream changes from https://gitea.artixlinux.org/artix/pipeline-libs.git
 > git --version # timeout=10
 > git fetch --no-tags --force --progress -- https://gitea.artixlinux.org/artix/pipeline-libs.git +refs/heads/master:refs/remotes/origin/master # timeout=10
Checking out Revision 77f77ff85eedb6eb60b64faf8c328ab86dbb479c (master)
 > git config core.sparsecheckout # timeout=10
 > git checkout -f 77f77ff85eedb6eb60b64faf8c328ab86dbb479c # timeout=10
Commit message: "Notify: remove fail condition"
[Gitea] Notifying branch build status: PENDING Build started...
[Gitea] Notified
[Pipeline] Start of Pipeline
[Pipeline] node
Still waiting to schedule task
Waiting for next available executor
Running on Jenkins in /build/jenkins/workspace/kagesPython_python-rdflib_master
[Pipeline] {
[Pipeline] timestamps
[Pipeline] {
[Pipeline] stage
[Pipeline] { (Prepare)
[Pipeline] checkout
[2019-11-04T15:41:55.633Z] Warning: CredentialId "jenkins-ci" could not be found.
[2019-11-04T15:41:55.634Z]  > git rev-parse --is-inside-work-tree # timeout=10
[2019-11-04T15:41:55.639Z] Fetching changes from the remote Git repository
[2019-11-04T15:41:55.640Z]  > git config remote.origin.url https://237b7412742b4068af4173944de150f12959f4d3@gitea.artixlinux.org/packagesPython/python-rdflib.git # timeout=10
[2019-11-04T15:41:55.646Z] Cleaning workspace
[2019-11-04T15:41:55.646Z]  > git rev-parse --verify HEAD # timeout=10
[2019-11-04T15:41:55.652Z] Resetting working tree
[2019-11-04T15:41:55.652Z]  > git reset --hard # timeout=10
[2019-11-04T15:41:55.658Z]  > git clean -fdx # timeout=10
[2019-11-04T15:41:55.663Z] Fetching without tags
[2019-11-04T15:41:55.663Z] Fetching upstream changes from https://237b7412742b4068af4173944de150f12959f4d3@gitea.artixlinux.org/packagesPython/python-rdflib.git
[2019-11-04T15:41:55.663Z]  > git --version # timeout=10
[2019-11-04T15:41:55.668Z]  > git fetch --no-tags --force --progress -- https://237b7412742b4068af4173944de150f12959f4d3@gitea.artixlinux.org/packagesPython/python-rdflib.git +refs/heads/master:refs/remotes/origin/master # timeout=10
[2019-11-04T15:41:55.900Z] Checking out Revision 5849b681fa74884fae3769449aaba24cb5e7ca2a (master)
[2019-11-04T15:41:55.900Z]  > git config core.sparsecheckout # timeout=10
[2019-11-04T15:41:55.906Z]  > git checkout -f 5849b681fa74884fae3769449aaba24cb5e7ca2a # timeout=10
[2019-11-04T15:41:55.916Z] Commit message: "[trunk] -> [staging] 'python-rdflib-4.2.2-3' add"
[2019-11-04T15:41:55.916Z]  > git rev-list --no-walk 60b67b77e0426e123ed328c2c27e9f29355bcee6 # timeout=10
[2019-11-04T15:41:55.928Z] [Gitea] Notifying branch build status: PENDING Build started...
[2019-11-04T15:41:56.073Z] [Gitea] Notified
[Pipeline] libraryResource
[Pipeline] readYaml
[Pipeline] sh
[2019-11-04T15:41:56.343Z] + git rev-parse @
[Pipeline] sh
[2019-11-04T15:41:56.601Z] + git show -s --format=%an 5849b681fa74884fae3769449aaba24cb5e7ca2a
[Pipeline] sh
[2019-11-04T15:41:56.859Z] + git show -s --format=%ae 5849b681fa74884fae3769449aaba24cb5e7ca2a
[Pipeline] sh
[2019-11-04T15:41:57.116Z] + git show --pretty=format: --name-status 5849b681fa74884fae3769449aaba24cb5e7ca2a
[Pipeline] fileExists
[Pipeline] sh
[2019-11-04T15:41:57.384Z] + pkg2yaml repos/staging-any
[Pipeline] readYaml
[Pipeline] }
[Pipeline] // stage
[Pipeline] stage
[Pipeline] { (Build)
[Pipeline] input
[2019-11-04T15:41:57.466Z] Input requested
[2019-11-04T15:42:06.891Z] Approved by artoo
[Pipeline] echo
[2019-11-04T15:42:06.963Z] isRebuild: false
[Pipeline] dir
[2019-11-04T15:42:06.972Z] Running in /build/jenkins/workspace/kagesPython_python-rdflib_master/repos/staging-any
[Pipeline] {
[Pipeline] sh
[2019-11-04T15:42:07.237Z] + buildpkg-goblins
[2019-11-04T15:42:09.098Z] :: Synchronizing package databases...
[2019-11-04T15:42:09.098Z]  goblins is up to date
[2019-11-04T15:42:09.098Z]  gremlins is up to date
[2019-11-04T15:42:09.098Z]  system is up to date
[2019-11-04T15:42:09.098Z]  world is up to date
[2019-11-04T15:42:09.098Z] downloading galaxy-goblins.db...
[2019-11-04T15:42:09.098Z]  galaxy-gremlins is up to date
[2019-11-04T15:42:09.098Z]  galaxy is up to date
[2019-11-04T15:42:09.098Z]  staging is up to date
[2019-11-04T15:42:09.098Z]  testing is up to date
[2019-11-04T15:42:09.098Z]  extra is up to date
[2019-11-04T15:42:09.098Z]  community-staging is up to date
[2019-11-04T15:42:09.098Z]  community-testing is up to date
[2019-11-04T15:42:09.098Z]  community is up to date
[2019-11-04T15:42:09.098Z] :: Starting full system upgrade...
[2019-11-04T15:42:09.098Z]  there is nothing to do
[2019-11-04T15:42:09.648Z] ==> Building in chroot for [goblins] (x86_64)...
[2019-11-04T15:42:10.449Z] ==> Synchronizing chroot copy [/build/buildpkg/goblins-x86_64/root] -> [jenkins]...done
[2019-11-04T15:42:10.699Z] ==> WARNING: PACKAGER should have the format 'Example Name <email at address.invalid>'
[2019-11-04T15:42:11.250Z] ==> Making package: python-rdflib 4.2.2-3 (Mon Nov  4 16:42:11 2019)
[2019-11-04T15:42:11.250Z] ==> Retrieving sources...
[2019-11-04T15:42:11.250Z]   -> Downloading rdflib-4.2.2.tar.gz...
[2019-11-04T15:42:11.250Z]   % Total    % Received % Xferd  Average Speed   Time    Time     Time  Current
[2019-11-04T15:42:11.250Z]                                  Dload  Upload   Total   Spent    Left  Speed
[2019-11-04T15:42:11.500Z] 
  0     0    0     0    0     0      0      0 --:--:-- --:--:-- --:--:--     0
100   127    0   127    0     0    549      0 --:--:-- --:--:-- --:--:--   552
[2019-11-04T15:42:12.301Z] 
  0     0    0     0    0     0      0      0 --:--:-- --:--:-- --:--:--     0
100  907k    0  907k    0     0   722k      0 --:--:--  0:00:01 --:--:-- 1155k
[2019-11-04T15:42:12.551Z]   -> Found py3.7.diff
[2019-11-04T15:42:12.551Z] ==> Validating source files with sha1sums...
[2019-11-04T15:42:12.551Z]     rdflib-4.2.2.tar.gz ... Passed
[2019-11-04T15:42:12.551Z]     py3.7.diff ... Passed
[2019-11-04T15:42:15.779Z] ==> Making package: python-rdflib 4.2.2-3 (Mon 04 Nov 2019 04:42:15 PM CET)
[2019-11-04T15:42:15.779Z] ==> Checking runtime dependencies...
[2019-11-04T15:42:15.779Z] ==> Installing missing dependencies...
[2019-11-04T15:42:15.779Z] resolving dependencies...
[2019-11-04T15:42:15.779Z] looking for conflicting packages...
[2019-11-04T15:42:15.779Z] 
[2019-11-04T15:42:15.779Z] Package (4)                    New Version  Net Change  Download Size
[2019-11-04T15:42:15.779Z] 
[2019-11-04T15:42:15.779Z] system/libnsl                  1.2.0-1        0.21 MiB               
[2019-11-04T15:42:15.779Z] goblins/python                 3.8.0-1      151.60 MiB               
[2019-11-04T15:42:15.779Z] goblins/python-six             1.12.0-4       0.08 MiB               
[2019-11-04T15:42:15.779Z] galaxy-goblins/python-isodate  0.6.0-5        0.26 MiB       0.04 MiB
[2019-11-04T15:42:15.779Z] 
[2019-11-04T15:42:15.779Z] Total Download Size:     0.04 MiB
[2019-11-04T15:42:15.779Z] Total Installed Size:  152.16 MiB
[2019-11-04T15:42:15.779Z] 
[2019-11-04T15:42:15.779Z] :: Proceed with installation? [Y/n] 
[2019-11-04T15:42:15.779Z] :: Retrieving packages...
[2019-11-04T15:42:15.779Z] downloading python-isodate-0.6.0-5-any.pkg.tar.xz...
[2019-11-04T15:42:15.779Z] checking keyring...
[2019-11-04T15:42:15.779Z] checking package integrity...
[2019-11-04T15:42:16.029Z] loading package files...
[2019-11-04T15:42:16.029Z] checking for file conflicts...
[2019-11-04T15:42:16.029Z] checking available disk space...
[2019-11-04T15:42:16.029Z] :: Processing package changes...
[2019-11-04T15:42:16.029Z] installing libnsl...
[2019-11-04T15:42:16.029Z] installing python...
[2019-11-04T15:42:19.257Z] Optional dependencies for python
[2019-11-04T15:42:19.257Z]     python-setuptools
[2019-11-04T15:42:19.257Z]     python-pip
[2019-11-04T15:42:19.257Z]     sqlite [installed]
[2019-11-04T15:42:19.257Z]     mpdecimal: for decimal
[2019-11-04T15:42:19.257Z]     xz: for lzma [installed]
[2019-11-04T15:42:19.257Z]     tk: for tkinter
[2019-11-04T15:42:19.257Z] installing python-six...
[2019-11-04T15:42:19.257Z] installing python-isodate...
[2019-11-04T15:42:19.507Z] ==> Checking buildtime dependencies...
[2019-11-04T15:42:19.507Z] ==> Installing missing dependencies...
[2019-11-04T15:42:19.758Z] resolving dependencies...
[2019-11-04T15:42:19.758Z] looking for conflicting packages...
[2019-11-04T15:42:19.758Z] 
[2019-11-04T15:42:19.758Z] Package (10)                        New Version  Net Change  Download Size
[2019-11-04T15:42:19.758Z] 
[2019-11-04T15:42:19.758Z] goblins/python-appdirs              1.4.3-5        0.07 MiB               
[2019-11-04T15:42:19.758Z] goblins/python-packaging            19.2-5         0.14 MiB               
[2019-11-04T15:42:19.758Z] galaxy-goblins/python-webencodings  0.5.1-4        0.06 MiB               
[2019-11-04T15:42:19.758Z] galaxy-goblins/python-decorator     4.4.0-3        0.05 MiB               
[2019-11-04T15:42:19.758Z] galaxy-goblins/python-html5lib      1.0.1-6        1.18 MiB               
[2019-11-04T15:42:19.758Z] galaxy-goblins/python-networkx      2.4-3         12.47 MiB       1.81 MiB
[2019-11-04T15:42:19.758Z] goblins/python-nose                 1.3.7-6        0.87 MiB               
[2019-11-04T15:42:19.758Z] goblins/python-pyparsing            2.4.2-4        0.70 MiB               
[2019-11-04T15:42:19.758Z] goblins/python-setuptools           1:41.2.0-5     1.54 MiB               
[2019-11-04T15:42:19.758Z] galaxy/python-sparqlwrapper         1.8.4-1        0.22 MiB       0.04 MiB
[2019-11-04T15:42:19.758Z] 
[2019-11-04T15:42:19.758Z] Total Download Size:    1.84 MiB
[2019-11-04T15:42:19.758Z] Total Installed Size:  17.30 MiB
[2019-11-04T15:42:19.758Z] 
[2019-11-04T15:42:19.758Z] :: Proceed with installation? [Y/n] 
[2019-11-04T15:42:19.758Z] :: Retrieving packages...
[2019-11-04T15:42:19.758Z] downloading python-networkx-2.4-3-any.pkg.tar.xz...
[2019-11-04T15:42:19.758Z] downloading python-sparqlwrapper-1.8.4-1-any.pkg.tar.xz...
[2019-11-04T15:42:19.758Z] checking keyring...
[2019-11-04T15:42:19.758Z] checking package integrity...
[2019-11-04T15:42:20.308Z] loading package files...
[2019-11-04T15:42:20.308Z] checking for file conflicts...
[2019-11-04T15:42:20.308Z] checking available disk space...
[2019-11-04T15:42:20.308Z] :: Processing package changes...
[2019-11-04T15:42:20.308Z] installing python-appdirs...
[2019-11-04T15:42:20.308Z] installing python-pyparsing...
[2019-11-04T15:42:20.308Z] installing python-packaging...
[2019-11-04T15:42:20.308Z] installing python-setuptools...
[2019-11-04T15:42:20.308Z] installing python-nose...
[2019-11-04T15:42:20.308Z] installing python-webencodings...
[2019-11-04T15:42:20.308Z] installing python-html5lib...
[2019-11-04T15:42:20.308Z] Optional dependencies for python-html5lib
[2019-11-04T15:42:20.308Z]     python-lxml: lxml treebuilder
[2019-11-04T15:42:20.308Z]     python-genshi: genshi treewalker
[2019-11-04T15:42:20.308Z] installing python-sparqlwrapper...
[2019-11-04T15:42:20.308Z] installing python-decorator...
[2019-11-04T15:42:20.308Z] installing python-networkx...
[2019-11-04T15:42:20.559Z] Optional dependencies for python-networkx
[2019-11-04T15:42:20.559Z]     python-numpy: Provides sparse matrix representation of graphs and many numerical scientific tools.
[2019-11-04T15:42:20.559Z]     python-scipy: Provides flexible drawing of graphs.
[2019-11-04T15:42:20.559Z]     python-pyparsing: Required for pydot, GML file reading. [installed]
[2019-11-04T15:42:20.559Z]     python-yaml: Required for YAML format reading and writing.
[2019-11-04T15:42:20.559Z] ==> Retrieving sources...
[2019-11-04T15:42:20.559Z]   -> Found rdflib-4.2.2.tar.gz
[2019-11-04T15:42:20.809Z]   -> Found py3.7.diff
[2019-11-04T15:42:20.809Z] ==> WARNING: Skipping all source file integrity checks.
[2019-11-04T15:42:20.809Z] ==> Extracting sources...
[2019-11-04T15:42:20.809Z]   -> Extracting rdflib-4.2.2.tar.gz with bsdtar
[2019-11-04T15:42:21.059Z] ==> Starting prepare()...
[2019-11-04T15:42:21.059Z] patching file rdflib/plugins/sparql/evaluate.py
[2019-11-04T15:42:21.059Z] ==> Starting build()...
[2019-11-04T15:42:21.310Z] no previously-included directories found matching 'docs/_build'
[2019-11-04T15:42:21.310Z] warning: no previously-included files matching '*.pyc' found anywhere in distribution
[2019-11-04T15:42:21.310Z] warning: no previously-included files matching '*$py.class' found anywhere in distribution
[2019-11-04T15:42:39.270Z] running build
[2019-11-04T15:42:39.270Z] running build_py
[2019-11-04T15:42:39.270Z] creating build/lib
[2019-11-04T15:42:39.270Z] creating build/lib/rdflib
[2019-11-04T15:42:39.270Z] copying build/src/rdflib/exceptions.py -> build/lib/rdflib
[2019-11-04T15:42:39.270Z] copying build/src/rdflib/paths.py -> build/lib/rdflib
[2019-11-04T15:42:39.270Z] copying build/src/rdflib/util.py -> build/lib/rdflib
[2019-11-04T15:42:39.270Z] copying build/src/rdflib/void.py -> build/lib/rdflib
[2019-11-04T15:42:39.270Z] copying build/src/rdflib/collection.py -> build/lib/rdflib
[2019-11-04T15:42:39.270Z] copying build/src/rdflib/__init__.py -> build/lib/rdflib
[2019-11-04T15:42:39.270Z] copying build/src/rdflib/resource.py -> build/lib/rdflib
[2019-11-04T15:42:39.270Z] copying build/src/rdflib/serializer.py -> build/lib/rdflib
[2019-11-04T15:42:39.270Z] copying build/src/rdflib/compat.py -> build/lib/rdflib
[2019-11-04T15:42:39.270Z] copying build/src/rdflib/events.py -> build/lib/rdflib
[2019-11-04T15:42:39.270Z] copying build/src/rdflib/store.py -> build/lib/rdflib
[2019-11-04T15:42:39.270Z] copying build/src/rdflib/graph.py -> build/lib/rdflib
[2019-11-04T15:42:39.270Z] copying build/src/rdflib/term.py -> build/lib/rdflib
[2019-11-04T15:42:39.270Z] copying build/src/rdflib/plugin.py -> build/lib/rdflib
[2019-11-04T15:42:39.270Z] copying build/src/rdflib/parser.py -> build/lib/rdflib
[2019-11-04T15:42:39.270Z] copying build/src/rdflib/py3compat.py -> build/lib/rdflib
[2019-11-04T15:42:39.270Z] copying build/src/rdflib/query.py -> build/lib/rdflib
[2019-11-04T15:42:39.270Z] copying build/src/rdflib/compare.py -> build/lib/rdflib
[2019-11-04T15:42:39.270Z] copying build/src/rdflib/namespace.py -> build/lib/rdflib
[2019-11-04T15:42:39.270Z] creating build/lib/rdflib/plugins
[2019-11-04T15:42:39.270Z] copying build/src/rdflib/plugins/memory.py -> build/lib/rdflib/plugins
[2019-11-04T15:42:39.270Z] copying build/src/rdflib/plugins/sleepycat.py -> build/lib/rdflib/plugins
[2019-11-04T15:42:39.271Z] copying build/src/rdflib/plugins/__init__.py -> build/lib/rdflib/plugins
[2019-11-04T15:42:39.271Z] creating build/lib/rdflib/tools
[2019-11-04T15:42:39.271Z] copying build/src/rdflib/tools/graphisomorphism.py -> build/lib/rdflib/tools
[2019-11-04T15:42:39.271Z] copying build/src/rdflib/tools/rdfs2dot.py -> build/lib/rdflib/tools
[2019-11-04T15:42:39.271Z] copying build/src/rdflib/tools/rdfpipe.py -> build/lib/rdflib/tools
[2019-11-04T15:42:39.271Z] copying build/src/rdflib/tools/__init__.py -> build/lib/rdflib/tools
[2019-11-04T15:42:39.271Z] copying build/src/rdflib/tools/csv2rdf.py -> build/lib/rdflib/tools
[2019-11-04T15:42:39.271Z] copying build/src/rdflib/tools/rdf2dot.py -> build/lib/rdflib/tools
[2019-11-04T15:42:39.271Z] creating build/lib/rdflib/extras
[2019-11-04T15:42:39.271Z] copying build/src/rdflib/extras/describer.py -> build/lib/rdflib/extras
[2019-11-04T15:42:39.271Z] copying build/src/rdflib/extras/cmdlineutils.py -> build/lib/rdflib/extras
[2019-11-04T15:42:39.271Z] copying build/src/rdflib/extras/__init__.py -> build/lib/rdflib/extras
[2019-11-04T15:42:39.271Z] copying build/src/rdflib/extras/external_graph_libs.py -> build/lib/rdflib/extras
[2019-11-04T15:42:39.271Z] copying build/src/rdflib/extras/infixowl.py -> build/lib/rdflib/extras
[2019-11-04T15:42:39.271Z] creating build/lib/rdflib/plugins/stores
[2019-11-04T15:42:39.271Z] copying build/src/rdflib/plugins/stores/auditable.py -> build/lib/rdflib/plugins/stores
[2019-11-04T15:42:39.271Z] copying build/src/rdflib/plugins/stores/sparqlstore.py -> build/lib/rdflib/plugins/stores
[2019-11-04T15:42:39.271Z] copying build/src/rdflib/plugins/stores/__init__.py -> build/lib/rdflib/plugins/stores
[2019-11-04T15:42:39.271Z] copying build/src/rdflib/plugins/stores/concurrent.py -> build/lib/rdflib/plugins/stores
[2019-11-04T15:42:39.271Z] copying build/src/rdflib/plugins/stores/regexmatching.py -> build/lib/rdflib/plugins/stores
[2019-11-04T15:42:39.271Z] creating build/lib/rdflib/plugins/serializers
[2019-11-04T15:42:39.271Z] copying build/src/rdflib/plugins/serializers/trig.py -> build/lib/rdflib/plugins/serializers
[2019-11-04T15:42:39.271Z] copying build/src/rdflib/plugins/serializers/rdfxml.py -> build/lib/rdflib/plugins/serializers
[2019-11-04T15:42:39.271Z] copying build/src/rdflib/plugins/serializers/nt.py -> build/lib/rdflib/plugins/serializers
[2019-11-04T15:42:39.271Z] copying build/src/rdflib/plugins/serializers/trix.py -> build/lib/rdflib/plugins/serializers
[2019-11-04T15:42:39.271Z] copying build/src/rdflib/plugins/serializers/__init__.py -> build/lib/rdflib/plugins/serializers
[2019-11-04T15:42:39.271Z] copying build/src/rdflib/plugins/serializers/nquads.py -> build/lib/rdflib/plugins/serializers
[2019-11-04T15:42:39.271Z] copying build/src/rdflib/plugins/serializers/n3.py -> build/lib/rdflib/plugins/serializers
[2019-11-04T15:42:39.271Z] copying build/src/rdflib/plugins/serializers/turtle.py -> build/lib/rdflib/plugins/serializers
[2019-11-04T15:42:39.271Z] copying build/src/rdflib/plugins/serializers/xmlwriter.py -> build/lib/rdflib/plugins/serializers
[2019-11-04T15:42:39.271Z] creating build/lib/rdflib/plugins/parsers
[2019-11-04T15:42:39.271Z] copying build/src/rdflib/plugins/parsers/trig.py -> build/lib/rdflib/plugins/parsers
[2019-11-04T15:42:39.271Z] copying build/src/rdflib/plugins/parsers/ntriples.py -> build/lib/rdflib/plugins/parsers
[2019-11-04T15:42:39.271Z] copying build/src/rdflib/plugins/parsers/rdfxml.py -> build/lib/rdflib/plugins/parsers
[2019-11-04T15:42:39.271Z] copying build/src/rdflib/plugins/parsers/notation3.py -> build/lib/rdflib/plugins/parsers
[2019-11-04T15:42:39.271Z] copying build/src/rdflib/plugins/parsers/structureddata.py -> build/lib/rdflib/plugins/parsers
[2019-11-04T15:42:39.271Z] copying build/src/rdflib/plugins/parsers/nt.py -> build/lib/rdflib/plugins/parsers
[2019-11-04T15:42:39.271Z] copying build/src/rdflib/plugins/parsers/trix.py -> build/lib/rdflib/plugins/parsers
[2019-11-04T15:42:39.271Z] copying build/src/rdflib/plugins/parsers/__init__.py -> build/lib/rdflib/plugins/parsers
[2019-11-04T15:42:39.271Z] copying build/src/rdflib/plugins/parsers/nquads.py -> build/lib/rdflib/plugins/parsers
[2019-11-04T15:42:39.271Z] copying build/src/rdflib/plugins/parsers/hturtle.py -> build/lib/rdflib/plugins/parsers
[2019-11-04T15:42:39.271Z] creating build/lib/rdflib/plugins/sparql
[2019-11-04T15:42:39.271Z] copying build/src/rdflib/plugins/sparql/evaluate.py -> build/lib/rdflib/plugins/sparql
[2019-11-04T15:42:39.271Z] copying build/src/rdflib/plugins/sparql/evalutils.py -> build/lib/rdflib/plugins/sparql
[2019-11-04T15:42:39.271Z] copying build/src/rdflib/plugins/sparql/aggregates.py -> build/lib/rdflib/plugins/sparql
[2019-11-04T15:42:39.271Z] copying build/src/rdflib/plugins/sparql/datatypes.py -> build/lib/rdflib/plugins/sparql
[2019-11-04T15:42:39.271Z] copying build/src/rdflib/plugins/sparql/__init__.py -> build/lib/rdflib/plugins/sparql
[2019-11-04T15:42:39.271Z] copying build/src/rdflib/plugins/sparql/operators.py -> build/lib/rdflib/plugins/sparql
[2019-11-04T15:42:39.271Z] copying build/src/rdflib/plugins/sparql/update.py -> build/lib/rdflib/plugins/sparql
[2019-11-04T15:42:39.271Z] copying build/src/rdflib/plugins/sparql/compat.py -> build/lib/rdflib/plugins/sparql
[2019-11-04T15:42:39.271Z] copying build/src/rdflib/plugins/sparql/parserutils.py -> build/lib/rdflib/plugins/sparql
[2019-11-04T15:42:39.271Z] copying build/src/rdflib/plugins/sparql/sparql.py -> build/lib/rdflib/plugins/sparql
[2019-11-04T15:42:39.271Z] copying build/src/rdflib/plugins/sparql/parser.py -> build/lib/rdflib/plugins/sparql
[2019-11-04T15:42:39.271Z] copying build/src/rdflib/plugins/sparql/processor.py -> build/lib/rdflib/plugins/sparql
[2019-11-04T15:42:39.271Z] copying build/src/rdflib/plugins/sparql/algebra.py -> build/lib/rdflib/plugins/sparql
[2019-11-04T15:42:39.271Z] creating build/lib/rdflib/plugins/parsers/pyMicrodata
[2019-11-04T15:42:39.271Z] copying build/src/rdflib/plugins/parsers/pyMicrodata/utils.py -> build/lib/rdflib/plugins/parsers/pyMicrodata
[2019-11-04T15:42:39.271Z] copying build/src/rdflib/plugins/parsers/pyMicrodata/__init__.py -> build/lib/rdflib/plugins/parsers/pyMicrodata
[2019-11-04T15:42:39.271Z] copying build/src/rdflib/plugins/parsers/pyMicrodata/registry.py -> build/lib/rdflib/plugins/parsers/pyMicrodata
[2019-11-04T15:42:39.271Z] copying build/src/rdflib/plugins/parsers/pyMicrodata/microdata.py -> build/lib/rdflib/plugins/parsers/pyMicrodata
[2019-11-04T15:42:39.271Z] creating build/lib/rdflib/plugins/parsers/pyRdfa
[2019-11-04T15:42:39.271Z] copying build/src/rdflib/plugins/parsers/pyRdfa/termorcurie.py -> build/lib/rdflib/plugins/parsers/pyRdfa
[2019-11-04T15:42:39.271Z] copying build/src/rdflib/plugins/parsers/pyRdfa/initialcontext.py -> build/lib/rdflib/plugins/parsers/pyRdfa
[2019-11-04T15:42:39.271Z] copying build/src/rdflib/plugins/parsers/pyRdfa/utils.py -> build/lib/rdflib/plugins/parsers/pyRdfa
[2019-11-04T15:42:39.271Z] copying build/src/rdflib/plugins/parsers/pyRdfa/state.py -> build/lib/rdflib/plugins/parsers/pyRdfa
[2019-11-04T15:42:39.271Z] copying build/src/rdflib/plugins/parsers/pyRdfa/options.py -> build/lib/rdflib/plugins/parsers/pyRdfa
[2019-11-04T15:42:39.271Z] copying build/src/rdflib/plugins/parsers/pyRdfa/__init__.py -> build/lib/rdflib/plugins/parsers/pyRdfa
[2019-11-04T15:42:39.271Z] copying build/src/rdflib/plugins/parsers/pyRdfa/property.py -> build/lib/rdflib/plugins/parsers/pyRdfa
[2019-11-04T15:42:39.271Z] copying build/src/rdflib/plugins/parsers/pyRdfa/parse.py -> build/lib/rdflib/plugins/parsers/pyRdfa
[2019-11-04T15:42:39.271Z] copying build/src/rdflib/plugins/parsers/pyRdfa/embeddedRDF.py -> build/lib/rdflib/plugins/parsers/pyRdfa
[2019-11-04T15:42:39.271Z] creating build/lib/rdflib/plugins/parsers/pyRdfa/host
[2019-11-04T15:42:39.271Z] copying build/src/rdflib/plugins/parsers/pyRdfa/host/html5.py -> build/lib/rdflib/plugins/parsers/pyRdfa/host
[2019-11-04T15:42:39.271Z] copying build/src/rdflib/plugins/parsers/pyRdfa/host/atom.py -> build/lib/rdflib/plugins/parsers/pyRdfa/host
[2019-11-04T15:42:39.271Z] copying build/src/rdflib/plugins/parsers/pyRdfa/host/__init__.py -> build/lib/rdflib/plugins/parsers/pyRdfa/host
[2019-11-04T15:42:39.271Z] creating build/lib/rdflib/plugins/parsers/pyRdfa/rdfs
[2019-11-04T15:42:39.271Z] copying build/src/rdflib/plugins/parsers/pyRdfa/rdfs/process.py -> build/lib/rdflib/plugins/parsers/pyRdfa/rdfs
[2019-11-04T15:42:39.271Z] copying build/src/rdflib/plugins/parsers/pyRdfa/rdfs/cache.py -> build/lib/rdflib/plugins/parsers/pyRdfa/rdfs
[2019-11-04T15:42:39.271Z] copying build/src/rdflib/plugins/parsers/pyRdfa/rdfs/__init__.py -> build/lib/rdflib/plugins/parsers/pyRdfa/rdfs
[2019-11-04T15:42:39.271Z] creating build/lib/rdflib/plugins/parsers/pyRdfa/transform
[2019-11-04T15:42:39.271Z] copying build/src/rdflib/plugins/parsers/pyRdfa/transform/lite.py -> build/lib/rdflib/plugins/parsers/pyRdfa/transform
[2019-11-04T15:42:39.271Z] copying build/src/rdflib/plugins/parsers/pyRdfa/transform/OpenID.py -> build/lib/rdflib/plugins/parsers/pyRdfa/transform
[2019-11-04T15:42:39.271Z] copying build/src/rdflib/plugins/parsers/pyRdfa/transform/DublinCore.py -> build/lib/rdflib/plugins/parsers/pyRdfa/transform
[2019-11-04T15:42:39.271Z] copying build/src/rdflib/plugins/parsers/pyRdfa/transform/__init__.py -> build/lib/rdflib/plugins/parsers/pyRdfa/transform
[2019-11-04T15:42:39.271Z] copying build/src/rdflib/plugins/parsers/pyRdfa/transform/prototype.py -> build/lib/rdflib/plugins/parsers/pyRdfa/transform
[2019-11-04T15:42:39.271Z] copying build/src/rdflib/plugins/parsers/pyRdfa/transform/metaname.py -> build/lib/rdflib/plugins/parsers/pyRdfa/transform
[2019-11-04T15:42:39.271Z] creating build/lib/rdflib/plugins/parsers/pyRdfa/extras
[2019-11-04T15:42:39.271Z] copying build/src/rdflib/plugins/parsers/pyRdfa/extras/__init__.py -> build/lib/rdflib/plugins/parsers/pyRdfa/extras
[2019-11-04T15:42:39.272Z] copying build/src/rdflib/plugins/parsers/pyRdfa/extras/httpheader.py -> build/lib/rdflib/plugins/parsers/pyRdfa/extras
[2019-11-04T15:42:39.272Z] creating build/lib/rdflib/plugins/sparql/results
[2019-11-04T15:42:39.272Z] copying build/src/rdflib/plugins/sparql/results/csvresults.py -> build/lib/rdflib/plugins/sparql/results
[2019-11-04T15:42:39.272Z] copying build/src/rdflib/plugins/sparql/results/rdfresults.py -> build/lib/rdflib/plugins/sparql/results
[2019-11-04T15:42:39.272Z] copying build/src/rdflib/plugins/sparql/results/txtresults.py -> build/lib/rdflib/plugins/sparql/results
[2019-11-04T15:42:39.272Z] copying build/src/rdflib/plugins/sparql/results/tsvresults.py -> build/lib/rdflib/plugins/sparql/results
[2019-11-04T15:42:39.272Z] copying build/src/rdflib/plugins/sparql/results/jsonlayer.py -> build/lib/rdflib/plugins/sparql/results
[2019-11-04T15:42:39.272Z] copying build/src/rdflib/plugins/sparql/results/__init__.py -> build/lib/rdflib/plugins/sparql/results
[2019-11-04T15:42:39.272Z] copying build/src/rdflib/plugins/sparql/results/xmlresults.py -> build/lib/rdflib/plugins/sparql/results
[2019-11-04T15:42:39.272Z] copying build/src/rdflib/plugins/sparql/results/jsonresults.py -> build/lib/rdflib/plugins/sparql/results
[2019-11-04T15:42:39.272Z] ==> Starting check()...
[2019-11-04T15:42:39.272Z] /build/python-rdflib/src/RDFLib-rdflib-2fb94c8/build/src/rdflib/plugins/memory.py:354: SyntaxWarning: "is" with a literal. Did you mean "=="?
[2019-11-04T15:42:39.272Z]   if triple is None or triple is (None,None,None):
[2019-11-04T15:43:01.497Z] ...................................E........................SS..................................................SE................................................SS....................................................................................................................................................................................................................................................................................................................................S...S....SS..SSSSSSSSSSSS....SSSS...........SS..SSS.SSS..SSSSSSSSSSSSSSS............................................................................................................................SSSSSSS..........................................................................................................................................................................................................S........SSSSSSS..........SSSSSSSSSS..S.....................................SS...SS....................E........................................../build/python-rdflib/src/RDFLib-rdflib-2fb94c8/build/src/rdflib/term.py:1262: UserWarning: Serializing weird numerical rdflib.term.Literal('xy.z', datatype=rdflib.term.URIRef('http://www.w3.org/2001/XMLSchema#double'))
[2019-11-04T15:43:01.497Z]   warnings.warn("Serializing weird numerical %r" % self)
[2019-11-04T15:43:01.497Z] /build/python-rdflib/src/RDFLib-rdflib-2fb94c8/build/src/rdflib/term.py:1262: UserWarning: Serializing weird numerical rdflib.term.Literal('+1.0z', datatype=rdflib.term.URIRef('http://www.w3.org/2001/XMLSchema#double'))
[2019-11-04T15:43:01.497Z]   warnings.warn("Serializing weird numerical %r" % self)
[2019-11-04T15:43:01.748Z] .............................................../build/python-rdflib/src/RDFLib-rdflib-2fb94c8/build/src/rdflib/term.py:1262: UserWarning: Serializing weird numerical rdflib.term.Literal('ab.c', datatype=rdflib.term.URIRef('http://www.w3.org/2001/XMLSchema#double'))
[2019-11-04T15:43:01.748Z]   warnings.warn("Serializing weird numerical %r" % self)
[2019-11-04T15:43:02.248Z] ..................................................................................................................................................................................../build/python-rdflib/src/RDFLib-rdflib-2fb94c8/build/src/rdflib/plugins/serializers/rdfxml.py:255: UserWarning: Assertions on rdflib.term.BNode('N9fb1d71af1464aa280a824cfc6f610d6') other than RDF.first and RDF.rest are ignored ... including RDF.List
[2019-11-04T15:43:02.248Z]   self.predicate(predicate, object, depth + 1)
[2019-11-04T15:43:06.554Z] ...................................................................................................................................................................................................................................................................................................................................................................................................................................................................................................................................................................................................................SS.S.SSS....S.....SSSSS.....SSS...............S.........................................................................................................................................................................................................................................................................................................................................................................................................................................................................................................................................................................................................................................................................................................
[2019-11-04T15:43:06.554Z] ======================================================================
[2019-11-04T15:43:06.554Z] ERROR: Failure: Exception (SPARQLWrapper not found! SPARQL Store will not work.Install with 'easy_install SPARQLWrapper')
[2019-11-04T15:43:06.554Z] ----------------------------------------------------------------------
[2019-11-04T15:43:06.554Z] Traceback (most recent call last):
[2019-11-04T15:43:06.554Z]   File "/build/python-rdflib/src/RDFLib-rdflib-2fb94c8/build/src/rdflib/plugins/stores/sparqlstore.py", line 20, in <module>
[2019-11-04T15:43:06.554Z]     from SPARQLWrapper import SPARQLWrapper, XML, POST, GET, URLENCODED, POSTDIRECTLY
[2019-11-04T15:43:06.554Z] ModuleNotFoundError: No module named 'SPARQLWrapper'
[2019-11-04T15:43:06.554Z] 
[2019-11-04T15:43:06.554Z] During handling of the above exception, another exception occurred:
[2019-11-04T15:43:06.554Z] 
[2019-11-04T15:43:06.554Z] Traceback (most recent call last):
[2019-11-04T15:43:06.554Z]   File "/usr/lib/python3.8/site-packages/nose/failure.py", line 39, in runTest
[2019-11-04T15:43:06.554Z]     raise self.exc_val.with_traceback(self.tb)
[2019-11-04T15:43:06.554Z]   File "/usr/lib/python3.8/site-packages/nose/loader.py", line 416, in loadTestsFromName
[2019-11-04T15:43:06.554Z]     module = self.importer.importFromPath(
[2019-11-04T15:43:06.554Z]   File "/usr/lib/python3.8/site-packages/nose/importer.py", line 47, in importFromPath
[2019-11-04T15:43:06.554Z]     return self.importFromDir(dir_path, fqname)
[2019-11-04T15:43:06.554Z]   File "/usr/lib/python3.8/site-packages/nose/importer.py", line 94, in importFromDir
[2019-11-04T15:43:06.554Z]     mod = load_module(part_fqname, fh, filename, desc)
[2019-11-04T15:43:06.554Z]   File "/usr/lib/python3.8/imp.py", line 234, in load_module
[2019-11-04T15:43:06.554Z]     return load_source(name, filename, file)
[2019-11-04T15:43:06.554Z]   File "/usr/lib/python3.8/imp.py", line 171, in load_source
[2019-11-04T15:43:06.554Z]     module = _load(spec)
[2019-11-04T15:43:06.554Z]   File "<frozen importlib._bootstrap>", line 702, in _load
[2019-11-04T15:43:06.554Z]   File "<frozen importlib._bootstrap>", line 671, in _load_unlocked
[2019-11-04T15:43:06.554Z]   File "<frozen importlib._bootstrap_external>", line 783, in exec_module
[2019-11-04T15:43:06.554Z]   File "<frozen importlib._bootstrap>", line 219, in _call_with_frames_removed
[2019-11-04T15:43:06.554Z]   File "/build/python-rdflib/src/RDFLib-rdflib-2fb94c8/build/src/rdflib/plugins/stores/sparqlstore.py", line 22, in <module>
[2019-11-04T15:43:06.554Z]     raise Exception(
[2019-11-04T15:43:06.554Z] Exception: SPARQLWrapper not found! SPARQL Store will not work.Install with 'easy_install SPARQLWrapper'
[2019-11-04T15:43:06.554Z] 
[2019-11-04T15:43:06.554Z] ======================================================================
[2019-11-04T15:43:06.554Z] ERROR: Failure: Exception (SPARQLWrapper not found! SPARQL Store will not work.Install with 'easy_install SPARQLWrapper')
[2019-11-04T15:43:06.554Z] ----------------------------------------------------------------------
[2019-11-04T15:43:06.554Z] Traceback (most recent call last):
[2019-11-04T15:43:06.554Z]   File "/build/python-rdflib/src/RDFLib-rdflib-2fb94c8/build/src/rdflib/plugins/stores/sparqlstore.py", line 20, in <module>
[2019-11-04T15:43:06.554Z]     from SPARQLWrapper import SPARQLWrapper, XML, POST, GET, URLENCODED, POSTDIRECTLY
[2019-11-04T15:43:06.554Z] ModuleNotFoundError: No module named 'SPARQLWrapper'
[2019-11-04T15:43:06.554Z] 
[2019-11-04T15:43:06.554Z] During handling of the above exception, another exception occurred:
[2019-11-04T15:43:06.554Z] 
[2019-11-04T15:43:06.554Z] Traceback (most recent call last):
[2019-11-04T15:43:06.554Z]   File "/usr/lib/python3.8/site-packages/nose/failure.py", line 39, in runTest
[2019-11-04T15:43:06.554Z]     raise self.exc_val.with_traceback(self.tb)
[2019-11-04T15:43:06.554Z]   File "/usr/lib/python3.8/site-packages/nose/loader.py", line 416, in loadTestsFromName
[2019-11-04T15:43:06.554Z]     module = self.importer.importFromPath(
[2019-11-04T15:43:06.554Z]   File "/usr/lib/python3.8/site-packages/nose/importer.py", line 47, in importFromPath
[2019-11-04T15:43:06.554Z]     return self.importFromDir(dir_path, fqname)
[2019-11-04T15:43:06.554Z]   File "/usr/lib/python3.8/site-packages/nose/importer.py", line 94, in importFromDir
[2019-11-04T15:43:06.554Z]     mod = load_module(part_fqname, fh, filename, desc)
[2019-11-04T15:43:06.554Z]   File "/usr/lib/python3.8/imp.py", line 234, in load_module
[2019-11-04T15:43:06.554Z]     return load_source(name, filename, file)
[2019-11-04T15:43:06.554Z]   File "/usr/lib/python3.8/imp.py", line 171, in load_source
[2019-11-04T15:43:06.554Z]     module = _load(spec)
[2019-11-04T15:43:06.554Z]   File "<frozen importlib._bootstrap>", line 702, in _load
[2019-11-04T15:43:06.554Z]   File "<frozen importlib._bootstrap>", line 671, in _load_unlocked
[2019-11-04T15:43:06.554Z]   File "<frozen importlib._bootstrap_external>", line 783, in exec_module
[2019-11-04T15:43:06.554Z]   File "<frozen importlib._bootstrap>", line 219, in _call_with_frames_removed
[2019-11-04T15:43:06.554Z]   File "/build/python-rdflib/src/RDFLib-rdflib-2fb94c8/build/src/test/test_dataset.py", line 172, in <module>
[2019-11-04T15:43:06.554Z]     if not s.getClass().graph_aware:
[2019-11-04T15:43:06.554Z]   File "/build/python-rdflib/src/RDFLib-rdflib-2fb94c8/build/src/rdflib/plugin.py", line 66, in getClass
[2019-11-04T15:43:06.554Z]     module = __import__(self.module_path, globals(), locals(), [""])
[2019-11-04T15:43:06.554Z]   File "/build/python-rdflib/src/RDFLib-rdflib-2fb94c8/build/src/rdflib/plugins/stores/sparqlstore.py", line 22, in <module>
[2019-11-04T15:43:06.554Z]     raise Exception(
[2019-11-04T15:43:06.554Z] Exception: SPARQLWrapper not found! SPARQL Store will not work.Install with 'easy_install SPARQLWrapper'
[2019-11-04T15:43:06.554Z] 
[2019-11-04T15:43:06.554Z] ======================================================================
[2019-11-04T15:43:06.554Z] ERROR: Failure: Exception (SPARQLWrapper not found! SPARQL Store will not work.Install with 'easy_install SPARQLWrapper')
[2019-11-04T15:43:06.554Z] ----------------------------------------------------------------------
[2019-11-04T15:43:06.554Z] Traceback (most recent call last):
[2019-11-04T15:43:06.554Z]   File "/build/python-rdflib/src/RDFLib-rdflib-2fb94c8/build/src/rdflib/plugins/stores/sparqlstore.py", line 20, in <module>
[2019-11-04T15:43:06.554Z]     from SPARQLWrapper import SPARQLWrapper, XML, POST, GET, URLENCODED, POSTDIRECTLY
[2019-11-04T15:43:06.554Z] ModuleNotFoundError: No module named 'SPARQLWrapper'
[2019-11-04T15:43:06.554Z] 
[2019-11-04T15:43:06.554Z] During handling of the above exception, another exception occurred:
[2019-11-04T15:43:06.554Z] 
[2019-11-04T15:43:06.554Z] Traceback (most recent call last):
[2019-11-04T15:43:06.555Z]   File "/usr/lib/python3.8/site-packages/nose/failure.py", line 39, in runTest
[2019-11-04T15:43:06.555Z]     raise self.exc_val.with_traceback(self.tb)
[2019-11-04T15:43:06.555Z]   File "/usr/lib/python3.8/site-packages/nose/loader.py", line 416, in loadTestsFromName
[2019-11-04T15:43:06.555Z]     module = self.importer.importFromPath(
[2019-11-04T15:43:06.555Z]   File "/usr/lib/python3.8/site-packages/nose/importer.py", line 47, in importFromPath
[2019-11-04T15:43:06.555Z]     return self.importFromDir(dir_path, fqname)
[2019-11-04T15:43:06.555Z]   File "/usr/lib/python3.8/site-packages/nose/importer.py", line 94, in importFromDir
[2019-11-04T15:43:06.555Z]     mod = load_module(part_fqname, fh, filename, desc)
[2019-11-04T15:43:06.555Z]   File "/usr/lib/python3.8/imp.py", line 234, in load_module
[2019-11-04T15:43:06.555Z]     return load_source(name, filename, file)
[2019-11-04T15:43:06.555Z]   File "/usr/lib/python3.8/imp.py", line 171, in load_source
[2019-11-04T15:43:06.555Z]     module = _load(spec)
[2019-11-04T15:43:06.555Z]   File "<frozen importlib._bootstrap>", line 702, in _load
[2019-11-04T15:43:06.555Z]   File "<frozen importlib._bootstrap>", line 671, in _load_unlocked
[2019-11-04T15:43:06.555Z]   File "<frozen importlib._bootstrap_external>", line 783, in exec_module
[2019-11-04T15:43:06.555Z]   File "<frozen importlib._bootstrap>", line 219, in _call_with_frames_removed
[2019-11-04T15:43:06.555Z]   File "/build/python-rdflib/src/RDFLib-rdflib-2fb94c8/build/src/test/test_issue457.py", line 7, in <module>
[2019-11-04T15:43:06.555Z]     from rdflib.plugins.stores.sparqlstore import _node_from_result
[2019-11-04T15:43:06.555Z]   File "/build/python-rdflib/src/RDFLib-rdflib-2fb94c8/build/src/rdflib/plugins/stores/sparqlstore.py", line 22, in <module>
[2019-11-04T15:43:06.555Z]     raise Exception(
[2019-11-04T15:43:06.555Z] Exception: SPARQLWrapper not found! SPARQL Store will not work.Install with 'easy_install SPARQLWrapper'
[2019-11-04T15:43:06.555Z] 
[2019-11-04T15:43:06.555Z] ----------------------------------------------------------------------
[2019-11-04T15:43:06.555Z] Ran 2589 tests in 28.635s
[2019-11-04T15:43:06.555Z] 
[2019-11-04T15:43:06.555Z] FAILED (SKIP=94, errors=3)
[2019-11-04T15:43:06.805Z] ==> ERROR: A failure occurred in check().
[2019-11-04T15:43:06.805Z]     Aborting...
[2019-11-04T15:43:07.356Z] ==> ERROR: Build failed, check /build/buildpkg/goblins-x86_64/jenkins/build
[Pipeline] }
[Pipeline] // dir
Post stage
[Pipeline] emailext
[2019-11-04T15:43:07.436Z] Sending email to: artix-build-failures at artixlinux.org


More information about the artix-build-failures mailing list