[artix-build-failures] [galaxy-goblins] Failure: python-tzlocal

jenkins at artixlinux.org jenkins at artixlinux.org
Fri Nov 1 17:30:26 CET 2019


   Failure

   Build: repos/community-staging-any

   Packages:

   [python-tzlocal-2.0.0-3-any.pkg.tar.xz,
   python2-tzlocal-2.0.0-3-any.pkg.tar.xz]

   authorName: alium

   authorEmail: alium at artixlinux.org

   [1]https://orion.artixlinux.org/job/packagesPython/job/python-tzlocal/j
   ob/master/4/

References

   1. https://orion.artixlinux.org/job/packagesPython/job/python-tzlocal/job/master/4/
-------------- next part --------------
Push event to branch master
Querying the current revision of branch master...
Current revision of branch master is fa4f0676a8e734fbb77878af89b552fdaf2efc18
Obtained Jenkinsfile from fa4f0676a8e734fbb77878af89b552fdaf2efc18
Running in Durability level: PERFORMANCE_OPTIMIZED
Loading library artix-ci at master
Attempting to resolve master from remote references...
 > git --version # timeout=10
 > git ls-remote -- https://gitea.artixlinux.org/artix/pipeline-libs.git # timeout=10
Found match: refs/heads/master revision 77f77ff85eedb6eb60b64faf8c328ab86dbb479c
Warning: CredentialId "gitea-ci" could not be found.
 > git rev-parse --is-inside-work-tree # timeout=10
Fetching changes from the remote Git repository
 > git config remote.origin.url https://gitea.artixlinux.org/artix/pipeline-libs.git # timeout=10
Fetching without tags
Fetching upstream changes from https://gitea.artixlinux.org/artix/pipeline-libs.git
 > git --version # timeout=10
 > git fetch --no-tags --force --progress -- https://gitea.artixlinux.org/artix/pipeline-libs.git +refs/heads/master:refs/remotes/origin/master
Checking out Revision 77f77ff85eedb6eb60b64faf8c328ab86dbb479c (master)
 > git config core.sparsecheckout # timeout=10
 > git checkout -f 77f77ff85eedb6eb60b64faf8c328ab86dbb479c
Commit message: "Notify: remove fail condition"
[Gitea] Notifying branch build status: PENDING Build started...
[Gitea] Notified
[Pipeline] Start of Pipeline
[Pipeline] node
Running on Jenkins in /build/jenkins/workspace/agesPython_python-tzlocal_master
[Pipeline] {
[Pipeline] timestamps
[Pipeline] {
[Pipeline] stage
[Pipeline] { (Prepare)
[Pipeline] checkout
[2019-11-01T16:30:07.666Z] Warning: CredentialId "jenkins-ci" could not be found.
[2019-11-01T16:30:07.666Z]  > git rev-parse --is-inside-work-tree # timeout=10
[2019-11-01T16:30:07.673Z] Fetching changes from the remote Git repository
[2019-11-01T16:30:07.673Z]  > git config remote.origin.url https://237b7412742b4068af4173944de150f12959f4d3@gitea.artixlinux.org/packagesPython/python-tzlocal.git # timeout=10
[2019-11-01T16:30:07.678Z] Cleaning workspace
[2019-11-01T16:30:07.679Z]  > git rev-parse --verify HEAD # timeout=10
[2019-11-01T16:30:07.684Z] Resetting working tree
[2019-11-01T16:30:07.684Z]  > git reset --hard # timeout=10
[2019-11-01T16:30:07.692Z]  > git clean -fdx # timeout=10
[2019-11-01T16:30:07.695Z] Fetching without tags
[2019-11-01T16:30:07.695Z] Fetching upstream changes from https://237b7412742b4068af4173944de150f12959f4d3@gitea.artixlinux.org/packagesPython/python-tzlocal.git
[2019-11-01T16:30:07.695Z]  > git --version # timeout=10
[2019-11-01T16:30:07.698Z]  > git fetch --no-tags --force --progress -- https://237b7412742b4068af4173944de150f12959f4d3@gitea.artixlinux.org/packagesPython/python-tzlocal.git +refs/heads/master:refs/remotes/origin/master
[2019-11-01T16:30:07.981Z] Checking out Revision fa4f0676a8e734fbb77878af89b552fdaf2efc18 (master)
[2019-11-01T16:30:07.981Z]  > git config core.sparsecheckout # timeout=10
[2019-11-01T16:30:07.986Z]  > git checkout -f fa4f0676a8e734fbb77878af89b552fdaf2efc18
[2019-11-01T16:30:07.995Z] Commit message: "[trunk] -> [community-staging] 'python-tzlocal-2.0.0-3' add"
[2019-11-01T16:30:07.995Z]  > git rev-list --no-walk 7e75dad26240f4d1d55b3c69079500c2293a6e4f # timeout=10
[2019-11-01T16:30:08.006Z] [Gitea] Notifying branch build status: PENDING Build started...
[2019-11-01T16:30:08.151Z] [Gitea] Notified
[Pipeline] libraryResource
[Pipeline] readYaml
[Pipeline] sh
[2019-11-01T16:30:08.419Z] + git rev-parse @
[Pipeline] sh
[2019-11-01T16:30:08.675Z] + git show -s --format=%an fa4f0676a8e734fbb77878af89b552fdaf2efc18
[Pipeline] sh
[2019-11-01T16:30:08.931Z] + git show -s --format=%ae fa4f0676a8e734fbb77878af89b552fdaf2efc18
[Pipeline] sh
[2019-11-01T16:30:09.187Z] + git show --pretty=format: --name-status fa4f0676a8e734fbb77878af89b552fdaf2efc18
[Pipeline] fileExists
[Pipeline] sh
[2019-11-01T16:30:09.449Z] + pkg2yaml repos/community-staging-any
[Pipeline] readYaml
[Pipeline] }
[Pipeline] // stage
[Pipeline] stage
[Pipeline] { (Build)
[Pipeline] echo
[2019-11-01T16:30:09.537Z] isRebuild: false
[Pipeline] dir
[2019-11-01T16:30:09.541Z] Running in /build/jenkins/workspace/agesPython_python-tzlocal_master/repos/community-staging-any
[Pipeline] {
[Pipeline] sh
[2019-11-01T16:30:09.801Z] + buildpkg-galaxy-goblins
[2019-11-01T16:30:11.662Z] :: Synchronizing package databases...
[2019-11-01T16:30:11.662Z]  goblins is up to date
[2019-11-01T16:30:11.662Z]  gremlins is up to date
[2019-11-01T16:30:11.662Z]  system is up to date
[2019-11-01T16:30:11.662Z]  world is up to date
[2019-11-01T16:30:11.662Z] downloading galaxy-goblins.db...
[2019-11-01T16:30:11.662Z]  galaxy-gremlins is up to date
[2019-11-01T16:30:11.662Z]  galaxy is up to date
[2019-11-01T16:30:11.662Z]  staging is up to date
[2019-11-01T16:30:11.662Z]  testing is up to date
[2019-11-01T16:30:11.662Z]  extra is up to date
[2019-11-01T16:30:11.662Z]  community-staging is up to date
[2019-11-01T16:30:11.662Z]  community-testing is up to date
[2019-11-01T16:30:11.662Z]  community is up to date
[2019-11-01T16:30:11.662Z] :: Starting full system upgrade...
[2019-11-01T16:30:11.662Z]  there is nothing to do
[2019-11-01T16:30:12.213Z] ==> Building in chroot for [goblins] (x86_64)...
[2019-11-01T16:30:13.124Z] ==> Synchronizing chroot copy [/build/buildpkg/goblins-x86_64/root] -> [jenkins]...done
[2019-11-01T16:30:13.124Z] ==> WARNING: PACKAGER should have the format 'Example Name <email at address.invalid>'
[2019-11-01T16:30:14.467Z] ==> Making package: python-tzlocal 2.0.0-3 (Fri Nov  1 17:30:14 2019)
[2019-11-01T16:30:14.467Z] ==> Retrieving sources...
[2019-11-01T16:30:14.467Z]   -> Found tzlocal-2.0.0.tar.gz
[2019-11-01T16:30:14.467Z] ==> Validating source files with sha512sums...
[2019-11-01T16:30:14.467Z]     tzlocal-2.0.0.tar.gz ... Passed
[2019-11-01T16:30:18.589Z] ==> Making package: python-tzlocal 2.0.0-3 (Fri 01 Nov 2019 04:30:17 PM UTC)
[2019-11-01T16:30:18.589Z] ==> Checking runtime dependencies...
[2019-11-01T16:30:18.589Z] ==> Checking buildtime dependencies...
[2019-11-01T16:30:18.589Z] ==> Installing missing dependencies...
[2019-11-01T16:30:18.589Z] resolving dependencies...
[2019-11-01T16:30:18.589Z] looking for conflicting packages...
[2019-11-01T16:30:18.589Z] 
[2019-11-01T16:30:18.589Z] Package (20)                 New Version  Net Change
[2019-11-01T16:30:18.589Z] 
[2019-11-01T16:30:18.589Z] system/libnsl                1.2.0-1        0.21 MiB
[2019-11-01T16:30:18.589Z] goblins/python               3.8.0-1      151.60 MiB
[2019-11-01T16:30:18.589Z] goblins/python-appdirs       1.4.3-5        0.07 MiB
[2019-11-01T16:30:18.589Z] goblins/python-packaging     19.2-5         0.14 MiB
[2019-11-01T16:30:18.589Z] galaxy-goblins/python-pbr    5.4.3-3        0.64 MiB
[2019-11-01T16:30:18.589Z] goblins/python-pyparsing     2.4.2-4        0.70 MiB
[2019-11-01T16:30:18.589Z] goblins/python-six           1.12.0-4       0.08 MiB
[2019-11-01T16:30:18.589Z] world/python2                2.7.17-1      75.38 MiB
[2019-11-01T16:30:18.589Z] goblins/python2-appdirs      1.4.3-5        0.08 MiB
[2019-11-01T16:30:18.589Z] galaxy/python2-funcsigs      1.0.2-2        0.12 MiB
[2019-11-01T16:30:18.589Z] goblins/python2-packaging    19.2-5         0.15 MiB
[2019-11-01T16:30:18.589Z] galaxy-goblins/python2-pbr   5.4.3-3        0.72 MiB
[2019-11-01T16:30:18.589Z] goblins/python2-pyparsing    2.4.2-4        0.76 MiB
[2019-11-01T16:30:18.589Z] goblins/python2-six          1.12.0-4       0.10 MiB
[2019-11-01T16:30:18.589Z] galaxy-goblins/python-mock   3.0.5-3        0.21 MiB
[2019-11-01T16:30:18.589Z] galaxy-goblins/python-pytz   2019.3-3       0.95 MiB
[2019-11-01T16:30:18.589Z] goblins/python-setuptools    1:41.2.0-5     1.54 MiB
[2019-11-01T16:30:18.589Z] galaxy-goblins/python2-mock  3.0.5-3        0.24 MiB
[2019-11-01T16:30:18.589Z] galaxy-goblins/python2-pytz  2019.3-3       0.96 MiB
[2019-11-01T16:30:18.589Z] goblins/python2-setuptools   1:41.2.0-5     1.75 MiB
[2019-11-01T16:30:18.589Z] 
[2019-11-01T16:30:18.589Z] Total Installed Size:  236.42 MiB
[2019-11-01T16:30:18.589Z] 
[2019-11-01T16:30:18.589Z] :: Proceed with installation? [Y/n] 
[2019-11-01T16:30:18.589Z] checking keyring...
[2019-11-01T16:30:18.589Z] checking package integrity...
[2019-11-01T16:30:19.499Z] loading package files...
[2019-11-01T16:30:19.499Z] checking for file conflicts...
[2019-11-01T16:30:19.499Z] checking available disk space...
[2019-11-01T16:30:19.499Z] :: Processing package changes...
[2019-11-01T16:30:19.499Z] installing libnsl...
[2019-11-01T16:30:19.499Z] installing python...
[2019-11-01T16:30:23.621Z] Optional dependencies for python
[2019-11-01T16:30:23.621Z]     python-setuptools [pending]
[2019-11-01T16:30:23.621Z]     python-pip
[2019-11-01T16:30:23.621Z]     sqlite [installed]
[2019-11-01T16:30:23.621Z]     mpdecimal: for decimal
[2019-11-01T16:30:23.621Z]     xz: for lzma [installed]
[2019-11-01T16:30:23.621Z]     tk: for tkinter
[2019-11-01T16:30:23.621Z] installing python-pytz...
[2019-11-01T16:30:23.621Z] installing python-appdirs...
[2019-11-01T16:30:23.621Z] installing python-pyparsing...
[2019-11-01T16:30:23.621Z] installing python-six...
[2019-11-01T16:30:23.621Z] installing python-packaging...
[2019-11-01T16:30:23.621Z] installing python-setuptools...
[2019-11-01T16:30:23.621Z] installing python2...
[2019-11-01T16:30:24.531Z] Optional dependencies for python2
[2019-11-01T16:30:24.531Z]     tk: for IDLE
[2019-11-01T16:30:24.532Z]     python2-setuptools [pending]
[2019-11-01T16:30:24.532Z]     python2-pip
[2019-11-01T16:30:24.532Z] installing python2-pytz...
[2019-11-01T16:30:24.532Z] installing python2-appdirs...
[2019-11-01T16:30:24.532Z] installing python2-pyparsing...
[2019-11-01T16:30:24.532Z] installing python2-six...
[2019-11-01T16:30:24.532Z] installing python2-packaging...
[2019-11-01T16:30:24.532Z] installing python2-setuptools...
[2019-11-01T16:30:24.532Z] installing python-pbr...
[2019-11-01T16:30:24.532Z] installing python-mock...
[2019-11-01T16:30:24.532Z] installing python2-pbr...
[2019-11-01T16:30:24.532Z] installing python2-funcsigs...
[2019-11-01T16:30:24.532Z] installing python2-mock...
[2019-11-01T16:30:24.782Z] ==> Retrieving sources...
[2019-11-01T16:30:24.782Z]   -> Found tzlocal-2.0.0.tar.gz
[2019-11-01T16:30:24.782Z] ==> WARNING: Skipping all source file integrity checks.
[2019-11-01T16:30:24.782Z] ==> Extracting sources...
[2019-11-01T16:30:24.782Z]   -> Extracting tzlocal-2.0.0.tar.gz with bsdtar
[2019-11-01T16:30:24.782Z] ==> Starting prepare()...
[2019-11-01T16:30:24.782Z] renamed 'tzlocal-2.0.0' -> 'python-tzlocal-2.0.0'
[2019-11-01T16:30:24.782Z] 'localtime' -> '../usr/share/zoneinfo/Africa/Harare'
[2019-11-01T16:30:24.782Z] ==> Starting build()...
[2019-11-01T16:30:24.782Z] running build
[2019-11-01T16:30:25.032Z] running build_py
[2019-11-01T16:30:25.032Z] creating build
[2019-11-01T16:30:25.032Z] creating build/lib
[2019-11-01T16:30:25.032Z] creating build/lib/tzlocal
[2019-11-01T16:30:25.032Z] copying tzlocal/unix.py -> build/lib/tzlocal
[2019-11-01T16:30:25.032Z] copying tzlocal/utils.py -> build/lib/tzlocal
[2019-11-01T16:30:25.032Z] copying tzlocal/__init__.py -> build/lib/tzlocal
[2019-11-01T16:30:25.032Z] copying tzlocal/windows_tz.py -> build/lib/tzlocal
[2019-11-01T16:30:25.032Z] copying tzlocal/win32.py -> build/lib/tzlocal
[2019-11-01T16:30:25.032Z] running egg_info
[2019-11-01T16:30:25.032Z] writing tzlocal.egg-info/PKG-INFO
[2019-11-01T16:30:25.032Z] writing dependency_links to tzlocal.egg-info/dependency_links.txt
[2019-11-01T16:30:25.032Z] writing requirements to tzlocal.egg-info/requires.txt
[2019-11-01T16:30:25.032Z] writing top-level names to tzlocal.egg-info/top_level.txt
[2019-11-01T16:30:25.032Z] reading manifest file 'tzlocal.egg-info/SOURCES.txt'
[2019-11-01T16:30:25.032Z] reading manifest template 'MANIFEST.in'
[2019-11-01T16:30:25.032Z] writing manifest file 'tzlocal.egg-info/SOURCES.txt'
[2019-11-01T16:30:25.282Z] running build
[2019-11-01T16:30:25.282Z] running build_py
[2019-11-01T16:30:25.282Z] running egg_info
[2019-11-01T16:30:25.282Z] writing requirements to tzlocal.egg-info/requires.txt
[2019-11-01T16:30:25.282Z] writing tzlocal.egg-info/PKG-INFO
[2019-11-01T16:30:25.282Z] writing top-level names to tzlocal.egg-info/top_level.txt
[2019-11-01T16:30:25.282Z] writing dependency_links to tzlocal.egg-info/dependency_links.txt
[2019-11-01T16:30:25.282Z] reading manifest file 'tzlocal.egg-info/SOURCES.txt'
[2019-11-01T16:30:25.282Z] reading manifest template 'MANIFEST.in'
[2019-11-01T16:30:25.282Z] writing manifest file 'tzlocal.egg-info/SOURCES.txt'
[2019-11-01T16:30:25.282Z] ==> Starting check()...
[2019-11-01T16:30:25.533Z] running test
[2019-11-01T16:30:25.533Z] running egg_info
[2019-11-01T16:30:25.533Z] writing tzlocal.egg-info/PKG-INFO
[2019-11-01T16:30:25.533Z] writing dependency_links to tzlocal.egg-info/dependency_links.txt
[2019-11-01T16:30:25.533Z] writing requirements to tzlocal.egg-info/requires.txt
[2019-11-01T16:30:25.533Z] writing top-level names to tzlocal.egg-info/top_level.txt
[2019-11-01T16:30:25.533Z] reading manifest file 'tzlocal.egg-info/SOURCES.txt'
[2019-11-01T16:30:25.533Z] reading manifest template 'MANIFEST.in'
[2019-11-01T16:30:25.533Z] writing manifest file 'tzlocal.egg-info/SOURCES.txt'
[2019-11-01T16:30:25.533Z] running build_ext
[2019-11-01T16:30:25.533Z] /build/python-tzlocal/src/python-tzlocal-2.0.0/tzlocal/unix.py:141: SyntaxWarning: "is not" with a literal. Did you mean "!="?
[2019-11-01T16:30:25.533Z]   while start is not 0:
[2019-11-01T16:30:25.533Z] test_assert_tz_offset (tests.tests.TzLocalTests) ... /build/python-tzlocal/src/python-tzlocal-2.0.0/tzlocal/unix.py:158: UserWarning: Can not find any timezone configuration, defaulting to UTC.
[2019-11-01T16:30:25.533Z]   warnings.warn('Can not find any timezone configuration, defaulting to UTC.')
[2019-11-01T16:30:25.533Z] ok
[2019-11-01T16:30:25.533Z] test_env (tests.tests.TzLocalTests) ... ok
[2019-11-01T16:30:25.533Z] test_fail (tests.tests.TzLocalTests) ... FAIL
[2019-11-01T16:30:25.533Z] test_get_reload (tests.tests.TzLocalTests) ... ok
[2019-11-01T16:30:25.533Z] test_only_localtime (tests.tests.TzLocalTests) ... ok
[2019-11-01T16:30:25.783Z] test_symlink_localtime (tests.tests.TzLocalTests) ... ok
[2019-11-01T16:30:25.783Z] test_timezone (tests.tests.TzLocalTests) ... ok
[2019-11-01T16:30:25.783Z] test_timezone_setting (tests.tests.TzLocalTests) ... ok
[2019-11-01T16:30:25.783Z] test_timezone_top_line_comment (tests.tests.TzLocalTests) ... ok
[2019-11-01T16:30:25.783Z] test_vardbzoneinfo_setting (tests.tests.TzLocalTests) ... ok
[2019-11-01T16:30:25.783Z] test_zone_setting (tests.tests.TzLocalTests) ... ok
[2019-11-01T16:30:25.783Z] test_win32_on_unix (tests.tests.TzWin32Tests) ... ok
[2019-11-01T16:30:25.783Z] 
[2019-11-01T16:30:25.783Z] ======================================================================
[2019-11-01T16:30:25.783Z] FAIL: test_fail (tests.tests.TzLocalTests)
[2019-11-01T16:30:25.783Z] ----------------------------------------------------------------------
[2019-11-01T16:30:25.783Z] Traceback (most recent call last):
[2019-11-01T16:30:25.783Z]   File "/build/python-tzlocal/src/python-tzlocal-2.0.0/tests/tests.py", line 116, in test_fail
[2019-11-01T16:30:25.783Z]     self.assertIn('Can not find any timezone configuration',
[2019-11-01T16:30:25.783Z] AssertionError: 'Can not find any timezone configuration' not found in ''
[2019-11-01T16:30:25.783Z] 
[2019-11-01T16:30:25.783Z] ----------------------------------------------------------------------
[2019-11-01T16:30:25.783Z] Ran 12 tests in 0.025s
[2019-11-01T16:30:25.783Z] 
[2019-11-01T16:30:25.783Z] FAILED (failures=1)
[2019-11-01T16:30:25.783Z] Test failed: <unittest.runner.TextTestResult run=12 errors=0 failures=1>
[2019-11-01T16:30:25.783Z] error: Test failed: <unittest.runner.TextTestResult run=12 errors=0 failures=1>
[2019-11-01T16:30:25.783Z] ==> ERROR: A failure occurred in check().
[2019-11-01T16:30:25.783Z]     Aborting...
[2019-11-01T16:30:26.333Z] ==> ERROR: Build failed, check /build/buildpkg/goblins-x86_64/jenkins/build
[Pipeline] }
[Pipeline] // dir
Post stage
[Pipeline] emailext
[2019-11-01T16:30:26.408Z] Sending email to: artix-build-failures at artixlinux.org


More information about the artix-build-failures mailing list